{"text_format":"1","workbook":"xlsx","n_sheets":12,"sheets":["Mode Op","Inscription","PRIX D EQUIPE","ENG Dep","EMARGEMENT","CLASSEMENT","CLASS INTERNET","FEUILLE RESULTATS","ETAT RESULT","ETAT RES VERSO","rapport jury","Feuil1"],"not_rendered":{"charts":0,"images":1,"macros":1,"external_links":0,"defined_names":46,"comments":1,"pivot_tables":0},"unopened":[],"bounds":{"document_bytes":16777216,"sheet_cells":100000,"rows_first":2000,"rows_last":500,"rows_between":2000,"halvings":0,"cell_chars":16384,"cell_head_chars":4096},"cells_cut":0,"cells_raw":0,"read":"whole","date_system":"1900"}

{"sheet":"Mode Op","index":0,"n_rows":19,"n_cols":1,"rows_kept":19,"cut":false,"hidden":false,"merged":[]}
["MODE OPERATOIRE FEUILLE DE CLASSEMENT"]
[]
[]
["-                    Améliorations : La moyenne des ex-æquo se calcule automatiquement. Les temps des coureurs figurent sur les feuilles de résultats avec les écarts. Les en-têtes des feuillets « Engagements sur place », « Etats de résultats », « Rapport du Prés. du Jury » se complètent automatiquement. Sur le verso de l’état de résultats, en portant le n° de dossard du coureur pénalisé, son nom, son club, et son n° de licence sont inscrits (dans le cas où le Commissaire est équipé d’une imprimante sur le lieu de la course)."]
["----------"]
["-               Feuillet « INSCRIPTION ». Remplir le feuillet inscription . Pour la distance, remplir la case « circuit de » et «  à parcourir ». Dans le cas d’une course en ligne, distance totale x 1. Ajouter les engagés sur place en respectant l’appellation du club si celui-ci est au Prix d’équipe."]
["-               Feuillet « PRIX D EQUIPE » :  Pour le nom des clubs, faire un « copier-coller » entre le nom entré au premier coureur de l’équipe et les autres coureurs du même club, puis  avec le feuillet « prix d’équipe », si le club est inscrit. Attention, le nom du club doit être strictement le même que celui du feuillet prix d’équipe. Si un coureur est ajouté (engagement sur place) et que d’autres coureurs du même club sont déjà engagés : copier-coller le nom du club. Si un club se rajoute au prix d’équipe, même chose (copier-coller avec feuillet prix d’équipe). Le prix d’équipe ne peut se calculer que si cette procédure est respectée."]
["-               Feuillet « Eng. Sur place » : Porter simplement le numéro du dossard qui correspond à la feuille « inscription », le reste se remplit automatiquement."]
["-               Sur le feuillet « INSCRIPTION », mettre d’office « X » dans la colonne des présents, il suffira de les enlever si les coureurs sont non - partants. Il est possible de mettre EXC. Si les coureurs sont excusés (le nombre de partants n’est comptabilisé qu’à partir des « X »."]
["-               Pour éditer les feuilles, définir la zone d’impression pour éviter d’imprimer les 5 pages.  "]
["-               Feuillet « Emargement » : définir la zone d’impression en s’arrêtant à un bas de page."]
["-               Une fois la course terminée et le classement fait, aller sur le feuillet « classement », saisir seulement les numéros des dossards et le temps du 1er et des autres s’il y a lieu (çà permet de calculer la moyenne de la course). S’il y a des ex-æquo, remplacer, pour tous les coureurs ex-æquo,  les places de la  colonne B par la place du 1er ex-æquo. La moyenne du « trou » se calcule automatiquement. Si un coureur est déjà classé, son numéro apparaît dans la colonne K surligné en jaune. Cliquer sur le rectangle  «prix d’équipe 2 hommes» ou « prix d’équipe 3 hommes » (au temps ou à la place) selon la catégorie de course."]
["-               Il n’y a plus qu’à éditer la feuille de résultats (format A4). Celle-ci est protégée car il n’y a rien à modifier. Dans le cas contraire, il suffit d’ôter la protection."]
["-               Le dernier feuillet (Internet), sert à envoyer les résultats pour mise en ligne sur le site FSGT 29. On peut enlever des lignes, ou en ajouter en insérant des lignes entre la dernière actuelle et le prix d’équipe, puis en faisant une recopie vers le bas de la dernière ligne (qui contient la formule en liaison avec la feuille de classement)."]
["En résumé : bien remplir la liste des engagés, le feuillet prix d’équipe par un copier-coller, et le feuillet classement (colonnes surlignées en vert)."]
[]
["Pour réutiliser le programme, il vaut mieux utiliser un programme vierge (ne pas oublier de l’enregistrer sous un autre nom)."]
[]
["ATTENTION : beaucoup de cellules contiennent des formules. Ne pas supprimer de lignes ou de colonnes, et ne pas modifier les cellules contenant les formules (sauf expert). Toujours faire des essais avec une version du programme enregistrée sous un autre nom."]

{"sheet":"Inscription","index":1,"n_rows":211,"n_cols":7,"rows_kept":211,"cut":false,"hidden":false,"merged":[[8,5,10,5],[8,0,10,0],[7,0,7,2],[7,5,7,6],[8,6,10,6],[8,4,10,4],[8,2,10,3]]}
["PRIX :"]
["VILLE :",null,null,"cyclo cross de Créhen"]
["ORGANISATEUR :",null,null,"EC Créhen"]
["DATE :",null,null,"2024-11-30"]
[]
[]
[]
[]
["DOSSARD",null,"NOM et PRENOM",null,"CLUB","CATEGORIE                           Age/valeur","N° licence"]
[null,"PRES."]
[]
[1,1,"Saulnier","Florentin","CCV Beaussais",137523,1]
[2,2,"Coualan","Jordan","CC Pleven",511484,1]
[3,3,"Sieurin","Sébastien","VC Evron",null,1]
[4,4,"Allot","Sébastien","VS Ploumagoar",null,1]
[5,5,"Joannot","Jérémy","Team Broons",506026,1]
[6,6,"Le Bellego","Maxime","VTT du Lié",480114,1]
[7,7,"Flégeau","David","Team Bikers 22",137996,1]
[8,8,"Le Ponner","Christophe","UC Plaudren",null,1]
[9]
[10]
[11]
[12]
[13]
[14]
[15]
[16]
[17]
[18]
[19]
[20,20,"Ruffet","Titouan","CC Moncontour",457920,"junior"]
[21,21,"Le Masson","Hugo","VC Evron",null,"Junior"]
[22]
[23]
[24]
[25]
[26]
[27]
[28]
[29]
[30,30,"Huby","Laurent","CC d'Uzel",278430,2]
[31,31,"Prigent","Benoit","Lamball'breizh",468745,2]
[32,32,"Bedel","Baptiste","Lamball'breizh",136137,2]
[33,33,"Nicolas","Patrice","COS Kerentrech",247939,2]
[34,34,"Perrennou","Claude","COS Kerentrech",null,2]
[35,35,"Leroux","Jérôme","CCV Beaussais",349169,2]
[36,36,"Bittoré","Luca","CCV Beaussais",465568,2]
[37,37,"Besnard","Jean-Jacques","CC Moncontour",425505,2]
[38,38,"Macé","Jérome","VC Evron",434904,2]
[39,39,"Henry","Damien","VC Dinan",474783,2]
[40,40,"Lebret","Julien","Team Bikers 22",431988,2]
[41,41,"letaconnoux","sylvain","accro cycles",null,2]
[42]
[43]
[44]
[45]
[46]
[47]
[48]
[49]
[50]
[51]
[52]
[53]
[54]
[55]
[56]
[57]
[58]
[59]
[60,60,"Nicolas","Jean-Charles","AC Vildé-Guingalan",137756,3]
[61,61,"Lemaitre ","Alain","AC Vildé-Guingalan",136151,3]
[62,62,"Lecellier","Raymond","Team Mégrit",143624,3]
[63,63,"Georget","Charles","Lamball'breizh",136132,3]
[64,64,"Bedel","Michel","Lamball'breizh",267277,3]
[65,65,"Colombier","Michel","CC Robert le Roux",286379,3]
[66,66,"Gouya","Noël","Team Pays de Dinan",136620,3]
[67,67,"Croisier","Ronan","Team Pays de Dinan",136268,3]
[68,68,"Durand","Jacques","Team Pays de Dinan",136617,3]
[69,69,"Guillot","Denis","Team Pays de Dinan",null,3]
[70,70,"Gaillard","Marcel","COS Kerentrech",153464,3]
[71,71,"Colleu","Pascal","CCV Beaussais",137558,3]
[72,72,"Goupil","Michel","Team Mégrit",null,3]
[73,73,"Durand","Francky","CC Moncontour",480456,3]
[74,74,"Jeuneu","Gilles","Accro Cycles",137390,3]
[75,75,"Pezres","Didier","EC Créhen",137518,3]
[76,76,"Colas","Roger","EC Créhen",137514,3]
[77,77,"Gouya","Philippe","EC Créhen",136134,3]
[78,78,"Gilson","Frédéric","CC Moncontour",424247,3]
[79]
[80]
[81]
[82]
[83]
[84]
[85]
[86]
[87]
[88]
[89]
[90,90,"Camus","Kristell","VC Evron",null,"féminine"]
[91,91,"Rivolet","Agnes","VTT Côtes d'Armor Hillion",443442,"féminine"]
[92,92,"Leray","Gwladys","Team XC du Léguer",359228,"féminine"]
[93,93,"Amice","Florine","Souffle d'espoir",137425,"féminine"]
[94]
[95]
[96]
[97]
[98]
[99]
[100,100,"Creseveur","Gurwan","Team XC du Léguer",330214,"Cadet"]
[101,101,"Flégeau","Gaël","Team Bikers 22",269847,"cadet"]
[102,102,"Rouille","Robin","Team Bikers 22",390947,"cadet"]
[103,103,"Madec","Rafael","VS Ploumagoar",null,"cadet"]
[104,104,"Durand","Joan","Lamball'breizh",383110,"cadet"]
[105,105,"Cadieu","Martin","VTT du Lié",null,"Cadet"]
[106]
[107]
[108]
[109]
[110,110,"Le Bihan","Clément","UC Plaudren",136145,"minime"]
[111,111,"Besnard colas","Ismaël","CC Moncontour",400382,"minime"]
[112,112,"Le Bihan","Evann","UC Plaudren",379622,"minime"]
[113,113,"Henry","Sulian","VC Dinan",486449,"Minime"]
[114,114,"Briand","Mathis","VC Evron",431995,"minime"]
[115,115,"le Corguille","Brieuc","VC Plurien",434773,"minime"]
[116]
[117]
[118]
[119]
[120,120,"Briand","Axel","VC Evron",429219,"Benjamin"]
[121,121,"Croisier","Léa","Team Pays de Dinan",263040,"Benjamin"]
[122,122,"Huguet","Mathis","Team Bikers 22",390457,"Benjamin"]
[123,123,"Macé","Tom","Team Broons",256614,"Benjamin"]
[124,124,"Callennec","Lucy","Bégard VTT Gwerun",509013,"Benjamin"]
[125,125,"Lebret","Sacha","Team Bikers 22",390946,"Benjamin"]
[126,126,"Lanoé","Hugo","VC Evron",382435,"Benjamin"]
[127,127,"Creseveur","Gwenvael","Team XC du Léguer",330214,"Benjamin"]
[128,128,"Lévéque","Noé","Accro Cycles",337516,"Benjamin"]
[129,129,"Colas","Thibault","Team XC du Léguer",330206,"Benjamin"]
[130,130,"Remond","Malo","Team XC du Léguer",395912,"benjamin"]
[131,131,"Auffret","Siméon","VC Plurien",459988,"benjamin"]
[132,132,"Gerard","Jules","Team Bikers 22",491636,"Benjamin"]
[133,133,"Cadieu","Gabriel","VTT du Lié",null,"benjamin"]
[134]
[135]
[136]
[137]
[138]
[139]
[140,140,"Meunier Le Breton","Lilwena","VTT Côtes D'Armor Hillion",369755,"pupille"]
[141,141,"Bruezière","Enzo","Team Bikers 22",459065,"pupille"]
[142,142,"Rouillé Biard","Manech","VTT Côtes D'Armor Hillion",451260,"pupille"]
[143,143,"Kowalski","Paul","Team Bikers 22",460607,"pupille"]
[144,144,"Devaux","Naël","Team Bikers 22",null,"Pupille"]
[145]
[146]
[147]
[148]
[149]
[150]
[151]
[152]
[153]
[154]
[155]
[156]
[157]
[158]
[159]
[160,160,"Macé","Loukas","VC Evron",396776,"poussin"]
[161,161,"Leveque","Nathan","Lamball'breizh",435105,"poussin"]
[162,162,"Lévèque","Clément","Accro Cycles",377265,"poussin"]
[163,163,"Vitel","Manoë","Team Bikers 22",null,"Poussin"]
[164,164,"Gouret","Louison","VC Evron",null,"poussin"]
[165,165,"Raoult","Léon","VC Evron",null,"poussin"]
[166,166,"Boilet","Malo","Lamball'breizh",520459,"poussin"]
[167]
[168]
[169]
[170,170,"Brueziere","Eden","Team Bikers 22",491634,"moustique"]
[171]
[172]
[173]
[174]
[175]
[176]
[177]
[178]
[179]
[180]
[181]
[182]
[183]
[184]
[185]
[186]
[187]
[188]
[189]
[190]
[191]
[192]
[193]
[194]
[195]
[196]
[197]
[198]
[199]
[200]

{"sheet":"PRIX D EQUIPE","index":2,"n_rows":39,"n_cols":1,"rows_kept":39,"cut":false,"hidden":false,"merged":[[1,0,1,1]]}
[]
["PRIX D EQUIPE"]
[]
[]
[1]
[2]
[3]
[4]
[5]
[6]
[7]
[8]
[9]
[10]
[11]
[12]
[13]
[14]
[15]
[16]
[17]
[18]
[19]
[20]
[21]
[22]
[23]
[24]
[25]
[26]
[27]
[28]
[29]
[30]
[31]
[32]
[33]
[34]
[35]

{"sheet":"ENG Dep","index":3,"n_rows":50,"n_cols":7,"rows_kept":50,"cut":false,"hidden":false,"merged":[[48,6,48,8],[8,0,10,0],[8,2,10,3],[8,4,10,4],[8,5,10,5],[48,1,48,3],[48,4,48,5],[8,6,10,6],[39,0,42,3],[39,4,39,6],[40,4,40,6],[41,4,41,6],[42,4,42,6],[0,0,0,8],[8,7,10,7],[8,8,10,8],[3,3,3,6],[1,0,1,8]]}
["Fédération Sportive et Gymnique du Travail"]
["ENGAGEMENTS SUR LA LIGNE"]
[]
["ORGANISATEUR : ",null,null,{"$f":"IF(Inscription!D3=\"\",\"\",Inscription!D3)","v":"EC Créhen"}]
["EPREUVE :",null,{"$f":"IF(Inscription!D1=\"\",\"\",Inscription!D1)","v":""}]
["CAT.:",{"$f":"IF(Inscription!D5=\"\",\"\",Inscription!D5)","v":""},null,null,null,"DATE :",{"$f":"IF(Inscription!D4=\"\",\"\",Inscription!D4)","v":"2024-11-30"}]
["NOMBRE D ENGAGES AU DEPART  :",null,null,null,{"$f":"COUNTA(A12:A39)","v":0}]
[]
["DOSS",null,"NOM  /  PRENOM",null,"ASSOCIATION","CAT","N° licence"]
[]
[]
[null,null,{"$f":"IF(A12>0,CONCATENATE((VLOOKUP($A12,Inscription!$A$12:$G$211,3,FALSE)),\"   \",(VLOOKUP($A12,Inscription!$A$12:$G$211,4,FALSE))),\" \")","v":" "},null,{"$f":"IF($A12>0,(VLOOKUP($A12,Inscription!$A$12:$G$211,5,FALSE)),\" \")","v":" "},{"$f":"IF($A12>0,(VLOOKUP($A12,Inscription!$A$12:$G$211,6,FALSE)),\" \")","v":" "},{"$f":"IF($A12>0,(VLOOKUP($A12,Inscription!$A$12:$G$211,7,FALSE)),\" \")","v":" "}]
[null,null,{"$f":"IF(A13>0,CONCATENATE((VLOOKUP($A13,Inscription!$A$12:$G$211,3,FALSE)),\"   \",(VLOOKUP($A13,Inscription!$A$12:$G$211,4,FALSE))),\" \")","v":" "},null,{"$f":"IF($A13>0,(VLOOKUP($A13,Inscription!$A$12:$G$211,5,FALSE)),\" \")","v":" "},{"$f":"IF($A13>0,(VLOOKUP($A13,Inscription!$A$12:$G$211,6,FALSE)),\" \")","v":" "},{"$f":"IF($A13>0,(VLOOKUP($A13,Inscription!$A$12:$G$211,7,FALSE)),\" \")","v":" "}]
[null,null,{"$f":"IF(A14>0,CONCATENATE((VLOOKUP($A14,Inscription!$A$12:$G$211,3,FALSE)),\"   \",(VLOOKUP($A14,Inscription!$A$12:$G$211,4,FALSE))),\" \")","v":" "},null,{"$f":"IF($A14>0,(VLOOKUP($A14,Inscription!$A$12:$G$211,5,FALSE)),\" \")","v":" "},{"$f":"IF($A14>0,(VLOOKUP($A14,Inscription!$A$12:$G$211,6,FALSE)),\" \")","v":" "},{"$f":"IF($A14>0,(VLOOKUP($A14,Inscription!$A$12:$G$211,7,FALSE)),\" \")","v":" "}]
[null,null,{"$f":"IF(A15>0,CONCATENATE((VLOOKUP($A15,Inscription!$A$12:$G$211,3,FALSE)),\"   \",(VLOOKUP($A15,Inscription!$A$12:$G$211,4,FALSE))),\" \")","v":" "},null,{"$f":"IF($A15>0,(VLOOKUP($A15,Inscription!$A$12:$G$211,5,FALSE)),\" \")","v":" "},{"$f":"IF($A15>0,(VLOOKUP($A15,Inscription!$A$12:$G$211,6,FALSE)),\" \")","v":" "},{"$f":"IF($A15>0,(VLOOKUP($A15,Inscription!$A$12:$G$211,7,FALSE)),\" \")","v":" "}]
[null,null,{"$f":"IF(A16>0,CONCATENATE((VLOOKUP($A16,Inscription!$A$12:$G$211,3,FALSE)),\"   \",(VLOOKUP($A16,Inscription!$A$12:$G$211,4,FALSE))),\" \")","v":" "},null,{"$f":"IF($A16>0,(VLOOKUP($A16,Inscription!$A$12:$G$211,5,FALSE)),\" \")","v":" "},{"$f":"IF($A16>0,(VLOOKUP($A16,Inscription!$A$12:$G$211,6,FALSE)),\" \")","v":" "},{"$f":"IF($A16>0,(VLOOKUP($A16,Inscription!$A$12:$G$211,7,FALSE)),\" \")","v":" "}]
[null,null,{"$f":"IF(A17>0,CONCATENATE((VLOOKUP($A17,Inscription!$A$12:$G$211,3,FALSE)),\"   \",(VLOOKUP($A17,Inscription!$A$12:$G$211,4,FALSE))),\" \")","v":" "},null,{"$f":"IF($A17>0,(VLOOKUP($A17,Inscription!$A$12:$G$211,5,FALSE)),\" \")","v":" "},{"$f":"IF($A17>0,(VLOOKUP($A17,Inscription!$A$12:$G$211,6,FALSE)),\" \")","v":" "},{"$f":"IF($A17>0,(VLOOKUP($A17,Inscription!$A$12:$G$211,7,FALSE)),\" \")","v":" "}]
[null,null,{"$f":"IF(A18>0,CONCATENATE((VLOOKUP($A18,Inscription!$A$12:$G$211,3,FALSE)),\"   \",(VLOOKUP($A18,Inscription!$A$12:$G$211,4,FALSE))),\" \")","v":" "},null,{"$f":"IF($A18>0,(VLOOKUP($A18,Inscription!$A$12:$G$211,5,FALSE)),\" \")","v":" "},{"$f":"IF($A18>0,(VLOOKUP($A18,Inscription!$A$12:$G$211,6,FALSE)),\" \")","v":" "},{"$f":"IF($A18>0,(VLOOKUP($A18,Inscription!$A$12:$G$211,7,FALSE)),\" \")","v":" "}]
[null,null,{"$f":"IF(A19>0,CONCATENATE((VLOOKUP($A19,Inscription!$A$12:$G$211,3,FALSE)),\"   \",(VLOOKUP($A19,Inscription!$A$12:$G$211,4,FALSE))),\" \")","v":" "},null,{"$f":"IF($A19>0,(VLOOKUP($A19,Inscription!$A$12:$G$211,5,FALSE)),\" \")","v":" "},{"$f":"IF($A19>0,(VLOOKUP($A19,Inscription!$A$12:$G$211,6,FALSE)),\" \")","v":" "},{"$f":"IF($A19>0,(VLOOKUP($A19,Inscription!$A$12:$G$211,7,FALSE)),\" \")","v":" "}]
[null,null,{"$f":"IF(A20>0,CONCATENATE((VLOOKUP($A20,Inscription!$A$12:$G$211,3,FALSE)),\"   \",(VLOOKUP($A20,Inscription!$A$12:$G$211,4,FALSE))),\" \")","v":" "},null,{"$f":"IF($A20>0,(VLOOKUP($A20,Inscription!$A$12:$G$211,5,FALSE)),\" \")","v":" "},{"$f":"IF($A20>0,(VLOOKUP($A20,Inscription!$A$12:$G$211,6,FALSE)),\" \")","v":" "},{"$f":"IF($A20>0,(VLOOKUP($A20,Inscription!$A$12:$G$211,7,FALSE)),\" \")","v":" "}]
[null,null,{"$f":"IF(A21>0,CONCATENATE((VLOOKUP($A21,Inscription!$A$12:$G$211,3,FALSE)),\"   \",(VLOOKUP($A21,Inscription!$A$12:$G$211,4,FALSE))),\" \")","v":" "},null,{"$f":"IF($A21>0,(VLOOKUP($A21,Inscription!$A$12:$G$211,5,FALSE)),\" \")","v":" "},{"$f":"IF($A21>0,(VLOOKUP($A21,Inscription!$A$12:$G$211,6,FALSE)),\" \")","v":" "},{"$f":"IF($A21>0,(VLOOKUP($A21,Inscription!$A$12:$G$211,7,FALSE)),\" \")","v":" "}]
[null,null,{"$f":"IF(A22>0,CONCATENATE((VLOOKUP($A22,Inscription!$A$12:$G$211,3,FALSE)),\"   \",(VLOOKUP($A22,Inscription!$A$12:$G$211,4,FALSE))),\" \")","v":" "},null,{"$f":"IF($A22>0,(VLOOKUP($A22,Inscription!$A$12:$G$211,5,FALSE)),\" \")","v":" "},{"$f":"IF($A22>0,(VLOOKUP($A22,Inscription!$A$12:$G$211,6,FALSE)),\" \")","v":" "},{"$f":"IF($A22>0,(VLOOKUP($A22,Inscription!$A$12:$G$211,7,FALSE)),\" \")","v":" "}]
[null,null,{"$f":"IF(A23>0,CONCATENATE((VLOOKUP($A23,Inscription!$A$12:$G$211,3,FALSE)),\"   \",(VLOOKUP($A23,Inscription!$A$12:$G$211,4,FALSE))),\" \")","v":" "},null,{"$f":"IF($A23>0,(VLOOKUP($A23,Inscription!$A$12:$G$211,5,FALSE)),\" \")","v":" "},{"$f":"IF($A23>0,(VLOOKUP($A23,Inscription!$A$12:$G$211,6,FALSE)),\" \")","v":" "},{"$f":"IF($A23>0,(VLOOKUP($A23,Inscription!$A$12:$G$211,7,FALSE)),\" \")","v":" "}]
[null,null,{"$f":"IF(A24>0,CONCATENATE((VLOOKUP($A24,Inscription!$A$12:$G$211,3,FALSE)),\"   \",(VLOOKUP($A24,Inscription!$A$12:$G$211,4,FALSE))),\" \")","v":" "},null,{"$f":"IF($A24>0,(VLOOKUP($A24,Inscription!$A$12:$G$211,5,FALSE)),\" \")","v":" "},{"$f":"IF($A24>0,(VLOOKUP($A24,Inscription!$A$12:$G$211,6,FALSE)),\" \")","v":" "},{"$f":"IF($A24>0,(VLOOKUP($A24,Inscription!$A$12:$G$211,7,FALSE)),\" \")","v":" "}]
[null,null,{"$f":"IF(A25>0,CONCATENATE((VLOOKUP($A25,Inscription!$A$12:$G$211,3,FALSE)),\"   \",(VLOOKUP($A25,Inscription!$A$12:$G$211,4,FALSE))),\" \")","v":" "},null,{"$f":"IF($A25>0,(VLOOKUP($A25,Inscription!$A$12:$G$211,5,FALSE)),\" \")","v":" "},{"$f":"IF($A25>0,(VLOOKUP($A25,Inscription!$A$12:$G$211,6,FALSE)),\" \")","v":" "},{"$f":"IF($A25>0,(VLOOKUP($A25,Inscription!$A$12:$G$211,7,FALSE)),\" \")","v":" "}]
[null,null,{"$f":"IF(A26>0,CONCATENATE((VLOOKUP($A26,Inscription!$A$12:$G$211,3,FALSE)),\"   \",(VLOOKUP($A26,Inscription!$A$12:$G$211,4,FALSE))),\" \")","v":" "},null,{"$f":"IF($A26>0,(VLOOKUP($A26,Inscription!$A$12:$G$211,5,FALSE)),\" \")","v":" "},{"$f":"IF($A26>0,(VLOOKUP($A26,Inscription!$A$12:$G$211,6,FALSE)),\" \")","v":" "},{"$f":"IF($A26>0,(VLOOKUP($A26,Inscription!$A$12:$G$211,7,FALSE)),\" \")","v":" "}]
[null,null,{"$f":"IF(A27>0,CONCATENATE((VLOOKUP($A27,Inscription!$A$12:$G$211,3,FALSE)),\"   \",(VLOOKUP($A27,Inscription!$A$12:$G$211,4,FALSE))),\" \")","v":" "},null,{"$f":"IF($A27>0,(VLOOKUP($A27,Inscription!$A$12:$G$211,5,FALSE)),\" \")","v":" "},{"$f":"IF($A27>0,(VLOOKUP($A27,Inscription!$A$12:$G$211,6,FALSE)),\" \")","v":" "},{"$f":"IF($A27>0,(VLOOKUP($A27,Inscription!$A$12:$G$211,7,FALSE)),\" \")","v":" "}]
[null,null,{"$f":"IF(A28>0,CONCATENATE((VLOOKUP($A28,Inscription!$A$12:$G$211,3,FALSE)),\"   \",(VLOOKUP($A28,Inscription!$A$12:$G$211,4,FALSE))),\" \")","v":" "},null,{"$f":"IF($A28>0,(VLOOKUP($A28,Inscription!$A$12:$G$211,5,FALSE)),\" \")","v":" "},{"$f":"IF($A28>0,(VLOOKUP($A28,Inscription!$A$12:$G$211,6,FALSE)),\" \")","v":" "},{"$f":"IF($A28>0,(VLOOKUP($A28,Inscription!$A$12:$G$211,7,FALSE)),\" \")","v":" "}]
[null,null,{"$f":"IF(A29>0,CONCATENATE((VLOOKUP($A29,Inscription!$A$12:$G$211,3,FALSE)),\"   \",(VLOOKUP($A29,Inscription!$A$12:$G$211,4,FALSE))),\" \")","v":" "},null,{"$f":"IF($A29>0,(VLOOKUP($A29,Inscription!$A$12:$G$211,5,FALSE)),\" \")","v":" "},{"$f":"IF($A29>0,(VLOOKUP($A29,Inscription!$A$12:$G$211,6,FALSE)),\" \")","v":" "},{"$f":"IF($A29>0,(VLOOKUP($A29,Inscription!$A$12:$G$211,7,FALSE)),\" \")","v":" "}]
[null,null,{"$f":"IF(A30>0,CONCATENATE((VLOOKUP($A30,Inscription!$A$12:$G$211,3,FALSE)),\"   \",(VLOOKUP($A30,Inscription!$A$12:$G$211,4,FALSE))),\" \")","v":" "},null,{"$f":"IF($A30>0,(VLOOKUP($A30,Inscription!$A$12:$G$211,5,FALSE)),\" \")","v":" "},{"$f":"IF($A30>0,(VLOOKUP($A30,Inscription!$A$12:$G$211,6,FALSE)),\" \")","v":" "},{"$f":"IF($A30>0,(VLOOKUP($A30,Inscription!$A$12:$G$211,7,FALSE)),\" \")","v":" "}]
[null,null,{"$f":"IF(A31>0,CONCATENATE((VLOOKUP($A31,Inscription!$A$12:$G$211,3,FALSE)),\"   \",(VLOOKUP($A31,Inscription!$A$12:$G$211,4,FALSE))),\" \")","v":" "},null,{"$f":"IF($A31>0,(VLOOKUP($A31,Inscription!$A$12:$G$211,5,FALSE)),\" \")","v":" "},{"$f":"IF($A31>0,(VLOOKUP($A31,Inscription!$A$12:$G$211,6,FALSE)),\" \")","v":" "},{"$f":"IF($A31>0,(VLOOKUP($A31,Inscription!$A$12:$G$211,7,FALSE)),\" \")","v":" "}]
[null,null,{"$f":"IF(A32>0,CONCATENATE((VLOOKUP($A32,Inscription!$A$12:$G$211,3,FALSE)),\"   \",(VLOOKUP($A32,Inscription!$A$12:$G$211,4,FALSE))),\" \")","v":" "},null,{"$f":"IF($A32>0,(VLOOKUP($A32,Inscription!$A$12:$G$211,5,FALSE)),\" \")","v":" "},{"$f":"IF($A32>0,(VLOOKUP($A32,Inscription!$A$12:$G$211,6,FALSE)),\" \")","v":" "},{"$f":"IF($A32>0,(VLOOKUP($A32,Inscription!$A$12:$G$211,7,FALSE)),\" \")","v":" "}]
[null,null,{"$f":"IF(A33>0,CONCATENATE((VLOOKUP($A33,Inscription!$A$12:$G$211,3,FALSE)),\"   \",(VLOOKUP($A33,Inscription!$A$12:$G$211,4,FALSE))),\" \")","v":" "},null,{"$f":"IF($A33>0,(VLOOKUP($A33,Inscription!$A$12:$G$211,5,FALSE)),\" \")","v":" "},{"$f":"IF($A33>0,(VLOOKUP($A33,Inscription!$A$12:$G$211,6,FALSE)),\" \")","v":" "},{"$f":"IF($A33>0,(VLOOKUP($A33,Inscription!$A$12:$G$211,7,FALSE)),\" \")","v":" "}]
[null,null,{"$f":"IF(A34>0,CONCATENATE((VLOOKUP($A34,Inscription!$A$12:$G$211,3,FALSE)),\"   \",(VLOOKUP($A34,Inscription!$A$12:$G$211,4,FALSE))),\" \")","v":" "},null,{"$f":"IF($A34>0,(VLOOKUP($A34,Inscription!$A$12:$G$211,5,FALSE)),\" \")","v":" "},{"$f":"IF($A34>0,(VLOOKUP($A34,Inscription!$A$12:$G$211,6,FALSE)),\" \")","v":" "},{"$f":"IF($A34>0,(VLOOKUP($A34,Inscription!$A$12:$G$211,7,FALSE)),\" \")","v":" "}]
[null,null,{"$f":"IF(A35>0,CONCATENATE((VLOOKUP($A35,Inscription!$A$12:$G$211,3,FALSE)),\"   \",(VLOOKUP($A35,Inscription!$A$12:$G$211,4,FALSE))),\" \")","v":" "},null,{"$f":"IF($A35>0,(VLOOKUP($A35,Inscription!$A$12:$G$211,5,FALSE)),\" \")","v":" "},{"$f":"IF($A35>0,(VLOOKUP($A35,Inscription!$A$12:$G$211,6,FALSE)),\" \")","v":" "},{"$f":"IF($A35>0,(VLOOKUP($A35,Inscription!$A$12:$G$211,7,FALSE)),\" \")","v":" "}]
[null,null,{"$f":"IF(A36>0,CONCATENATE((VLOOKUP($A36,Inscription!$A$12:$G$211,3,FALSE)),\"   \",(VLOOKUP($A36,Inscription!$A$12:$G$211,4,FALSE))),\" \")","v":" "},null,{"$f":"IF($A36>0,(VLOOKUP($A36,Inscription!$A$12:$G$211,5,FALSE)),\" \")","v":" "},{"$f":"IF($A36>0,(VLOOKUP($A36,Inscription!$A$12:$G$211,6,FALSE)),\" \")","v":" "},{"$f":"IF($A36>0,(VLOOKUP($A36,Inscription!$A$12:$G$211,7,FALSE)),\" \")","v":" "}]
[null,null,{"$f":"IF(A37>0,CONCATENATE((VLOOKUP($A37,Inscription!$A$12:$G$211,3,FALSE)),\"   \",(VLOOKUP($A37,Inscription!$A$12:$G$211,4,FALSE))),\" \")","v":" "},null,{"$f":"IF($A37>0,(VLOOKUP($A37,Inscription!$A$12:$G$211,5,FALSE)),\" \")","v":" "},{"$f":"IF($A37>0,(VLOOKUP($A37,Inscription!$A$12:$G$211,6,FALSE)),\" \")","v":" "},{"$f":"IF($A37>0,(VLOOKUP($A37,Inscription!$A$12:$G$211,7,FALSE)),\" \")","v":" "}]
[null,null,{"$f":"IF(A38>0,CONCATENATE((VLOOKUP($A38,Inscription!$A$12:$G$211,3,FALSE)),\"   \",(VLOOKUP($A38,Inscription!$A$12:$G$211,4,FALSE))),\" \")","v":" "},null,{"$f":"IF($A38>0,(VLOOKUP($A38,Inscription!$A$12:$G$211,5,FALSE)),\" \")","v":" "},{"$f":"IF($A38>0,(VLOOKUP($A38,Inscription!$A$12:$G$211,6,FALSE)),\" \")","v":" "},{"$f":"IF($A38>0,(VLOOKUP($A38,Inscription!$A$12:$G$211,7,FALSE)),\" \")","v":" "}]
[null,null,{"$f":"IF(A39>0,CONCATENATE((VLOOKUP($A39,Inscription!$A$12:$G$211,3,FALSE)),\"   \",(VLOOKUP($A39,Inscription!$A$12:$G$211,4,FALSE))),\" \")","v":" "},null,{"$f":"IF($A39>0,(VLOOKUP($A39,Inscription!$A$12:$G$211,5,FALSE)),\" \")","v":" "},{"$f":"IF($A39>0,(VLOOKUP($A39,Inscription!$A$12:$G$211,6,FALSE)),\" \")","v":" "},{"$f":"IF($A39>0,(VLOOKUP($A39,Inscription!$A$12:$G$211,7,FALSE)),\" \")","v":" "}]
["ENGAGEMENTS SUR PLACE AU PRIX D EQUIPE (Nom de l'association)"]
[]
[]
[]
[]
[]
[null,null,null,null,{"$f":"COUNTA(E40:G43)","v":0}]
[null,null,null,null,{"$f":"$E$7","v":0}]
[]
[null,"Le Commissaire :\nNOM :\nSIGNATURE :",null,null,"LE CLUB ORGANISATEUR :\nNOM :\nSIGNATURE :",null,"VISA COMPTABILITE :\n\nDATE :"]
["IMPRIME A JOINDRE AVEC L'ETAT DE RESULTAT. "]

{"sheet":"EMARGEMENT","index":4,"n_rows":202,"n_cols":6,"rows_kept":202,"cut":false,"hidden":false,"merged":[[0,0,0,5]]}
["FEUILLE D EMARGEMENT"]
["DOSS.","NOM PRENOM","CLUB","CATEGORIE","LICENCE N°","SIGNATURE"]
[{"$f":"Inscription!A12","v":1},{"$f":"CONCATENATE(Inscription!C12,\"  \",Inscription!D12)","v":"Saulnier  Florentin"},{"$f":"Inscription!E12","v":"CCV Beaussais"},{"$f":"Inscription!F12","v":137523},{"$f":"Inscription!G12","v":1}]
[{"$f":"Inscription!A13","v":2},{"$f":"CONCATENATE(Inscription!C13,\"  \",Inscription!D13)","v":"Coualan  Jordan"},{"$f":"Inscription!E13","v":"CC Pleven"},{"$f":"Inscription!F13","v":511484},{"$f":"Inscription!G13","v":1}]
[{"$f":"Inscription!A14","v":3},{"$f":"CONCATENATE(Inscription!C14,\"  \",Inscription!D14)","v":"Sieurin  Sébastien"},{"$f":"Inscription!E14","v":"VC Evron"},{"$f":"Inscription!F14","v":0},{"$f":"Inscription!G14","v":1}]
[{"$f":"Inscription!A15","v":4},{"$f":"CONCATENATE(Inscription!C15,\"  \",Inscription!D15)","v":"Allot  Sébastien"},{"$f":"Inscription!E15","v":"VS Ploumagoar"},{"$f":"Inscription!F15","v":0},{"$f":"Inscription!G15","v":1}]
[{"$f":"Inscription!A16","v":5},{"$f":"CONCATENATE(Inscription!C16,\"  \",Inscription!D16)","v":"Joannot  Jérémy"},{"$f":"Inscription!E16","v":"Team Broons"},{"$f":"Inscription!F16","v":506026},{"$f":"Inscription!G16","v":1}]
[{"$f":"Inscription!A17","v":6},{"$f":"CONCATENATE(Inscription!C17,\"  \",Inscription!D17)","v":"Le Bellego  Maxime"},{"$f":"Inscription!E17","v":"VTT du Lié"},{"$f":"Inscription!F17","v":480114},{"$f":"Inscription!G17","v":1}]
[{"$f":"Inscription!A18","v":7},{"$f":"CONCATENATE(Inscription!C18,\"  \",Inscription!D18)","v":"Flégeau  David"},{"$f":"Inscription!E18","v":"Team Bikers 22"},{"$f":"Inscription!F18","v":137996},{"$f":"Inscription!G18","v":1}]
[{"$f":"Inscription!A19","v":8},{"$f":"CONCATENATE(Inscription!C19,\"  \",Inscription!D19)","v":"Le Ponner  Christophe"},{"$f":"Inscription!E19","v":"UC Plaudren"},{"$f":"Inscription!F19","v":0},{"$f":"Inscription!G19","v":1}]
[{"$f":"Inscription!A20","v":9},{"$f":"CONCATENATE(Inscription!C20,\"  \",Inscription!D20)","v":"  "},{"$f":"Inscription!E20","v":0},{"$f":"Inscription!F20","v":0},{"$f":"Inscription!G20","v":0}]
[{"$f":"Inscription!A21","v":10},{"$f":"CONCATENATE(Inscription!C21,\"  \",Inscription!D21)","v":"  "},{"$f":"Inscription!E21","v":0},{"$f":"Inscription!F21","v":0},{"$f":"Inscription!G21","v":0}]
[{"$f":"Inscription!A22","v":11},{"$f":"CONCATENATE(Inscription!C22,\"  \",Inscription!D22)","v":"  "},{"$f":"Inscription!E22","v":0},{"$f":"Inscription!F22","v":0},{"$f":"Inscription!G22","v":0}]
[{"$f":"Inscription!A23","v":12},{"$f":"CONCATENATE(Inscription!C23,\"  \",Inscription!D23)","v":"  "},{"$f":"Inscription!E23","v":0},{"$f":"Inscription!F23","v":0},{"$f":"Inscription!G23","v":0}]
[{"$f":"Inscription!A24","v":13},{"$f":"CONCATENATE(Inscription!C24,\"  \",Inscription!D24)","v":"  "},{"$f":"Inscription!E24","v":0},{"$f":"Inscription!F24","v":0},{"$f":"Inscription!G24","v":0}]
[{"$f":"Inscription!A25","v":14},{"$f":"CONCATENATE(Inscription!C25,\"  \",Inscription!D25)","v":"  "},{"$f":"Inscription!E25","v":0},{"$f":"Inscription!F25","v":0},{"$f":"Inscription!G25","v":0}]
[{"$f":"Inscription!A26","v":15},{"$f":"CONCATENATE(Inscription!C26,\"  \",Inscription!D26)","v":"  "},{"$f":"Inscription!E26","v":0},{"$f":"Inscription!F26","v":0},{"$f":"Inscription!G26","v":0}]
[{"$f":"Inscription!A27","v":16},{"$f":"CONCATENATE(Inscription!C27,\"  \",Inscription!D27)","v":"  "},{"$f":"Inscription!E27","v":0},{"$f":"Inscription!F27","v":0},{"$f":"Inscription!G27","v":0}]
[{"$f":"Inscription!A28","v":17},{"$f":"CONCATENATE(Inscription!C28,\"  \",Inscription!D28)","v":"  "},{"$f":"Inscription!E28","v":0},{"$f":"Inscription!F28","v":0},{"$f":"Inscription!G28","v":0}]
[{"$f":"Inscription!A29","v":18},{"$f":"CONCATENATE(Inscription!C29,\"  \",Inscription!D29)","v":"  "},{"$f":"Inscription!E29","v":0},{"$f":"Inscription!F29","v":0},{"$f":"Inscription!G29","v":0}]
[{"$f":"Inscription!A30","v":19},{"$f":"CONCATENATE(Inscription!C30,\"  \",Inscription!D30)","v":"  "},{"$f":"Inscription!E30","v":0},{"$f":"Inscription!F30","v":0},{"$f":"Inscription!G30","v":0}]
[{"$f":"Inscription!A31","v":20},{"$f":"CONCATENATE(Inscription!C31,\"  \",Inscription!D31)","v":"Ruffet  Titouan"},{"$f":"Inscription!E31","v":"CC Moncontour"},{"$f":"Inscription!F31","v":457920},{"$f":"Inscription!G31","v":"junior"}]
[{"$f":"Inscription!A32","v":21},{"$f":"CONCATENATE(Inscription!C32,\"  \",Inscription!D32)","v":"Le Masson  Hugo"},{"$f":"Inscription!E32","v":"VC Evron"},{"$f":"Inscription!F32","v":0},{"$f":"Inscription!G32","v":"Junior"}]
[{"$f":"Inscription!A33","v":22},{"$f":"CONCATENATE(Inscription!C33,\"  \",Inscription!D33)","v":"  "},{"$f":"Inscription!E33","v":0},{"$f":"Inscription!F33","v":0},{"$f":"Inscription!G33","v":0}]
[{"$f":"Inscription!A34","v":23},{"$f":"CONCATENATE(Inscription!C34,\"  \",Inscription!D34)","v":"  "},{"$f":"Inscription!E34","v":0},{"$f":"Inscription!F34","v":0},{"$f":"Inscription!G34","v":0}]
[{"$f":"Inscription!A35","v":24},{"$f":"CONCATENATE(Inscription!C35,\"  \",Inscription!D35)","v":"  "},{"$f":"Inscription!E35","v":0},{"$f":"Inscription!F35","v":0},{"$f":"Inscription!G35","v":0}]
[{"$f":"Inscription!A36","v":25},{"$f":"CONCATENATE(Inscription!C36,\"  \",Inscription!D36)","v":"  "},{"$f":"Inscription!E36","v":0},{"$f":"Inscription!F36","v":0},{"$f":"Inscription!G36","v":0}]
[{"$f":"Inscription!A37","v":26},{"$f":"CONCATENATE(Inscription!C37,\"  \",Inscription!D37)","v":"  "},{"$f":"Inscription!E37","v":0},{"$f":"Inscription!F37","v":0},{"$f":"Inscription!G37","v":0}]
[{"$f":"Inscription!A38","v":27},{"$f":"CONCATENATE(Inscription!C38,\"  \",Inscription!D38)","v":"  "},{"$f":"Inscription!E38","v":0},{"$f":"Inscription!F38","v":0},{"$f":"Inscription!G38","v":0}]
[{"$f":"Inscription!A39","v":28},{"$f":"CONCATENATE(Inscription!C39,\"  \",Inscription!D39)","v":"  "},{"$f":"Inscription!E39","v":0},{"$f":"Inscription!F39","v":0},{"$f":"Inscription!G39","v":0}]
[{"$f":"Inscription!A40","v":29},{"$f":"CONCATENATE(Inscription!C40,\"  \",Inscription!D40)","v":"  "},{"$f":"Inscription!E40","v":0},{"$f":"Inscription!F40","v":0},{"$f":"Inscription!G40","v":0}]
[{"$f":"Inscription!A41","v":30},{"$f":"CONCATENATE(Inscription!C41,\"  \",Inscription!D41)","v":"Huby  Laurent"},{"$f":"Inscription!E41","v":"CC d'Uzel"},{"$f":"Inscription!F41","v":278430},{"$f":"Inscription!G41","v":2}]
[{"$f":"Inscription!A42","v":31},{"$f":"CONCATENATE(Inscription!C42,\"  \",Inscription!D42)","v":"Prigent  Benoit"},{"$f":"Inscription!E42","v":"Lamball'breizh"},{"$f":"Inscription!F42","v":468745},{"$f":"Inscription!G42","v":2}]
[{"$f":"Inscription!A43","v":32},{"$f":"CONCATENATE(Inscription!C43,\"  \",Inscription!D43)","v":"Bedel  Baptiste"},{"$f":"Inscription!E43","v":"Lamball'breizh"},{"$f":"Inscription!F43","v":136137},{"$f":"Inscription!G43","v":2}]
[{"$f":"Inscription!A44","v":33},{"$f":"CONCATENATE(Inscription!C44,\"  \",Inscription!D44)","v":"Nicolas  Patrice"},{"$f":"Inscription!E44","v":"COS Kerentrech"},{"$f":"Inscription!F44","v":247939},{"$f":"Inscription!G44","v":2}]
[{"$f":"Inscription!A45","v":34},{"$f":"CONCATENATE(Inscription!C45,\"  \",Inscription!D45)","v":"Perrennou  Claude"},{"$f":"Inscription!E45","v":"COS Kerentrech"},{"$f":"Inscription!F45","v":0},{"$f":"Inscription!G45","v":2}]
[{"$f":"Inscription!A46","v":35},{"$f":"CONCATENATE(Inscription!C46,\"  \",Inscription!D46)","v":"Leroux  Jérôme"},{"$f":"Inscription!E46","v":"CCV Beaussais"},{"$f":"Inscription!F46","v":349169},{"$f":"Inscription!G46","v":2}]
[{"$f":"Inscription!A47","v":36},{"$f":"CONCATENATE(Inscription!C47,\"  \",Inscription!D47)","v":"Bittoré  Luca"},{"$f":"Inscription!E47","v":"CCV Beaussais"},{"$f":"Inscription!F47","v":465568},{"$f":"Inscription!G47","v":2}]
[{"$f":"Inscription!A48","v":37},{"$f":"CONCATENATE(Inscription!C48,\"  \",Inscription!D48)","v":"Besnard  Jean-Jacques"},{"$f":"Inscription!E48","v":"CC Moncontour"},{"$f":"Inscription!F48","v":425505},{"$f":"Inscription!G48","v":2}]
[{"$f":"Inscription!A49","v":38},{"$f":"CONCATENATE(Inscription!C49,\"  \",Inscription!D49)","v":"Macé  Jérome"},{"$f":"Inscription!E49","v":"VC Evron"},{"$f":"Inscription!F49","v":434904},{"$f":"Inscription!G49","v":2}]
[{"$f":"Inscription!A50","v":39},{"$f":"CONCATENATE(Inscription!C50,\"  \",Inscription!D50)","v":"Henry  Damien"},{"$f":"Inscription!E50","v":"VC Dinan"},{"$f":"Inscription!F50","v":474783},{"$f":"Inscription!G50","v":2}]
[{"$f":"Inscription!A51","v":40},{"$f":"CONCATENATE(Inscription!C51,\"  \",Inscription!D51)","v":"Lebret  Julien"},{"$f":"Inscription!E51","v":"Team Bikers 22"},{"$f":"Inscription!F51","v":431988},{"$f":"Inscription!G51","v":2}]
[{"$f":"Inscription!A52","v":41},{"$f":"CONCATENATE(Inscription!C52,\"  \",Inscription!D52)","v":"letaconnoux  sylvain"},{"$f":"Inscription!E52","v":"accro cycles"},{"$f":"Inscription!F52","v":0},{"$f":"Inscription!G52","v":2}]
[{"$f":"Inscription!A53","v":42},{"$f":"CONCATENATE(Inscription!C53,\"  \",Inscription!D53)","v":"  "},{"$f":"Inscription!E53","v":0},{"$f":"Inscription!F53","v":0},{"$f":"Inscription!G53","v":0}]
[{"$f":"Inscription!A54","v":43},{"$f":"CONCATENATE(Inscription!C54,\"  \",Inscription!D54)","v":"  "},{"$f":"Inscription!E54","v":0},{"$f":"Inscription!F54","v":0},{"$f":"Inscription!G54","v":0}]
[{"$f":"Inscription!A55","v":44},{"$f":"CONCATENATE(Inscription!C55,\"  \",Inscription!D55)","v":"  "},{"$f":"Inscription!E55","v":0},{"$f":"Inscription!F55","v":0},{"$f":"Inscription!G55","v":0}]
[{"$f":"Inscription!A56","v":45},{"$f":"CONCATENATE(Inscription!C56,\"  \",Inscription!D56)","v":"  "},{"$f":"Inscription!E56","v":0},{"$f":"Inscription!F56","v":0},{"$f":"Inscription!G56","v":0}]
[{"$f":"Inscription!A57","v":46},{"$f":"CONCATENATE(Inscription!C57,\"  \",Inscription!D57)","v":"  "},{"$f":"Inscription!E57","v":0},{"$f":"Inscription!F57","v":0},{"$f":"Inscription!G57","v":0}]
[{"$f":"Inscription!A58","v":47},{"$f":"CONCATENATE(Inscription!C58,\"  \",Inscription!D58)","v":"  "},{"$f":"Inscription!E58","v":0},{"$f":"Inscription!F58","v":0},{"$f":"Inscription!G58","v":0}]
[{"$f":"Inscription!A59","v":48},{"$f":"CONCATENATE(Inscription!C59,\"  \",Inscription!D59)","v":"  "},{"$f":"Inscription!E59","v":0},{"$f":"Inscription!F59","v":0},{"$f":"Inscription!G59","v":0}]
[{"$f":"Inscription!A60","v":49},{"$f":"CONCATENATE(Inscription!C60,\"  \",Inscription!D60)","v":"  "},{"$f":"Inscription!E60","v":0},{"$f":"Inscription!F60","v":0},{"$f":"Inscription!G60","v":0}]
[{"$f":"Inscription!A61","v":50},{"$f":"CONCATENATE(Inscription!C61,\"  \",Inscription!D61)","v":"  "},{"$f":"Inscription!E61","v":0},{"$f":"Inscription!F61","v":0},{"$f":"Inscription!G61","v":0}]
[{"$f":"Inscription!A62","v":51},{"$f":"CONCATENATE(Inscription!C62,\"  \",Inscription!D62)","v":"  "},{"$f":"Inscription!E62","v":0},{"$f":"Inscription!F62","v":0},{"$f":"Inscription!G62","v":0}]
[{"$f":"Inscription!A63","v":52},{"$f":"CONCATENATE(Inscription!C63,\"  \",Inscription!D63)","v":"  "},{"$f":"Inscription!E63","v":0},{"$f":"Inscription!F63","v":0},{"$f":"Inscription!G63","v":0}]
[{"$f":"Inscription!A64","v":53},{"$f":"CONCATENATE(Inscription!C64,\"  \",Inscription!D64)","v":"  "},{"$f":"Inscription!E64","v":0},{"$f":"Inscription!F64","v":0},{"$f":"Inscription!G64","v":0}]
[{"$f":"Inscription!A65","v":54},{"$f":"CONCATENATE(Inscription!C65,\"  \",Inscription!D65)","v":"  "},{"$f":"Inscription!E65","v":0},{"$f":"Inscription!F65","v":0},{"$f":"Inscription!G65","v":0}]
[{"$f":"Inscription!A66","v":55},{"$f":"CONCATENATE(Inscription!C66,\"  \",Inscription!D66)","v":"  "},{"$f":"Inscription!E66","v":0},{"$f":"Inscription!F66","v":0},{"$f":"Inscription!G66","v":0}]
[{"$f":"Inscription!A67","v":56},{"$f":"CONCATENATE(Inscription!C67,\"  \",Inscription!D67)","v":"  "},{"$f":"Inscription!E67","v":0},{"$f":"Inscription!F67","v":0},{"$f":"Inscription!G67","v":0}]
[{"$f":"Inscription!A68","v":57},{"$f":"CONCATENATE(Inscription!C68,\"  \",Inscription!D68)","v":"  "},{"$f":"Inscription!E68","v":0},{"$f":"Inscription!F68","v":0},{"$f":"Inscription!G68","v":0}]
[{"$f":"Inscription!A69","v":58},{"$f":"CONCATENATE(Inscription!C69,\"  \",Inscription!D69)","v":"  "},{"$f":"Inscription!E69","v":0},{"$f":"Inscription!F69","v":0},{"$f":"Inscription!G69","v":0}]
[{"$f":"Inscription!A70","v":59},{"$f":"CONCATENATE(Inscription!C70,\"  \",Inscription!D70)","v":"  "},{"$f":"Inscription!E70","v":0},{"$f":"Inscription!F70","v":0},{"$f":"Inscription!G70","v":0}]
[{"$f":"Inscription!A71","v":60},{"$f":"CONCATENATE(Inscription!C71,\"  \",Inscription!D71)","v":"Nicolas  Jean-Charles"},{"$f":"Inscription!E71","v":"AC Vildé-Guingalan"},{"$f":"Inscription!F71","v":137756},{"$f":"Inscription!G71","v":3}]
[{"$f":"Inscription!A72","v":61},{"$f":"CONCATENATE(Inscription!C72,\"  \",Inscription!D72)","v":"Lemaitre   Alain"},{"$f":"Inscription!E72","v":"AC Vildé-Guingalan"},{"$f":"Inscription!F72","v":136151},{"$f":"Inscription!G72","v":3}]
[{"$f":"Inscription!A73","v":62},{"$f":"CONCATENATE(Inscription!C73,\"  \",Inscription!D73)","v":"Lecellier  Raymond"},{"$f":"Inscription!E73","v":"Team Mégrit"},{"$f":"Inscription!F73","v":143624},{"$f":"Inscription!G73","v":3}]
[{"$f":"Inscription!A74","v":63},{"$f":"CONCATENATE(Inscription!C74,\"  \",Inscription!D74)","v":"Georget  Charles"},{"$f":"Inscription!E74","v":"Lamball'breizh"},{"$f":"Inscription!F74","v":136132},{"$f":"Inscription!G74","v":3}]
[{"$f":"Inscription!A75","v":64},{"$f":"CONCATENATE(Inscription!C75,\"  \",Inscription!D75)","v":"Bedel  Michel"},{"$f":"Inscription!E75","v":"Lamball'breizh"},{"$f":"Inscription!F75","v":267277},{"$f":"Inscription!G75","v":3}]
[{"$f":"Inscription!A76","v":65},{"$f":"CONCATENATE(Inscription!C76,\"  \",Inscription!D76)","v":"Colombier  Michel"},{"$f":"Inscription!E76","v":"CC Robert le Roux"},{"$f":"Inscription!F76","v":286379},{"$f":"Inscription!G76","v":3}]
[{"$f":"Inscription!A77","v":66},{"$f":"CONCATENATE(Inscription!C77,\"  \",Inscription!D77)","v":"Gouya  Noël"},{"$f":"Inscription!E77","v":"Team Pays de Dinan"},{"$f":"Inscription!F77","v":136620},{"$f":"Inscription!G77","v":3}]
[{"$f":"Inscription!A78","v":67},{"$f":"CONCATENATE(Inscription!C78,\"  \",Inscription!D78)","v":"Croisier  Ronan"},{"$f":"Inscription!E78","v":"Team Pays de Dinan"},{"$f":"Inscription!F78","v":136268},{"$f":"Inscription!G78","v":3}]
[{"$f":"Inscription!A79","v":68},{"$f":"CONCATENATE(Inscription!C79,\"  \",Inscription!D79)","v":"Durand  Jacques"},{"$f":"Inscription!E79","v":"Team Pays de Dinan"},{"$f":"Inscription!F79","v":136617},{"$f":"Inscription!G79","v":3}]
[{"$f":"Inscription!A80","v":69},{"$f":"CONCATENATE(Inscription!C80,\"  \",Inscription!D80)","v":"Guillot  Denis"},{"$f":"Inscription!E80","v":"Team Pays de Dinan"},{"$f":"Inscription!F80","v":0},{"$f":"Inscription!G80","v":3}]
[{"$f":"Inscription!A81","v":70},{"$f":"CONCATENATE(Inscription!C81,\"  \",Inscription!D81)","v":"Gaillard  Marcel"},{"$f":"Inscription!E81","v":"COS Kerentrech"},{"$f":"Inscription!F81","v":153464},{"$f":"Inscription!G81","v":3}]
[{"$f":"Inscription!A82","v":71},{"$f":"CONCATENATE(Inscription!C82,\"  \",Inscription!D82)","v":"Colleu  Pascal"},{"$f":"Inscription!E82","v":"CCV Beaussais"},{"$f":"Inscription!F82","v":137558},{"$f":"Inscription!G82","v":3}]
[{"$f":"Inscription!A83","v":72},{"$f":"CONCATENATE(Inscription!C83,\"  \",Inscription!D83)","v":"Goupil  Michel"},{"$f":"Inscription!E83","v":"Team Mégrit"},{"$f":"Inscription!F83","v":0},{"$f":"Inscription!G83","v":3}]
[{"$f":"Inscription!A84","v":73},{"$f":"CONCATENATE(Inscription!C84,\"  \",Inscription!D84)","v":"Durand  Francky"},{"$f":"Inscription!E84","v":"CC Moncontour"},{"$f":"Inscription!F84","v":480456},{"$f":"Inscription!G84","v":3}]
[{"$f":"Inscription!A85","v":74},{"$f":"CONCATENATE(Inscription!C85,\"  \",Inscription!D85)","v":"Jeuneu  Gilles"},{"$f":"Inscription!E85","v":"Accro Cycles"},{"$f":"Inscription!F85","v":137390},{"$f":"Inscription!G85","v":3}]
[{"$f":"Inscription!A86","v":75},{"$f":"CONCATENATE(Inscription!C86,\"  \",Inscription!D86)","v":"Pezres  Didier"},{"$f":"Inscription!E86","v":"EC Créhen"},{"$f":"Inscription!F86","v":137518},{"$f":"Inscription!G86","v":3}]
[{"$f":"Inscription!A87","v":76},{"$f":"CONCATENATE(Inscription!C87,\"  \",Inscription!D87)","v":"Colas  Roger"},{"$f":"Inscription!E87","v":"EC Créhen"},{"$f":"Inscription!F87","v":137514},{"$f":"Inscription!G87","v":3}]
[{"$f":"Inscription!A88","v":77},{"$f":"CONCATENATE(Inscription!C88,\"  \",Inscription!D88)","v":"Gouya  Philippe"},{"$f":"Inscription!E88","v":"EC Créhen"},{"$f":"Inscription!F88","v":136134},{"$f":"Inscription!G88","v":3}]
[{"$f":"Inscription!A89","v":78},{"$f":"CONCATENATE(Inscription!C89,\"  \",Inscription!D89)","v":"Gilson  Frédéric"},{"$f":"Inscription!E89","v":"CC Moncontour"},{"$f":"Inscription!F89","v":424247},{"$f":"Inscription!G89","v":3}]
[{"$f":"Inscription!A90","v":79},{"$f":"CONCATENATE(Inscription!C90,\"  \",Inscription!D90)","v":"  "},{"$f":"Inscription!E90","v":0},{"$f":"Inscription!F90","v":0},{"$f":"Inscription!G90","v":0}]
[{"$f":"Inscription!A91","v":80},{"$f":"CONCATENATE(Inscription!C91,\"  \",Inscription!D91)","v":"  "},{"$f":"Inscription!E91","v":0},{"$f":"Inscription!F91","v":0},{"$f":"Inscription!G91","v":0}]
[{"$f":"Inscription!A92","v":81},{"$f":"CONCATENATE(Inscription!C92,\"  \",Inscription!D92)","v":"  "},{"$f":"Inscription!E92","v":0},{"$f":"Inscription!F92","v":0},{"$f":"Inscription!G92","v":0}]
[{"$f":"Inscription!A93","v":82},{"$f":"CONCATENATE(Inscription!C93,\"  \",Inscription!D93)","v":"  "},{"$f":"Inscription!E93","v":0},{"$f":"Inscription!F93","v":0},{"$f":"Inscription!G93","v":0}]
[{"$f":"Inscription!A94","v":83},{"$f":"CONCATENATE(Inscription!C94,\"  \",Inscription!D94)","v":"  "},{"$f":"Inscription!E94","v":0},{"$f":"Inscription!F94","v":0},{"$f":"Inscription!G94","v":0}]
[{"$f":"Inscription!A95","v":84},{"$f":"CONCATENATE(Inscription!C95,\"  \",Inscription!D95)","v":"  "},{"$f":"Inscription!E95","v":0},{"$f":"Inscription!F95","v":0},{"$f":"Inscription!G95","v":0}]
[{"$f":"Inscription!A96","v":85},{"$f":"CONCATENATE(Inscription!C96,\"  \",Inscription!D96)","v":"  "},{"$f":"Inscription!E96","v":0},{"$f":"Inscription!F96","v":0},{"$f":"Inscription!G96","v":0}]
[{"$f":"Inscription!A97","v":86},{"$f":"CONCATENATE(Inscription!C97,\"  \",Inscription!D97)","v":"  "},{"$f":"Inscription!E97","v":0},{"$f":"Inscription!F97","v":0},{"$f":"Inscription!G97","v":0}]
[{"$f":"Inscription!A98","v":87},{"$f":"CONCATENATE(Inscription!C98,\"  \",Inscription!D98)","v":"  "},{"$f":"Inscription!E98","v":0},{"$f":"Inscription!F98","v":0},{"$f":"Inscription!G98","v":0}]
[{"$f":"Inscription!A99","v":88},{"$f":"CONCATENATE(Inscription!C99,\"  \",Inscription!D99)","v":"  "},{"$f":"Inscription!E99","v":0},{"$f":"Inscription!F99","v":0},{"$f":"Inscription!G99","v":0}]
[{"$f":"Inscription!A100","v":89},{"$f":"CONCATENATE(Inscription!C100,\"  \",Inscription!D100)","v":"  "},{"$f":"Inscription!E100","v":0},{"$f":"Inscription!F100","v":0},{"$f":"Inscription!G100","v":0}]
[{"$f":"Inscription!A101","v":90},{"$f":"CONCATENATE(Inscription!C101,\"  \",Inscription!D101)","v":"Camus  Kristell"},{"$f":"Inscription!E101","v":"VC Evron"},{"$f":"Inscription!F101","v":0},{"$f":"Inscription!G101","v":"féminine"}]
[{"$f":"Inscription!A102","v":91},{"$f":"CONCATENATE(Inscription!C102,\"  \",Inscription!D102)","v":"Rivolet  Agnes"},{"$f":"Inscription!E102","v":"VTT Côtes d'Armor Hillion"},{"$f":"Inscription!F102","v":443442},{"$f":"Inscription!G102","v":"féminine"}]
[{"$f":"Inscription!A103","v":92},{"$f":"CONCATENATE(Inscription!C103,\"  \",Inscription!D103)","v":"Leray  Gwladys"},{"$f":"Inscription!E103","v":"Team XC du Léguer"},{"$f":"Inscription!F103","v":359228},{"$f":"Inscription!G103","v":"féminine"}]
[{"$f":"Inscription!A104","v":93},{"$f":"CONCATENATE(Inscription!C104,\"  \",Inscription!D104)","v":"Amice  Florine"},{"$f":"Inscription!E104","v":"Souffle d'espoir"},{"$f":"Inscription!F104","v":137425},{"$f":"Inscription!G104","v":"féminine"}]
[{"$f":"Inscription!A105","v":94},{"$f":"CONCATENATE(Inscription!C105,\"  \",Inscription!D105)","v":"  "},{"$f":"Inscription!E105","v":0},{"$f":"Inscription!F105","v":0},{"$f":"Inscription!G105","v":0}]
[{"$f":"Inscription!A106","v":95},{"$f":"CONCATENATE(Inscription!C106,\"  \",Inscription!D106)","v":"  "},{"$f":"Inscription!E106","v":0},{"$f":"Inscription!F106","v":0},{"$f":"Inscription!G106","v":0}]
[{"$f":"Inscription!A107","v":96},{"$f":"CONCATENATE(Inscription!C107,\"  \",Inscription!D107)","v":"  "},{"$f":"Inscription!E107","v":0},{"$f":"Inscription!F107","v":0},{"$f":"Inscription!G107","v":0}]
[{"$f":"Inscription!A108","v":97},{"$f":"CONCATENATE(Inscription!C108,\"  \",Inscription!D108)","v":"  "},{"$f":"Inscription!E108","v":0},{"$f":"Inscription!F108","v":0},{"$f":"Inscription!G108","v":0}]
[{"$f":"Inscription!A109","v":98},{"$f":"CONCATENATE(Inscription!C109,\"  \",Inscription!D109)","v":"  "},{"$f":"Inscription!E109","v":0},{"$f":"Inscription!F109","v":0},{"$f":"Inscription!G109","v":0}]
[{"$f":"Inscription!A110","v":99},{"$f":"CONCATENATE(Inscription!C110,\"  \",Inscription!D110)","v":"  "},{"$f":"Inscription!E110","v":0},{"$f":"Inscription!F110","v":0},{"$f":"Inscription!G110","v":0}]
[{"$f":"Inscription!A111","v":100},{"$f":"CONCATENATE(Inscription!C111,\"  \",Inscription!D111)","v":"Creseveur  Gurwan"},{"$f":"Inscription!E111","v":"Team XC du Léguer"},{"$f":"Inscription!F111","v":330214},{"$f":"Inscription!G111","v":"Cadet"}]
[{"$f":"Inscription!A112","v":101},{"$f":"CONCATENATE(Inscription!C112,\"  \",Inscription!D112)","v":"Flégeau  Gaël"},{"$f":"Inscription!E112","v":"Team Bikers 22"},{"$f":"Inscription!F112","v":269847},{"$f":"Inscription!G112","v":"cadet"}]
[{"$f":"Inscription!A113","v":102},{"$f":"CONCATENATE(Inscription!C113,\"  \",Inscription!D113)","v":"Rouille  Robin"},{"$f":"Inscription!E113","v":"Team Bikers 22"},{"$f":"Inscription!F113","v":390947},{"$f":"Inscription!G113","v":"cadet"}]
[{"$f":"Inscription!A114","v":103},{"$f":"CONCATENATE(Inscription!C114,\"  \",Inscription!D114)","v":"Madec  Rafael"},{"$f":"Inscription!E114","v":"VS Ploumagoar"},{"$f":"Inscription!F114","v":0},{"$f":"Inscription!G114","v":"cadet"}]
[{"$f":"Inscription!A115","v":104},{"$f":"CONCATENATE(Inscription!C115,\"  \",Inscription!D115)","v":"Durand  Joan"},{"$f":"Inscription!E115","v":"Lamball'breizh"},{"$f":"Inscription!F115","v":383110},{"$f":"Inscription!G115","v":"cadet"}]
[{"$f":"Inscription!A116","v":105},{"$f":"CONCATENATE(Inscription!C116,\"  \",Inscription!D116)","v":"Cadieu  Martin"},{"$f":"Inscription!E116","v":"VTT du Lié"},{"$f":"Inscription!F116","v":0},{"$f":"Inscription!G116","v":"Cadet"}]
[{"$f":"Inscription!A117","v":106},{"$f":"CONCATENATE(Inscription!C117,\"  \",Inscription!D117)","v":"  "},{"$f":"Inscription!E117","v":0},{"$f":"Inscription!F117","v":0},{"$f":"Inscription!G117","v":0}]
[{"$f":"Inscription!A118","v":107},{"$f":"CONCATENATE(Inscription!C118,\"  \",Inscription!D118)","v":"  "},{"$f":"Inscription!E118","v":0},{"$f":"Inscription!F118","v":0},{"$f":"Inscription!G118","v":0}]
[{"$f":"Inscription!A119","v":108},{"$f":"CONCATENATE(Inscription!C119,\"  \",Inscription!D119)","v":"  "},{"$f":"Inscription!E119","v":0},{"$f":"Inscription!F119","v":0},{"$f":"Inscription!G119","v":0}]
[{"$f":"Inscription!A120","v":109},{"$f":"CONCATENATE(Inscription!C120,\"  \",Inscription!D120)","v":"  "},{"$f":"Inscription!E120","v":0},{"$f":"Inscription!F120","v":0},{"$f":"Inscription!G120","v":0}]
[{"$f":"Inscription!A121","v":110},{"$f":"CONCATENATE(Inscription!C121,\"  \",Inscription!D121)","v":"Le Bihan  Clément"},{"$f":"Inscription!E121","v":"UC Plaudren"},{"$f":"Inscription!F121","v":136145},{"$f":"Inscription!G121","v":"minime"}]
[{"$f":"Inscription!A122","v":111},{"$f":"CONCATENATE(Inscription!C122,\"  \",Inscription!D122)","v":"Besnard colas  Ismaël"},{"$f":"Inscription!E122","v":"CC Moncontour"},{"$f":"Inscription!F122","v":400382},{"$f":"Inscription!G122","v":"minime"}]
[{"$f":"Inscription!A123","v":112},{"$f":"CONCATENATE(Inscription!C123,\"  \",Inscription!D123)","v":"Le Bihan  Evann"},{"$f":"Inscription!E123","v":"UC Plaudren"},{"$f":"Inscription!F123","v":379622},{"$f":"Inscription!G123","v":"minime"}]
[{"$f":"Inscription!A124","v":113},{"$f":"CONCATENATE(Inscription!C124,\"  \",Inscription!D124)","v":"Henry  Sulian"},{"$f":"Inscription!E124","v":"VC Dinan"},{"$f":"Inscription!F124","v":486449},{"$f":"Inscription!G124","v":"Minime"}]
[{"$f":"Inscription!A125","v":114},{"$f":"CONCATENATE(Inscription!C125,\"  \",Inscription!D125)","v":"Briand  Mathis"},{"$f":"Inscription!E125","v":"VC Evron"},{"$f":"Inscription!F125","v":431995},{"$f":"Inscription!G125","v":"minime"}]
[{"$f":"Inscription!A126","v":115},{"$f":"CONCATENATE(Inscription!C126,\"  \",Inscription!D126)","v":"le Corguille  Brieuc"},{"$f":"Inscription!E126","v":"VC Plurien"},{"$f":"Inscription!F126","v":434773},{"$f":"Inscription!G126","v":"minime"}]
[{"$f":"Inscription!A127","v":116},{"$f":"CONCATENATE(Inscription!C127,\"  \",Inscription!D127)","v":"  "},{"$f":"Inscription!E127","v":0},{"$f":"Inscription!F127","v":0},{"$f":"Inscription!G127","v":0}]
[{"$f":"Inscription!A128","v":117},{"$f":"CONCATENATE(Inscription!C128,\"  \",Inscription!D128)","v":"  "},{"$f":"Inscription!E128","v":0},{"$f":"Inscription!F128","v":0},{"$f":"Inscription!G128","v":0}]
[{"$f":"Inscription!A129","v":118},{"$f":"CONCATENATE(Inscription!C129,\"  \",Inscription!D129)","v":"  "},{"$f":"Inscription!E129","v":0},{"$f":"Inscription!F129","v":0},{"$f":"Inscription!G129","v":0}]
[{"$f":"Inscription!A130","v":119},{"$f":"CONCATENATE(Inscription!C130,\"  \",Inscription!D130)","v":"  "},{"$f":"Inscription!E130","v":0},{"$f":"Inscription!F130","v":0},{"$f":"Inscription!G130","v":0}]
[{"$f":"Inscription!A131","v":120},{"$f":"CONCATENATE(Inscription!C131,\"  \",Inscription!D131)","v":"Briand  Axel"},{"$f":"Inscription!E131","v":"VC Evron"},{"$f":"Inscription!F131","v":429219},{"$f":"Inscription!G131","v":"Benjamin"}]
[{"$f":"Inscription!A132","v":121},{"$f":"CONCATENATE(Inscription!C132,\"  \",Inscription!D132)","v":"Croisier  Léa"},{"$f":"Inscription!E132","v":"Team Pays de Dinan"},{"$f":"Inscription!F132","v":263040},{"$f":"Inscription!G132","v":"Benjamin"}]
[{"$f":"Inscription!A133","v":122},{"$f":"CONCATENATE(Inscription!C133,\"  \",Inscription!D133)","v":"Huguet  Mathis"},{"$f":"Inscription!E133","v":"Team Bikers 22"},{"$f":"Inscription!F133","v":390457},{"$f":"Inscription!G133","v":"Benjamin"}]
[{"$f":"Inscription!A134","v":123},{"$f":"CONCATENATE(Inscription!C134,\"  \",Inscription!D134)","v":"Macé  Tom"},{"$f":"Inscription!E134","v":"Team Broons"},{"$f":"Inscription!F134","v":256614},{"$f":"Inscription!G134","v":"Benjamin"}]
[{"$f":"Inscription!A135","v":124},{"$f":"CONCATENATE(Inscription!C135,\"  \",Inscription!D135)","v":"Callennec  Lucy"},{"$f":"Inscription!E135","v":"Bégard VTT Gwerun"},{"$f":"Inscription!F135","v":509013},{"$f":"Inscription!G135","v":"Benjamin"}]
[{"$f":"Inscription!A136","v":125},{"$f":"CONCATENATE(Inscription!C136,\"  \",Inscription!D136)","v":"Lebret  Sacha"},{"$f":"Inscription!E136","v":"Team Bikers 22"},{"$f":"Inscription!F136","v":390946},{"$f":"Inscription!G136","v":"Benjamin"}]
[{"$f":"Inscription!A137","v":126},{"$f":"CONCATENATE(Inscription!C137,\"  \",Inscription!D137)","v":"Lanoé  Hugo"},{"$f":"Inscription!E137","v":"VC Evron"},{"$f":"Inscription!F137","v":382435},{"$f":"Inscription!G137","v":"Benjamin"}]
[{"$f":"Inscription!A138","v":127},{"$f":"CONCATENATE(Inscription!C138,\"  \",Inscription!D138)","v":"Creseveur  Gwenvael"},{"$f":"Inscription!E138","v":"Team XC du Léguer"},{"$f":"Inscription!F138","v":330214},{"$f":"Inscription!G138","v":"Benjamin"}]
[{"$f":"Inscription!A139","v":128},{"$f":"CONCATENATE(Inscription!C139,\"  \",Inscription!D139)","v":"Lévéque  Noé"},{"$f":"Inscription!E139","v":"Accro Cycles"},{"$f":"Inscription!F139","v":337516},{"$f":"Inscription!G139","v":"Benjamin"}]
[{"$f":"Inscription!A140","v":129},{"$f":"CONCATENATE(Inscription!C140,\"  \",Inscription!D140)","v":"Colas  Thibault"},{"$f":"Inscription!E140","v":"Team XC du Léguer"},{"$f":"Inscription!F140","v":330206},{"$f":"Inscription!G140","v":"Benjamin"}]
[{"$f":"Inscription!A141","v":130},{"$f":"CONCATENATE(Inscription!C141,\"  \",Inscription!D141)","v":"Remond  Malo"},{"$f":"Inscription!E141","v":"Team XC du Léguer"},{"$f":"Inscription!F141","v":395912},{"$f":"Inscription!G141","v":"benjamin"}]
[{"$f":"Inscription!A142","v":131},{"$f":"CONCATENATE(Inscription!C142,\"  \",Inscription!D142)","v":"Auffret  Siméon"},{"$f":"Inscription!E142","v":"VC Plurien"},{"$f":"Inscription!F142","v":459988},{"$f":"Inscription!G142","v":"benjamin"}]
[{"$f":"Inscription!A143","v":132},{"$f":"CONCATENATE(Inscription!C143,\"  \",Inscription!D143)","v":"Gerard  Jules"},{"$f":"Inscription!E143","v":"Team Bikers 22"},{"$f":"Inscription!F143","v":491636},{"$f":"Inscription!G143","v":"Benjamin"}]
[{"$f":"Inscription!A144","v":133},{"$f":"CONCATENATE(Inscription!C144,\"  \",Inscription!D144)","v":"Cadieu  Gabriel"},{"$f":"Inscription!E144","v":"VTT du Lié"},{"$f":"Inscription!F144","v":0},{"$f":"Inscription!G144","v":"benjamin"}]
[{"$f":"Inscription!A145","v":134},{"$f":"CONCATENATE(Inscription!C145,\"  \",Inscription!D145)","v":"  "},{"$f":"Inscription!E145","v":0},{"$f":"Inscription!F145","v":0},{"$f":"Inscription!G145","v":0}]
[{"$f":"Inscription!A146","v":135},{"$f":"CONCATENATE(Inscription!C146,\"  \",Inscription!D146)","v":"  "},{"$f":"Inscription!E146","v":0},{"$f":"Inscription!F146","v":0},{"$f":"Inscription!G146","v":0}]
[{"$f":"Inscription!A147","v":136},{"$f":"CONCATENATE(Inscription!C147,\"  \",Inscription!D147)","v":"  "},{"$f":"Inscription!E147","v":0},{"$f":"Inscription!F147","v":0},{"$f":"Inscription!G147","v":0}]
[{"$f":"Inscription!A148","v":137},{"$f":"CONCATENATE(Inscription!C148,\"  \",Inscription!D148)","v":"  "},{"$f":"Inscription!E148","v":0},{"$f":"Inscription!F148","v":0},{"$f":"Inscription!G148","v":0}]
[{"$f":"Inscription!A149","v":138},{"$f":"CONCATENATE(Inscription!C149,\"  \",Inscription!D149)","v":"  "},{"$f":"Inscription!E149","v":0},{"$f":"Inscription!F149","v":0},{"$f":"Inscription!G149","v":0}]
[{"$f":"Inscription!A150","v":139},{"$f":"CONCATENATE(Inscription!C150,\"  \",Inscription!D150)","v":"  "},{"$f":"Inscription!E150","v":0},{"$f":"Inscription!F150","v":0},{"$f":"Inscription!G150","v":0}]
[{"$f":"Inscription!A151","v":140},{"$f":"CONCATENATE(Inscription!C151,\"  \",Inscription!D151)","v":"Meunier Le Breton  Lilwena"},{"$f":"Inscription!E151","v":"VTT Côtes D'Armor Hillion"},{"$f":"Inscription!F151","v":369755},{"$f":"Inscription!G151","v":"pupille"}]
[{"$f":"Inscription!A152","v":141},{"$f":"CONCATENATE(Inscription!C152,\"  \",Inscription!D152)","v":"Bruezière  Enzo"},{"$f":"Inscription!E152","v":"Team Bikers 22"},{"$f":"Inscription!F152","v":459065},{"$f":"Inscription!G152","v":"pupille"}]
[{"$f":"Inscription!A153","v":142},{"$f":"CONCATENATE(Inscription!C153,\"  \",Inscription!D153)","v":"Rouillé Biard  Manech"},{"$f":"Inscription!E153","v":"VTT Côtes D'Armor Hillion"},{"$f":"Inscription!F153","v":451260},{"$f":"Inscription!G153","v":"pupille"}]
[{"$f":"Inscription!A154","v":143},{"$f":"CONCATENATE(Inscription!C154,\"  \",Inscription!D154)","v":"Kowalski  Paul"},{"$f":"Inscription!E154","v":"Team Bikers 22"},{"$f":"Inscription!F154","v":460607},{"$f":"Inscription!G154","v":"pupille"}]
[{"$f":"Inscription!A155","v":144},{"$f":"CONCATENATE(Inscription!C155,\"  \",Inscription!D155)","v":"Devaux  Naël"},{"$f":"Inscription!E155","v":"Team Bikers 22"},{"$f":"Inscription!F155","v":0},{"$f":"Inscription!G155","v":"Pupille"}]
[{"$f":"Inscription!A156","v":145},{"$f":"CONCATENATE(Inscription!C156,\"  \",Inscription!D156)","v":"  "},{"$f":"Inscription!E156","v":0},{"$f":"Inscription!F156","v":0},{"$f":"Inscription!G156","v":0}]
[{"$f":"Inscription!A157","v":146},{"$f":"CONCATENATE(Inscription!C157,\"  \",Inscription!D157)","v":"  "},{"$f":"Inscription!E157","v":0},{"$f":"Inscription!F157","v":0},{"$f":"Inscription!G157","v":0}]
[{"$f":"Inscription!A158","v":147},{"$f":"CONCATENATE(Inscription!C158,\"  \",Inscription!D158)","v":"  "},{"$f":"Inscription!E158","v":0},{"$f":"Inscription!F158","v":0},{"$f":"Inscription!G158","v":0}]
[{"$f":"Inscription!A159","v":148},{"$f":"CONCATENATE(Inscription!C159,\"  \",Inscription!D159)","v":"  "},{"$f":"Inscription!E159","v":0},{"$f":"Inscription!F159","v":0},{"$f":"Inscription!G159","v":0}]
[{"$f":"Inscription!A160","v":149},{"$f":"CONCATENATE(Inscription!C160,\"  \",Inscription!D160)","v":"  "},{"$f":"Inscription!E160","v":0},{"$f":"Inscription!F160","v":0},{"$f":"Inscription!G160","v":0}]
[{"$f":"Inscription!A161","v":150},{"$f":"CONCATENATE(Inscription!C161,\"  \",Inscription!D161)","v":"  "},{"$f":"Inscription!E161","v":0},{"$f":"Inscription!F161","v":0},{"$f":"Inscription!G161","v":0}]
[{"$f":"Inscription!A162","v":151},{"$f":"CONCATENATE(Inscription!C162,\"  \",Inscription!D162)","v":"  "},{"$f":"Inscription!E162","v":0},{"$f":"Inscription!F162","v":0},{"$f":"Inscription!G162","v":0}]
[{"$f":"Inscription!A163","v":152},{"$f":"CONCATENATE(Inscription!C163,\"  \",Inscription!D163)","v":"  "},{"$f":"Inscription!E163","v":0},{"$f":"Inscription!F163","v":0},{"$f":"Inscription!G163","v":0}]
[{"$f":"Inscription!A164","v":153},{"$f":"CONCATENATE(Inscription!C164,\"  \",Inscription!D164)","v":"  "},{"$f":"Inscription!E164","v":0},{"$f":"Inscription!F164","v":0},{"$f":"Inscription!G164","v":0}]
[{"$f":"Inscription!A165","v":154},{"$f":"CONCATENATE(Inscription!C165,\"  \",Inscription!D165)","v":"  "},{"$f":"Inscription!E165","v":0},{"$f":"Inscription!F165","v":0},{"$f":"Inscription!G165","v":0}]
[{"$f":"Inscription!A166","v":155},{"$f":"CONCATENATE(Inscription!C166,\"  \",Inscription!D166)","v":"  "},{"$f":"Inscription!E166","v":0},{"$f":"Inscription!F166","v":0},{"$f":"Inscription!G166","v":0}]
[{"$f":"Inscription!A167","v":156},{"$f":"CONCATENATE(Inscription!C167,\"  \",Inscription!D167)","v":"  "},{"$f":"Inscription!E167","v":0},{"$f":"Inscription!F167","v":0},{"$f":"Inscription!G167","v":0}]
[{"$f":"Inscription!A168","v":157},{"$f":"CONCATENATE(Inscription!C168,\"  \",Inscription!D168)","v":"  "},{"$f":"Inscription!E168","v":0},{"$f":"Inscription!F168","v":0},{"$f":"Inscription!G168","v":0}]
[{"$f":"Inscription!A169","v":158},{"$f":"CONCATENATE(Inscription!C169,\"  \",Inscription!D169)","v":"  "},{"$f":"Inscription!E169","v":0},{"$f":"Inscription!F169","v":0},{"$f":"Inscription!G169","v":0}]
[{"$f":"Inscription!A170","v":159},{"$f":"CONCATENATE(Inscription!C170,\"  \",Inscription!D170)","v":"  "},{"$f":"Inscription!E170","v":0},{"$f":"Inscription!F170","v":0},{"$f":"Inscription!G170","v":0}]
[{"$f":"Inscription!A171","v":160},{"$f":"CONCATENATE(Inscription!C171,\"  \",Inscription!D171)","v":"Macé  Loukas"},{"$f":"Inscription!E171","v":"VC Evron"},{"$f":"Inscription!F171","v":396776},{"$f":"Inscription!G171","v":"poussin"}]
[{"$f":"Inscription!A172","v":161},{"$f":"CONCATENATE(Inscription!C172,\"  \",Inscription!D172)","v":"Leveque  Nathan"},{"$f":"Inscription!E172","v":"Lamball'breizh"},{"$f":"Inscription!F172","v":435105},{"$f":"Inscription!G172","v":"poussin"}]
[{"$f":"Inscription!A173","v":162},{"$f":"CONCATENATE(Inscription!C173,\"  \",Inscription!D173)","v":"Lévèque  Clément"},{"$f":"Inscription!E173","v":"Accro Cycles"},{"$f":"Inscription!F173","v":377265},{"$f":"Inscription!G173","v":"poussin"}]
[{"$f":"Inscription!A174","v":163},{"$f":"CONCATENATE(Inscription!C174,\"  \",Inscription!D174)","v":"Vitel  Manoë"},{"$f":"Inscription!E174","v":"Team Bikers 22"},{"$f":"Inscription!F174","v":0},{"$f":"Inscription!G174","v":"Poussin"}]
[{"$f":"Inscription!A175","v":164},{"$f":"CONCATENATE(Inscription!C175,\"  \",Inscription!D175)","v":"Gouret  Louison"},{"$f":"Inscription!E175","v":"VC Evron"},{"$f":"Inscription!F175","v":0},{"$f":"Inscription!G175","v":"poussin"}]
[{"$f":"Inscription!A176","v":165},{"$f":"CONCATENATE(Inscription!C176,\"  \",Inscription!D176)","v":"Raoult  Léon"},{"$f":"Inscription!E176","v":"VC Evron"},{"$f":"Inscription!F176","v":0},{"$f":"Inscription!G176","v":"poussin"}]
[{"$f":"Inscription!A177","v":166},{"$f":"CONCATENATE(Inscription!C177,\"  \",Inscription!D177)","v":"Boilet  Malo"},{"$f":"Inscription!E177","v":"Lamball'breizh"},{"$f":"Inscription!F177","v":520459},{"$f":"Inscription!G177","v":"poussin"}]
[{"$f":"Inscription!A178","v":167},{"$f":"CONCATENATE(Inscription!C178,\"  \",Inscription!D178)","v":"  "},{"$f":"Inscription!E178","v":0},{"$f":"Inscription!F178","v":0},{"$f":"Inscription!G178","v":0}]
[{"$f":"Inscription!A179","v":168},{"$f":"CONCATENATE(Inscription!C179,\"  \",Inscription!D179)","v":"  "},{"$f":"Inscription!E179","v":0},{"$f":"Inscription!F179","v":0},{"$f":"Inscription!G179","v":0}]
[{"$f":"Inscription!A180","v":169},{"$f":"CONCATENATE(Inscription!C180,\"  \",Inscription!D180)","v":"  "},{"$f":"Inscription!E180","v":0},{"$f":"Inscription!F180","v":0},{"$f":"Inscription!G180","v":0}]
[{"$f":"Inscription!A181","v":170},{"$f":"CONCATENATE(Inscription!C181,\"  \",Inscription!D181)","v":"Brueziere  Eden"},{"$f":"Inscription!E181","v":"Team Bikers 22"},{"$f":"Inscription!F181","v":491634},{"$f":"Inscription!G181","v":"moustique"}]
[{"$f":"Inscription!A182","v":171},{"$f":"CONCATENATE(Inscription!C182,\"  \",Inscription!D182)","v":"  "},{"$f":"Inscription!E182","v":0},{"$f":"Inscription!F182","v":0},{"$f":"Inscription!G182","v":0}]
[{"$f":"Inscription!A183","v":172},{"$f":"CONCATENATE(Inscription!C183,\"  \",Inscription!D183)","v":"  "},{"$f":"Inscription!E183","v":0},{"$f":"Inscription!F183","v":0},{"$f":"Inscription!G183","v":0}]
[{"$f":"Inscription!A184","v":173},{"$f":"CONCATENATE(Inscription!C184,\"  \",Inscription!D184)","v":"  "},{"$f":"Inscription!E184","v":0},{"$f":"Inscription!F184","v":0},{"$f":"Inscription!G184","v":0}]
[{"$f":"Inscription!A185","v":174},{"$f":"CONCATENATE(Inscription!C185,\"  \",Inscription!D185)","v":"  "},{"$f":"Inscription!E185","v":0},{"$f":"Inscription!F185","v":0},{"$f":"Inscription!G185","v":0}]
[{"$f":"Inscription!A186","v":175},{"$f":"CONCATENATE(Inscription!C186,\"  \",Inscription!D186)","v":"  "},{"$f":"Inscription!E186","v":0},{"$f":"Inscription!F186","v":0},{"$f":"Inscription!G186","v":0}]
[{"$f":"Inscription!A187","v":176},{"$f":"CONCATENATE(Inscription!C187,\"  \",Inscription!D187)","v":"  "},{"$f":"Inscription!E187","v":0},{"$f":"Inscription!F187","v":0},{"$f":"Inscription!G187","v":0}]
[{"$f":"Inscription!A188","v":177},{"$f":"CONCATENATE(Inscription!C188,\"  \",Inscription!D188)","v":"  "},{"$f":"Inscription!E188","v":0},{"$f":"Inscription!F188","v":0},{"$f":"Inscription!G188","v":0}]
[{"$f":"Inscription!A189","v":178},{"$f":"CONCATENATE(Inscription!C189,\"  \",Inscription!D189)","v":"  "},{"$f":"Inscription!E189","v":0},{"$f":"Inscription!F189","v":0},{"$f":"Inscription!G189","v":0}]
[{"$f":"Inscription!A190","v":179},{"$f":"CONCATENATE(Inscription!C190,\"  \",Inscription!D190)","v":"  "},{"$f":"Inscription!E190","v":0},{"$f":"Inscription!F190","v":0},{"$f":"Inscription!G190","v":0}]
[{"$f":"Inscription!A191","v":180},{"$f":"CONCATENATE(Inscription!C191,\"  \",Inscription!D191)","v":"  "},{"$f":"Inscription!E191","v":0},{"$f":"Inscription!F191","v":0},{"$f":"Inscription!G191","v":0}]
[{"$f":"Inscription!A192","v":181},{"$f":"CONCATENATE(Inscription!C192,\"  \",Inscription!D192)","v":"  "},{"$f":"Inscription!E192","v":0},{"$f":"Inscription!F192","v":0},{"$f":"Inscription!G192","v":0}]
[{"$f":"Inscription!A193","v":182},{"$f":"CONCATENATE(Inscription!C193,\"  \",Inscription!D193)","v":"  "},{"$f":"Inscription!E193","v":0},{"$f":"Inscription!F193","v":0},{"$f":"Inscription!G193","v":0}]
[{"$f":"Inscription!A194","v":183},{"$f":"CONCATENATE(Inscription!C194,\"  \",Inscription!D194)","v":"  "},{"$f":"Inscription!E194","v":0},{"$f":"Inscription!F194","v":0},{"$f":"Inscription!G194","v":0}]
[{"$f":"Inscription!A195","v":184},{"$f":"CONCATENATE(Inscription!C195,\"  \",Inscription!D195)","v":"  "},{"$f":"Inscription!E195","v":0},{"$f":"Inscription!F195","v":0},{"$f":"Inscription!G195","v":0}]
[{"$f":"Inscription!A196","v":185},{"$f":"CONCATENATE(Inscription!C196,\"  \",Inscription!D196)","v":"  "},{"$f":"Inscription!E196","v":0},{"$f":"Inscription!F196","v":0},{"$f":"Inscription!G196","v":0}]
[{"$f":"Inscription!A197","v":186},{"$f":"CONCATENATE(Inscription!C197,\"  \",Inscription!D197)","v":"  "},{"$f":"Inscription!E197","v":0},{"$f":"Inscription!F197","v":0},{"$f":"Inscription!G197","v":0}]
[{"$f":"Inscription!A198","v":187},{"$f":"CONCATENATE(Inscription!C198,\"  \",Inscription!D198)","v":"  "},{"$f":"Inscription!E198","v":0},{"$f":"Inscription!F198","v":0},{"$f":"Inscription!G198","v":0}]
[{"$f":"Inscription!A199","v":188},{"$f":"CONCATENATE(Inscription!C199,\"  \",Inscription!D199)","v":"  "},{"$f":"Inscription!E199","v":0},{"$f":"Inscription!F199","v":0},{"$f":"Inscription!G199","v":0}]
[{"$f":"Inscription!A200","v":189},{"$f":"CONCATENATE(Inscription!C200,\"  \",Inscription!D200)","v":"  "},{"$f":"Inscription!E200","v":0},{"$f":"Inscription!F200","v":0},{"$f":"Inscription!G200","v":0}]
[{"$f":"Inscription!A201","v":190},{"$f":"CONCATENATE(Inscription!C201,\"  \",Inscription!D201)","v":"  "},{"$f":"Inscription!E201","v":0},{"$f":"Inscription!F201","v":0},{"$f":"Inscription!G201","v":0}]
[{"$f":"Inscription!A202","v":191},{"$f":"CONCATENATE(Inscription!C202,\"  \",Inscription!D202)","v":"  "},{"$f":"Inscription!E202","v":0},{"$f":"Inscription!F202","v":0},{"$f":"Inscription!G202","v":0}]
[{"$f":"Inscription!A203","v":192},{"$f":"CONCATENATE(Inscription!C203,\"  \",Inscription!D203)","v":"  "},{"$f":"Inscription!E203","v":0},{"$f":"Inscription!F203","v":0},{"$f":"Inscription!G203","v":0}]
[{"$f":"Inscription!A204","v":193},{"$f":"CONCATENATE(Inscription!C204,\"  \",Inscription!D204)","v":"  "},{"$f":"Inscription!E204","v":0},{"$f":"Inscription!F204","v":0},{"$f":"Inscription!G204","v":0}]
[{"$f":"Inscription!A205","v":194},{"$f":"CONCATENATE(Inscription!C205,\"  \",Inscription!D205)","v":"  "},{"$f":"Inscription!E205","v":0},{"$f":"Inscription!F205","v":0},{"$f":"Inscription!G205","v":0}]
[{"$f":"Inscription!A206","v":195},{"$f":"CONCATENATE(Inscription!C206,\"  \",Inscription!D206)","v":"  "},{"$f":"Inscription!E206","v":0},{"$f":"Inscription!F206","v":0},{"$f":"Inscription!G206","v":0}]
[{"$f":"Inscription!A207","v":196},{"$f":"CONCATENATE(Inscription!C207,\"  \",Inscription!D207)","v":"  "},{"$f":"Inscription!E207","v":0},{"$f":"Inscription!F207","v":0},{"$f":"Inscription!G207","v":0}]
[{"$f":"Inscription!A208","v":197},{"$f":"CONCATENATE(Inscription!C208,\"  \",Inscription!D208)","v":"  "},{"$f":"Inscription!E208","v":0},{"$f":"Inscription!F208","v":0},{"$f":"Inscription!G208","v":0}]
[{"$f":"Inscription!A209","v":198},{"$f":"CONCATENATE(Inscription!C209,\"  \",Inscription!D209)","v":"  "},{"$f":"Inscription!E209","v":0},{"$f":"Inscription!F209","v":0},{"$f":"Inscription!G209","v":0}]
[{"$f":"Inscription!A210","v":199},{"$f":"CONCATENATE(Inscription!C210,\"  \",Inscription!D210)","v":"  "},{"$f":"Inscription!E210","v":0},{"$f":"Inscription!F210","v":0},{"$f":"Inscription!G210","v":0}]
[{"$f":"Inscription!A211","v":200},{"$f":"CONCATENATE(Inscription!C211,\"  \",Inscription!D211)","v":"  "},{"$f":"Inscription!E211","v":0},{"$f":"Inscription!F211","v":0},{"$f":"Inscription!G211","v":0}]

{"sheet":"CLASSEMENT","index":5,"n_rows":204,"n_cols":36,"rows_kept":204,"cut":false,"hidden":false,"merged":[[2,3,2,4],[0,6,0,7],[0,0,0,1],[1,0,1,1],[1,2,1,4],[0,2,0,5]]}
["COURSE",null,{"$f":"CONCATENATE(Inscription!D2,\"  \",Inscription!G2)","v":"cyclo cross de Créhen  "},null,null,null,{"$f":"IF(Inscription!$D$4>0,\"DATE :  \"&TEXT(Inscription!D$4,\"jj mmmm aaaa\"),\"\")","v":"DATE :  30 novembre 2024"}]
["CATEGORIE",null,{"$f":"Inscription!D5","v":0},null,null,"PARTANTS",{"$f":"Inscription!F8","v":0},"CLASSES"]
["Pts\n PE","Place","Doss","NOM et PRENOM",null,"CLUB","N° LICENCE","CAT.",null,"PLACE","TPS"]
[{"$f":"IF(B4<1,1000,(IF(Z4=B4,B4,(20100-SUM($Z$4:$Z$204))/(COUNTIF($Z$4:$Z$204,\"T\")))))","v":1000},null,null,{"$f":"IF(C4>0,CONCATENATE((VLOOKUP($C4,Inscription!$A$12:$G$211,3,FALSE)),\"   \",(VLOOKUP($C4,Inscription!$A$12:$G$211,4,FALSE))),\" \")","v":" "},null,{"$f":"IF(C4>0,(VLOOKUP($C4,Inscription!$A$12:$G$211,5,FALSE)),\" \")","v":" "},{"$f":"IF(C4>0,(VLOOKUP($C4,Inscription!$A$12:$G$211,7,FALSE)),\" \")","v":" "},{"$f":"LEFT(IF(C4>0,(VLOOKUP($C4,Inscription!$A$12:$G$211,6,FALSE)),\" \"),8)","v":" "},{"$f":"IF(COUNTIF($F4:$F$4,$F4)<2,$F4,\" \")","v":" "},{"$f":"IF(I4=F4,A4,\"\")","v":1000},{"$f":"IF(I4=F4,#REF!,\"\")","v":{"$error":"#REF!"}},{"$f":"IF(COUNTIF($F4:$F$4,$F4)<3,$F4,\" \")","v":" "},{"$f":"IF(L4=$F4,$A4,\"\")","v":1000},{"$f":"IF(L4=$F4,#REF!,\"\")","v":{"$error":"#REF!"}},{"$f":"IF(L4=I4,\"\",L4)","v":""},{"$f":"IF(O4=$F4,$A4,1000)","v":1000},{"$f":"IF(O4=$F4,#REF!,1000)","v":1000},{"$f":"IF(COUNTIF($F4:$F$4,I4)<4,$F4,\" \")","v":" "},{"$f":"IF(R4=$F4,$A4,\"\")","v":1000},{"$f":"IF(R4=$F4,#REF!,\"\")","v":{"$error":"#REF!"}},{"$f":"IF(R4=I4,\"\",R4)","v":""},{"$f":"IF(U4=O4,\"\",R4)","v":""},{"$f":"IF(V4=$F4,$A4,\"\")","v":""},{"$f":"IF(V4=$F4,#REF!,\"\")","v":""},{"$f":"IF(COUNTIF($C$4:$C$204,C4)>1,\"X\",\" \")","v":" "},{"$f":"IF(COUNTIF($B$4:$B$204,B4)>1,\"T\",B4)","v":0}]
[{"$error":"#REF!"},1,170,{"$f":"IF(C5>0,CONCATENATE((VLOOKUP($C5,Inscription!$A$12:$G$211,3,FALSE)),\"   \",(VLOOKUP($C5,Inscription!$A$12:$G$211,4,FALSE))),\" \")","v":"Brueziere   Eden"},null,{"$f":"IF(C5>0,(VLOOKUP($C5,Inscription!$A$12:$G$211,5,FALSE)),\" \")","v":"Team Bikers 22"},{"$f":"IF(C5>0,(VLOOKUP($C5,Inscription!$A$12:$G$211,7,FALSE)),\" \")","v":"moustique"},{"$f":"LEFT(IF(C5>0,(VLOOKUP($C5,Inscription!$A$12:$G$211,6,FALSE)),\" \"),8)","v":"491634"},{"$f":"IF(COUNTIF($F$4:$F5,$F5)<2,$F5,\" \")","v":"Team Bikers 22"},{"$error":"#REF!"},{"$f":"IF(I5=F5,#REF!,\"\")","v":{"$error":"#REF!"}},{"$f":"IF(COUNTIF($F$4:$F5,$F5)<3,$F5,\" \")","v":"Team Bikers 22"},{"$f":"IF(L5=$F5,$A5,\"\")","v":{"$error":"#REF!"}},{"$f":"IF(L5=$F5,#REF!,\"\")","v":{"$error":"#REF!"}},{"$f":"IF(L5=I5,\"\",L5)","v":""},{"$f":"IF(O5=$F5,$A5,1000)","v":1000},{"$f":"IF(O5=$F5,#REF!,1000)","v":1000},{"$f":"IF(COUNTIF($F$4:$F5,I5)<4,$F5,\" \")","v":"Team Bikers 22"},{"$f":"IF(R5=$F5,$A5,\"\")","v":{"$error":"#REF!"}},{"$f":"IF(R5=$F5,#REF!,\"\")","v":{"$error":"#REF!"}},{"$f":"IF(R5=I5,\"\",R5)","v":""},{"$f":"IF(U5=O5,\"\",R5)","v":""},{"$f":"IF(V5=$F5,$A5,\"\")","v":""},{"$f":"IF(V5=$F5,#REF!,\"\")","v":""}," ","T",1,{"$f":"'PRIX D EQUIPE'!B5","v":0},{"$f":"IF($AB5=\"\",1000,(IF(ISNA(VLOOKUP($AB5,$I$4:$L$204,2,FALSE)),1000,VLOOKUP($AB5,$I$4:$L$204,2,FALSE))))","v":1000},{"$f":"IF($AB5=\"\",1000,(IF(ISNA(VLOOKUP($AB5,$I$4:$L$204,3,FALSE)),1000,VLOOKUP($AB5,$I$4:$L$204,3,FALSE))))","v":1000},{"$f":"IF($AB5=\"\",1000,(IF(ISNA(VLOOKUP($AB5,$O$4:$Q$204,2,FALSE)),1000,VLOOKUP($AB5,$O$4:$Q$204,2,FALSE))))","v":1000},{"$f":"IF($AB5=\"\",1000,(IF(ISNA(VLOOKUP($AB5,$O$4:$Q$204,3,FALSE)),1000,VLOOKUP($AB5,$O$4:$Q$204,3,FALSE))))","v":1000},{"$f":"IF($AB5=\"\",1000,(IF(ISNA(VLOOKUP($AB5,$V$4:$X$204,2,FALSE)),1000,VLOOKUP($AB5,$V$4:$X$204,2,FALSE))))","v":1000},{"$f":"IF($AB5=\"\",1000,(IF(ISNA(VLOOKUP($AB5,$V$4:$X$204,3,FALSE)),1000,VLOOKUP($AB5,$V$4:$X$204,3,FALSE))))","v":1000},{"$f":"IF(AB5=\" \",\" \",IF($AB5>0,SUM(AC5+AE5+AG5),\" \"))","v":" "},{"$f":"IF(AB5=\" \",\" \",IF($AB5>0,SUM(AD5+AF5+AH5),\" \"))","v":" "}]
[1000,null,null,{"$f":"IF(C6>0,CONCATENATE((VLOOKUP($C6,Inscription!$A$12:$G$211,3,FALSE)),\"   \",(VLOOKUP($C6,Inscription!$A$12:$G$211,4,FALSE))),\" \")","v":" "},null,{"$f":"IF(C6>0,(VLOOKUP($C6,Inscription!$A$12:$G$211,5,FALSE)),\" \")","v":" "},{"$f":"IF(C6>0,(VLOOKUP($C6,Inscription!$A$12:$G$211,7,FALSE)),\" \")","v":" "},{"$f":"LEFT(IF(C6>0,(VLOOKUP($C6,Inscription!$A$12:$G$211,6,FALSE)),\" \"),8)","v":" "},{"$f":"IF(COUNTIF($F$4:$F6,$F6)<2,$F6,\" \")","v":" "},1000,{"$f":"IF(I6=F6,#REF!,\"\")","v":{"$error":"#REF!"}},{"$f":"IF(COUNTIF($F$4:$F6,$F6)<3,$F6,\" \")","v":" "},1000,{"$f":"IF(L6=$F6,#REF!,\"\")","v":{"$error":"#REF!"}},"",1000,{"$f":"IF(O6=$F6,#REF!,1000)","v":1000},{"$f":"IF(COUNTIF($F$4:$F6,I6)<4,$F6,\" \")","v":" "},1000,{"$f":"IF(R6=$F6,#REF!,\"\")","v":{"$error":"#REF!"}},"","","",{"$f":"IF(V6=$F6,#REF!,\"\")","v":""}," ",0,2,{"$f":"'PRIX D EQUIPE'!B6","v":0},1000,1000,1000,1000,1000,1000," "," "]
[1000,null,null,{"$f":"IF(C7>0,CONCATENATE((VLOOKUP($C7,Inscription!$A$12:$G$211,3,FALSE)),\"   \",(VLOOKUP($C7,Inscription!$A$12:$G$211,4,FALSE))),\" \")","v":" "},null,{"$f":"IF(C7>0,(VLOOKUP($C7,Inscription!$A$12:$G$211,5,FALSE)),\" \")","v":" "},{"$f":"IF(C7>0,(VLOOKUP($C7,Inscription!$A$12:$G$211,7,FALSE)),\" \")","v":" "},{"$f":"LEFT(IF(C7>0,(VLOOKUP($C7,Inscription!$A$12:$G$211,6,FALSE)),\" \"),8)","v":" "},{"$f":"IF(COUNTIF($F$4:$F7,$F7)<2,$F7,\" \")","v":" "},1000,{"$f":"IF(I7=F7,#REF!,\"\")","v":{"$error":"#REF!"}},{"$f":"IF(COUNTIF($F$4:$F7,$F7)<3,$F7,\" \")","v":" "},1000,{"$f":"IF(L7=$F7,#REF!,\"\")","v":{"$error":"#REF!"}},"",1000,{"$f":"IF(O7=$F7,#REF!,1000)","v":1000},{"$f":"IF(COUNTIF($F$4:$F7,I7)<4,$F7,\" \")","v":" "},1000,{"$f":"IF(R7=$F7,#REF!,\"\")","v":{"$error":"#REF!"}},"","","",{"$f":"IF(V7=$F7,#REF!,\"\")","v":""}," ",0,3,{"$f":"'PRIX D EQUIPE'!B7","v":0},1000,1000,1000,1000,1000,1000," "," "]
[{"$error":"#REF!"},1,160,{"$f":"IF(C8>0,CONCATENATE((VLOOKUP($C8,Inscription!$A$12:$G$211,3,FALSE)),\"   \",(VLOOKUP($C8,Inscription!$A$12:$G$211,4,FALSE))),\" \")","v":"Macé   Loukas"},null,{"$f":"IF(C8>0,(VLOOKUP($C8,Inscription!$A$12:$G$211,5,FALSE)),\" \")","v":"VC Evron"},{"$f":"IF(C8>0,(VLOOKUP($C8,Inscription!$A$12:$G$211,7,FALSE)),\" \")","v":"poussin"},{"$f":"LEFT(IF(C8>0,(VLOOKUP($C8,Inscription!$A$12:$G$211,6,FALSE)),\" \"),8)","v":"396776"},{"$f":"IF(COUNTIF($F$4:$F8,$F8)<2,$F8,\" \")","v":"VC Evron"},{"$error":"#REF!"},{"$f":"IF(I8=F8,#REF!,\"\")","v":{"$error":"#REF!"}},{"$f":"IF(COUNTIF($F$4:$F8,$F8)<3,$F8,\" \")","v":"VC Evron"},{"$error":"#REF!"},{"$f":"IF(L8=$F8,#REF!,\"\")","v":{"$error":"#REF!"}},"",1000,{"$f":"IF(O8=$F8,#REF!,1000)","v":1000},{"$f":"IF(COUNTIF($F$4:$F8,I8)<4,$F8,\" \")","v":"VC Evron"},{"$error":"#REF!"},{"$f":"IF(R8=$F8,#REF!,\"\")","v":{"$error":"#REF!"}},"","","",{"$f":"IF(V8=$F8,#REF!,\"\")","v":""}," ","T",4,{"$f":"'PRIX D EQUIPE'!B8","v":0},1000,1000,1000,1000,1000,1000," "," "]
[{"$error":"#REF!"},2,161,{"$f":"IF(C9>0,CONCATENATE((VLOOKUP($C9,Inscription!$A$12:$G$211,3,FALSE)),\"   \",(VLOOKUP($C9,Inscription!$A$12:$G$211,4,FALSE))),\" \")","v":"Leveque   Nathan"},null,{"$f":"IF(C9>0,(VLOOKUP($C9,Inscription!$A$12:$G$211,5,FALSE)),\" \")","v":"Lamball'breizh"},{"$f":"IF(C9>0,(VLOOKUP($C9,Inscription!$A$12:$G$211,7,FALSE)),\" \")","v":"poussin"},{"$f":"LEFT(IF(C9>0,(VLOOKUP($C9,Inscription!$A$12:$G$211,6,FALSE)),\" \"),8)","v":"435105"},{"$f":"IF(COUNTIF($F$4:$F9,$F9)<2,$F9,\" \")","v":"Lamball'breizh"},{"$error":"#REF!"},{"$f":"IF(I9=F9,#REF!,\"\")","v":{"$error":"#REF!"}},{"$f":"IF(COUNTIF($F$4:$F9,$F9)<3,$F9,\" \")","v":"Lamball'breizh"},{"$error":"#REF!"},{"$f":"IF(L9=$F9,#REF!,\"\")","v":{"$error":"#REF!"}},"",1000,{"$f":"IF(O9=$F9,#REF!,1000)","v":1000},{"$f":"IF(COUNTIF($F$4:$F9,I9)<4,$F9,\" \")","v":"Lamball'breizh"},{"$error":"#REF!"},{"$f":"IF(R9=$F9,#REF!,\"\")","v":{"$error":"#REF!"}},"","","",{"$f":"IF(V9=$F9,#REF!,\"\")","v":""}," ","T",5,{"$f":"'PRIX D EQUIPE'!B9","v":0},1000,1000,1000,1000,1000,1000," "," "]
[{"$error":"#REF!"},3,162,{"$f":"IF(C10>0,CONCATENATE((VLOOKUP($C10,Inscription!$A$12:$G$211,3,FALSE)),\"   \",(VLOOKUP($C10,Inscription!$A$12:$G$211,4,FALSE))),\" \")","v":"Lévèque   Clément"},null,{"$f":"IF(C10>0,(VLOOKUP($C10,Inscription!$A$12:$G$211,5,FALSE)),\" \")","v":"Accro Cycles"},{"$f":"IF(C10>0,(VLOOKUP($C10,Inscription!$A$12:$G$211,7,FALSE)),\" \")","v":"poussin"},{"$f":"LEFT(IF(C10>0,(VLOOKUP($C10,Inscription!$A$12:$G$211,6,FALSE)),\" \"),8)","v":"377265"},{"$f":"IF(COUNTIF($F$4:$F10,$F10)<2,$F10,\" \")","v":"Accro Cycles"},{"$error":"#REF!"},{"$f":"IF(I10=F10,#REF!,\"\")","v":{"$error":"#REF!"}},{"$f":"IF(COUNTIF($F$4:$F10,$F10)<3,$F10,\" \")","v":"Accro Cycles"},{"$error":"#REF!"},{"$f":"IF(L10=$F10,#REF!,\"\")","v":{"$error":"#REF!"}},"",1000,{"$f":"IF(O10=$F10,#REF!,1000)","v":1000},{"$f":"IF(COUNTIF($F$4:$F10,I10)<4,$F10,\" \")","v":"Accro Cycles"},{"$error":"#REF!"},{"$f":"IF(R10=$F10,#REF!,\"\")","v":{"$error":"#REF!"}},"","","",{"$f":"IF(V10=$F10,#REF!,\"\")","v":""}," ","T",6,{"$f":"'PRIX D EQUIPE'!B10","v":0},1000,1000,1000,1000,1000,1000," "," "]
[{"$error":"#REF!"},4,164,{"$f":"IF(C11>0,CONCATENATE((VLOOKUP($C11,Inscription!$A$12:$G$211,3,FALSE)),\"   \",(VLOOKUP($C11,Inscription!$A$12:$G$211,4,FALSE))),\" \")","v":"Gouret   Louison"},null,{"$f":"IF(C11>0,(VLOOKUP($C11,Inscription!$A$12:$G$211,5,FALSE)),\" \")","v":"VC Evron"},{"$f":"IF(C11>0,(VLOOKUP($C11,Inscription!$A$12:$G$211,7,FALSE)),\" \")","v":"poussin"},{"$f":"LEFT(IF(C11>0,(VLOOKUP($C11,Inscription!$A$12:$G$211,6,FALSE)),\" \"),8)","v":""},{"$f":"IF(COUNTIF($F$4:$F11,$F11)<2,$F11,\" \")","v":" "},"",{"$f":"IF(I11=F11,#REF!,\"\")","v":""},{"$f":"IF(COUNTIF($F$4:$F11,$F11)<3,$F11,\" \")","v":"VC Evron"},{"$error":"#REF!"},{"$f":"IF(L11=$F11,#REF!,\"\")","v":{"$error":"#REF!"}},"VC Evron",{"$error":"#REF!"},{"$f":"IF(O11=$F11,#REF!,1000)","v":{"$error":"#REF!"}},{"$f":"IF(COUNTIF($F$4:$F11,I11)<4,$F11,\" \")","v":"VC Evron"},{"$error":"#REF!"},{"$f":"IF(R11=$F11,#REF!,\"\")","v":{"$error":"#REF!"}},"VC Evron","","",{"$f":"IF(V11=$F11,#REF!,\"\")","v":""}," ","T",7,{"$f":"'PRIX D EQUIPE'!B11","v":0},1000,1000,1000,1000,1000,1000," "," "]
[{"$error":"#REF!"},5,163,{"$f":"IF(C12>0,CONCATENATE((VLOOKUP($C12,Inscription!$A$12:$G$211,3,FALSE)),\"   \",(VLOOKUP($C12,Inscription!$A$12:$G$211,4,FALSE))),\" \")","v":"Vitel   Manoë"},null,{"$f":"IF(C12>0,(VLOOKUP($C12,Inscription!$A$12:$G$211,5,FALSE)),\" \")","v":"Team Bikers 22"},{"$f":"IF(C12>0,(VLOOKUP($C12,Inscription!$A$12:$G$211,7,FALSE)),\" \")","v":"Poussin"},{"$f":"LEFT(IF(C12>0,(VLOOKUP($C12,Inscription!$A$12:$G$211,6,FALSE)),\" \"),8)","v":""},{"$f":"IF(COUNTIF($F$4:$F12,$F12)<2,$F12,\" \")","v":" "},"",{"$f":"IF(I12=F12,#REF!,\"\")","v":""},{"$f":"IF(COUNTIF($F$4:$F12,$F12)<3,$F12,\" \")","v":"Team Bikers 22"},{"$error":"#REF!"},{"$f":"IF(L12=$F12,#REF!,\"\")","v":{"$error":"#REF!"}},"Team Bikers 22",{"$error":"#REF!"},{"$f":"IF(O12=$F12,#REF!,1000)","v":{"$error":"#REF!"}},{"$f":"IF(COUNTIF($F$4:$F12,I12)<4,$F12,\" \")","v":"Team Bikers 22"},{"$error":"#REF!"},{"$f":"IF(R12=$F12,#REF!,\"\")","v":{"$error":"#REF!"}},"Team Bikers 22","","",{"$f":"IF(V12=$F12,#REF!,\"\")","v":""}," ","T",8,{"$f":"'PRIX D EQUIPE'!B12","v":0},1000,1000,1000,1000,1000,1000," "," "]
[{"$error":"#REF!"},6,165,{"$f":"IF(C13>0,CONCATENATE((VLOOKUP($C13,Inscription!$A$12:$G$211,3,FALSE)),\"   \",(VLOOKUP($C13,Inscription!$A$12:$G$211,4,FALSE))),\" \")","v":"Raoult   Léon"},null,{"$f":"IF(C13>0,(VLOOKUP($C13,Inscription!$A$12:$G$211,5,FALSE)),\" \")","v":"VC Evron"},{"$f":"IF(C13>0,(VLOOKUP($C13,Inscription!$A$12:$G$211,7,FALSE)),\" \")","v":"poussin"},{"$f":"LEFT(IF(C13>0,(VLOOKUP($C13,Inscription!$A$12:$G$211,6,FALSE)),\" \"),8)","v":""},{"$f":"IF(COUNTIF($F$4:$F13,$F13)<2,$F13,\" \")","v":" "},"",{"$f":"IF(I13=F13,#REF!,\"\")","v":""},{"$f":"IF(COUNTIF($F$4:$F13,$F13)<3,$F13,\" \")","v":" "},"",{"$f":"IF(L13=$F13,#REF!,\"\")","v":""},"",1000,{"$f":"IF(O13=$F13,#REF!,1000)","v":1000},{"$f":"IF(COUNTIF($F$4:$F13,I13)<4,$F13,\" \")","v":"VC Evron"},{"$error":"#REF!"},{"$f":"IF(R13=$F13,#REF!,\"\")","v":{"$error":"#REF!"}},"VC Evron","VC Evron",{"$error":"#REF!"},{"$f":"IF(V13=$F13,#REF!,\"\")","v":{"$error":"#REF!"}}," ","T",9,{"$f":"'PRIX D EQUIPE'!B13","v":0},1000,1000,1000,1000,1000,1000," "," "]
[{"$error":"#REF!"},7,166,{"$f":"IF(C14>0,CONCATENATE((VLOOKUP($C14,Inscription!$A$12:$G$211,3,FALSE)),\"   \",(VLOOKUP($C14,Inscription!$A$12:$G$211,4,FALSE))),\" \")","v":"Boilet   Malo"},null,{"$f":"IF(C14>0,(VLOOKUP($C14,Inscription!$A$12:$G$211,5,FALSE)),\" \")","v":"Lamball'breizh"},{"$f":"IF(C14>0,(VLOOKUP($C14,Inscription!$A$12:$G$211,7,FALSE)),\" \")","v":"poussin"},{"$f":"LEFT(IF(C14>0,(VLOOKUP($C14,Inscription!$A$12:$G$211,6,FALSE)),\" \"),8)","v":"520459"},{"$f":"IF(COUNTIF($F$4:$F14,$F14)<2,$F14,\" \")","v":" "},"",{"$f":"IF(I14=F14,#REF!,\"\")","v":""},{"$f":"IF(COUNTIF($F$4:$F14,$F14)<3,$F14,\" \")","v":"Lamball'breizh"},{"$error":"#REF!"},{"$f":"IF(L14=$F14,#REF!,\"\")","v":{"$error":"#REF!"}},"Lamball'breizh",{"$error":"#REF!"},{"$f":"IF(O14=$F14,#REF!,1000)","v":{"$error":"#REF!"}},{"$f":"IF(COUNTIF($F$4:$F14,I14)<4,$F14,\" \")","v":"Lamball'breizh"},{"$error":"#REF!"},{"$f":"IF(R14=$F14,#REF!,\"\")","v":{"$error":"#REF!"}},"Lamball'breizh","","",{"$f":"IF(V14=$F14,#REF!,\"\")","v":""}," ","T",10,{"$f":"'PRIX D EQUIPE'!B14","v":0},1000,1000,1000,1000,1000,1000," "," "]
[1000,null,null,{"$f":"IF(C15>0,CONCATENATE((VLOOKUP($C15,Inscription!$A$12:$G$211,3,FALSE)),\"   \",(VLOOKUP($C15,Inscription!$A$12:$G$211,4,FALSE))),\" \")","v":" "},null,{"$f":"IF(C15>0,(VLOOKUP($C15,Inscription!$A$12:$G$211,5,FALSE)),\" \")","v":" "},{"$f":"IF(C15>0,(VLOOKUP($C15,Inscription!$A$12:$G$211,7,FALSE)),\" \")","v":" "},{"$f":"LEFT(IF(C15>0,(VLOOKUP($C15,Inscription!$A$12:$G$211,6,FALSE)),\" \"),8)","v":" "},{"$f":"IF(COUNTIF($F$4:$F15,$F15)<2,$F15,\" \")","v":" "},1000,{"$f":"IF(I15=F15,#REF!,\"\")","v":{"$error":"#REF!"}},{"$f":"IF(COUNTIF($F$4:$F15,$F15)<3,$F15,\" \")","v":" "},1000,{"$f":"IF(L15=$F15,#REF!,\"\")","v":{"$error":"#REF!"}},"",1000,{"$f":"IF(O15=$F15,#REF!,1000)","v":1000},{"$f":"IF(COUNTIF($F$4:$F15,I15)<4,$F15,\" \")","v":" "},1000,{"$f":"IF(R15=$F15,#REF!,\"\")","v":{"$error":"#REF!"}},"","","",{"$f":"IF(V15=$F15,#REF!,\"\")","v":""}," ",0,11,{"$f":"'PRIX D EQUIPE'!B15","v":0},1000,1000,1000,1000,1000,1000," "," "]
[1000,null,null,{"$f":"IF(C16>0,CONCATENATE((VLOOKUP($C16,Inscription!$A$12:$G$211,3,FALSE)),\"   \",(VLOOKUP($C16,Inscription!$A$12:$G$211,4,FALSE))),\" \")","v":" "},null,{"$f":"IF(C16>0,(VLOOKUP($C16,Inscription!$A$12:$G$211,5,FALSE)),\" \")","v":" "},{"$f":"IF(C16>0,(VLOOKUP($C16,Inscription!$A$12:$G$211,7,FALSE)),\" \")","v":" "},{"$f":"LEFT(IF(C16>0,(VLOOKUP($C16,Inscription!$A$12:$G$211,6,FALSE)),\" \"),8)","v":" "},{"$f":"IF(COUNTIF($F$4:$F16,$F16)<2,$F16,\" \")","v":" "},1000,{"$f":"IF(I16=F16,#REF!,\"\")","v":{"$error":"#REF!"}},{"$f":"IF(COUNTIF($F$4:$F16,$F16)<3,$F16,\" \")","v":" "},1000,{"$f":"IF(L16=$F16,#REF!,\"\")","v":{"$error":"#REF!"}},"",1000,{"$f":"IF(O16=$F16,#REF!,1000)","v":1000},{"$f":"IF(COUNTIF($F$4:$F16,I16)<4,$F16,\" \")","v":" "},1000,{"$f":"IF(R16=$F16,#REF!,\"\")","v":{"$error":"#REF!"}},"","","",{"$f":"IF(V16=$F16,#REF!,\"\")","v":""}," ",0,12,{"$f":"'PRIX D EQUIPE'!B16","v":0},1000,1000,1000,1000,1000,1000," "," "]
[{"$error":"#REF!"},1,140,{"$f":"IF(C17>0,CONCATENATE((VLOOKUP($C17,Inscription!$A$12:$G$211,3,FALSE)),\"   \",(VLOOKUP($C17,Inscription!$A$12:$G$211,4,FALSE))),\" \")","v":"Meunier Le Breton   Lilwena"},null,{"$f":"IF(C17>0,(VLOOKUP($C17,Inscription!$A$12:$G$211,5,FALSE)),\" \")","v":"VTT Côtes D'Armor Hillion"},{"$f":"IF(C17>0,(VLOOKUP($C17,Inscription!$A$12:$G$211,7,FALSE)),\" \")","v":"pupille"},{"$f":"LEFT(IF(C17>0,(VLOOKUP($C17,Inscription!$A$12:$G$211,6,FALSE)),\" \"),8)","v":"369755"},{"$f":"IF(COUNTIF($F$4:$F17,$F17)<2,$F17,\" \")","v":"VTT Côtes D'Armor Hillion"},{"$error":"#REF!"},{"$f":"IF(I17=F17,#REF!,\"\")","v":{"$error":"#REF!"}},{"$f":"IF(COUNTIF($F$4:$F17,$F17)<3,$F17,\" \")","v":"VTT Côtes D'Armor Hillion"},{"$error":"#REF!"},{"$f":"IF(L17=$F17,#REF!,\"\")","v":{"$error":"#REF!"}},"",1000,{"$f":"IF(O17=$F17,#REF!,1000)","v":1000},{"$f":"IF(COUNTIF($F$4:$F17,I17)<4,$F17,\" \")","v":"VTT Côtes D'Armor Hillion"},{"$error":"#REF!"},{"$f":"IF(R17=$F17,#REF!,\"\")","v":{"$error":"#REF!"}},"","","",{"$f":"IF(V17=$F17,#REF!,\"\")","v":""}," ","T",13,{"$f":"'PRIX D EQUIPE'!B17","v":0},1000,1000,1000,1000,1000,1000," "," "]
[1000,null,null,{"$f":"IF(C18>0,CONCATENATE((VLOOKUP($C18,Inscription!$A$12:$G$211,3,FALSE)),\"   \",(VLOOKUP($C18,Inscription!$A$12:$G$211,4,FALSE))),\" \")","v":" "},null,{"$f":"IF(C18>0,(VLOOKUP($C18,Inscription!$A$12:$G$211,5,FALSE)),\" \")","v":" "},{"$f":"IF(C18>0,(VLOOKUP($C18,Inscription!$A$12:$G$211,7,FALSE)),\" \")","v":" "},{"$f":"LEFT(IF(C18>0,(VLOOKUP($C18,Inscription!$A$12:$G$211,6,FALSE)),\" \"),8)","v":" "},{"$f":"IF(COUNTIF($F$4:$F18,$F18)<2,$F18,\" \")","v":" "},1000,{"$f":"IF(I18=F18,#REF!,\"\")","v":{"$error":"#REF!"}},{"$f":"IF(COUNTIF($F$4:$F18,$F18)<3,$F18,\" \")","v":" "},1000,{"$f":"IF(L18=$F18,#REF!,\"\")","v":{"$error":"#REF!"}},"",1000,{"$f":"IF(O18=$F18,#REF!,1000)","v":1000},{"$f":"IF(COUNTIF($F$4:$F18,I18)<4,$F18,\" \")","v":" "},1000,{"$f":"IF(R18=$F18,#REF!,\"\")","v":{"$error":"#REF!"}},"","","",{"$f":"IF(V18=$F18,#REF!,\"\")","v":""}," ",0,14,{"$f":"'PRIX D EQUIPE'!B18","v":0},1000,1000,1000,1000,1000,1000," "," "]
[1000,null,null,{"$f":"IF(C19>0,CONCATENATE((VLOOKUP($C19,Inscription!$A$12:$G$211,3,FALSE)),\"   \",(VLOOKUP($C19,Inscription!$A$12:$G$211,4,FALSE))),\" \")","v":" "},null,{"$f":"IF(C19>0,(VLOOKUP($C19,Inscription!$A$12:$G$211,5,FALSE)),\" \")","v":" "},{"$f":"IF(C19>0,(VLOOKUP($C19,Inscription!$A$12:$G$211,7,FALSE)),\" \")","v":" "},{"$f":"LEFT(IF(C19>0,(VLOOKUP($C19,Inscription!$A$12:$G$211,6,FALSE)),\" \"),8)","v":" "},{"$f":"IF(COUNTIF($F$4:$F19,$F19)<2,$F19,\" \")","v":" "},1000,{"$f":"IF(I19=F19,#REF!,\"\")","v":{"$error":"#REF!"}},{"$f":"IF(COUNTIF($F$4:$F19,$F19)<3,$F19,\" \")","v":" "},1000,{"$f":"IF(L19=$F19,#REF!,\"\")","v":{"$error":"#REF!"}},"",1000,{"$f":"IF(O19=$F19,#REF!,1000)","v":1000},{"$f":"IF(COUNTIF($F$4:$F19,I19)<4,$F19,\" \")","v":" "},1000,{"$f":"IF(R19=$F19,#REF!,\"\")","v":{"$error":"#REF!"}},"","","",{"$f":"IF(V19=$F19,#REF!,\"\")","v":""}," ",0,15,{"$f":"'PRIX D EQUIPE'!B19","v":0},1000,1000,1000,1000,1000,1000," "," "]
[{"$error":"#REF!"},1,142,{"$f":"IF(C20>0,CONCATENATE((VLOOKUP($C20,Inscription!$A$12:$G$211,3,FALSE)),\"   \",(VLOOKUP($C20,Inscription!$A$12:$G$211,4,FALSE))),\" \")","v":"Rouillé Biard   Manech"},null,{"$f":"IF(C20>0,(VLOOKUP($C20,Inscription!$A$12:$G$211,5,FALSE)),\" \")","v":"VTT Côtes D'Armor Hillion"},{"$f":"IF(C20>0,(VLOOKUP($C20,Inscription!$A$12:$G$211,7,FALSE)),\" \")","v":"pupille"},{"$f":"LEFT(IF(C20>0,(VLOOKUP($C20,Inscription!$A$12:$G$211,6,FALSE)),\" \"),8)","v":"451260"},{"$f":"IF(COUNTIF($F$4:$F20,$F20)<2,$F20,\" \")","v":" "},"",{"$f":"IF(I20=F20,#REF!,\"\")","v":""},{"$f":"IF(COUNTIF($F$4:$F20,$F20)<3,$F20,\" \")","v":"VTT Côtes D'Armor Hillion"},{"$error":"#REF!"},{"$f":"IF(L20=$F20,#REF!,\"\")","v":{"$error":"#REF!"}},"VTT Côtes D'Armor Hillion",{"$error":"#REF!"},{"$f":"IF(O20=$F20,#REF!,1000)","v":{"$error":"#REF!"}},{"$f":"IF(COUNTIF($F$4:$F20,I20)<4,$F20,\" \")","v":" "},"",{"$f":"IF(R20=$F20,#REF!,\"\")","v":""},""," ","",{"$f":"IF(V20=$F20,#REF!,\"\")","v":""}," ","T",16,{"$f":"'PRIX D EQUIPE'!B20","v":0},1000,1000,1000,1000,1000,1000," "," "]
[{"$error":"#REF!"},2,143,{"$f":"IF(C21>0,CONCATENATE((VLOOKUP($C21,Inscription!$A$12:$G$211,3,FALSE)),\"   \",(VLOOKUP($C21,Inscription!$A$12:$G$211,4,FALSE))),\" \")","v":"Kowalski   Paul"},null,{"$f":"IF(C21>0,(VLOOKUP($C21,Inscription!$A$12:$G$211,5,FALSE)),\" \")","v":"Team Bikers 22"},{"$f":"IF(C21>0,(VLOOKUP($C21,Inscription!$A$12:$G$211,7,FALSE)),\" \")","v":"pupille"},{"$f":"LEFT(IF(C21>0,(VLOOKUP($C21,Inscription!$A$12:$G$211,6,FALSE)),\" \"),8)","v":"460607"},{"$f":"IF(COUNTIF($F$4:$F21,$F21)<2,$F21,\" \")","v":" "},"",{"$f":"IF(I21=F21,#REF!,\"\")","v":""},{"$f":"IF(COUNTIF($F$4:$F21,$F21)<3,$F21,\" \")","v":" "},"",{"$f":"IF(L21=$F21,#REF!,\"\")","v":""},"",1000,{"$f":"IF(O21=$F21,#REF!,1000)","v":1000},{"$f":"IF(COUNTIF($F$4:$F21,I21)<4,$F21,\" \")","v":" "},"",{"$f":"IF(R21=$F21,#REF!,\"\")","v":""},"","","",{"$f":"IF(V21=$F21,#REF!,\"\")","v":""}," ","T",17,{"$f":"'PRIX D EQUIPE'!B21","v":0},1000,1000,1000,1000,1000,1000," "," "]
[{"$error":"#REF!"},3,141,{"$f":"IF(C22>0,CONCATENATE((VLOOKUP($C22,Inscription!$A$12:$G$211,3,FALSE)),\"   \",(VLOOKUP($C22,Inscription!$A$12:$G$211,4,FALSE))),\" \")","v":"Bruezière   Enzo"},null,{"$f":"IF(C22>0,(VLOOKUP($C22,Inscription!$A$12:$G$211,5,FALSE)),\" \")","v":"Team Bikers 22"},{"$f":"IF(C22>0,(VLOOKUP($C22,Inscription!$A$12:$G$211,7,FALSE)),\" \")","v":"pupille"},{"$f":"LEFT(IF(C22>0,(VLOOKUP($C22,Inscription!$A$12:$G$211,6,FALSE)),\" \"),8)","v":"459065"},{"$f":"IF(COUNTIF($F$4:$F22,$F22)<2,$F22,\" \")","v":" "},"",{"$f":"IF(I22=F22,#REF!,\"\")","v":""},{"$f":"IF(COUNTIF($F$4:$F22,$F22)<3,$F22,\" \")","v":" "},"",{"$f":"IF(L22=$F22,#REF!,\"\")","v":""},"",1000,{"$f":"IF(O22=$F22,#REF!,1000)","v":1000},{"$f":"IF(COUNTIF($F$4:$F22,I22)<4,$F22,\" \")","v":" "},"",{"$f":"IF(R22=$F22,#REF!,\"\")","v":""},"","","",{"$f":"IF(V22=$F22,#REF!,\"\")","v":""}," ","T",18,{"$f":"'PRIX D EQUIPE'!B22","v":0},1000,1000,1000,1000,1000,1000," "," "]
[{"$error":"#REF!"},4,144,{"$f":"IF(C23>0,CONCATENATE((VLOOKUP($C23,Inscription!$A$12:$G$211,3,FALSE)),\"   \",(VLOOKUP($C23,Inscription!$A$12:$G$211,4,FALSE))),\" \")","v":"Devaux   Naël"},null,{"$f":"IF(C23>0,(VLOOKUP($C23,Inscription!$A$12:$G$211,5,FALSE)),\" \")","v":"Team Bikers 22"},{"$f":"IF(C23>0,(VLOOKUP($C23,Inscription!$A$12:$G$211,7,FALSE)),\" \")","v":"Pupille"},{"$f":"LEFT(IF(C23>0,(VLOOKUP($C23,Inscription!$A$12:$G$211,6,FALSE)),\" \"),8)","v":""},{"$f":"IF(COUNTIF($F$4:$F23,$F23)<2,$F23,\" \")","v":" "},"",{"$f":"IF(I23=F23,#REF!,\"\")","v":""},{"$f":"IF(COUNTIF($F$4:$F23,$F23)<3,$F23,\" \")","v":" "},"",{"$f":"IF(L23=$F23,#REF!,\"\")","v":""},"",1000,{"$f":"IF(O23=$F23,#REF!,1000)","v":1000},{"$f":"IF(COUNTIF($F$4:$F23,I23)<4,$F23,\" \")","v":" "},"",{"$f":"IF(R23=$F23,#REF!,\"\")","v":""},"","","",{"$f":"IF(V23=$F23,#REF!,\"\")","v":""}," ","T",19,{"$f":"'PRIX D EQUIPE'!B23","v":0},1000,1000,1000,1000,1000,1000," "," "]
[1000,null,null,{"$f":"IF(C24>0,CONCATENATE((VLOOKUP($C24,Inscription!$A$12:$G$211,3,FALSE)),\"   \",(VLOOKUP($C24,Inscription!$A$12:$G$211,4,FALSE))),\" \")","v":" "},null,{"$f":"IF(C24>0,(VLOOKUP($C24,Inscription!$A$12:$G$211,5,FALSE)),\" \")","v":" "},{"$f":"IF(C24>0,(VLOOKUP($C24,Inscription!$A$12:$G$211,7,FALSE)),\" \")","v":" "},{"$f":"LEFT(IF(C24>0,(VLOOKUP($C24,Inscription!$A$12:$G$211,6,FALSE)),\" \"),8)","v":" "},{"$f":"IF(COUNTIF($F$4:$F24,$F24)<2,$F24,\" \")","v":" "},1000,{"$f":"IF(I24=F24,#REF!,\"\")","v":{"$error":"#REF!"}},{"$f":"IF(COUNTIF($F$4:$F24,$F24)<3,$F24,\" \")","v":" "},1000,{"$f":"IF(L24=$F24,#REF!,\"\")","v":{"$error":"#REF!"}},"",1000,{"$f":"IF(O24=$F24,#REF!,1000)","v":1000},{"$f":"IF(COUNTIF($F$4:$F24,I24)<4,$F24,\" \")","v":" "},1000,{"$f":"IF(R24=$F24,#REF!,\"\")","v":{"$error":"#REF!"}},"","","",{"$f":"IF(V24=$F24,#REF!,\"\")","v":""}," ",0,20,{"$f":"'PRIX D EQUIPE'!B24","v":0},1000,1000,1000,1000,1000,1000," "," "]
[1000,null,null,{"$f":"IF(C25>0,CONCATENATE((VLOOKUP($C25,Inscription!$A$12:$G$211,3,FALSE)),\"   \",(VLOOKUP($C25,Inscription!$A$12:$G$211,4,FALSE))),\" \")","v":" "},null,{"$f":"IF(C25>0,(VLOOKUP($C25,Inscription!$A$12:$G$211,5,FALSE)),\" \")","v":" "},{"$f":"IF(C25>0,(VLOOKUP($C25,Inscription!$A$12:$G$211,7,FALSE)),\" \")","v":" "},{"$f":"LEFT(IF(C25>0,(VLOOKUP($C25,Inscription!$A$12:$G$211,6,FALSE)),\" \"),8)","v":" "},{"$f":"IF(COUNTIF($F$4:$F25,$F25)<2,$F25,\" \")","v":" "},1000,{"$f":"IF(I25=F25,#REF!,\"\")","v":{"$error":"#REF!"}},{"$f":"IF(COUNTIF($F$4:$F25,$F25)<3,$F25,\" \")","v":" "},1000,{"$f":"IF(L25=$F25,#REF!,\"\")","v":{"$error":"#REF!"}},"",1000,{"$f":"IF(O25=$F25,#REF!,1000)","v":1000},{"$f":"IF(COUNTIF($F$4:$F25,I25)<4,$F25,\" \")","v":" "},1000,{"$f":"IF(R25=$F25,#REF!,\"\")","v":{"$error":"#REF!"}},"","","",{"$f":"IF(V25=$F25,#REF!,\"\")","v":""}," ",0,21,{"$f":"'PRIX D EQUIPE'!B25","v":0},1000,1000,1000,1000,1000,1000," "," "]
[{"$error":"#REF!"},1,124,{"$f":"IF(C26>0,CONCATENATE((VLOOKUP($C26,Inscription!$A$12:$G$211,3,FALSE)),\"   \",(VLOOKUP($C26,Inscription!$A$12:$G$211,4,FALSE))),\" \")","v":"Callennec   Lucy"},null,{"$f":"IF(C26>0,(VLOOKUP($C26,Inscription!$A$12:$G$211,5,FALSE)),\" \")","v":"Bégard VTT Gwerun"},{"$f":"IF(C26>0,(VLOOKUP($C26,Inscription!$A$12:$G$211,7,FALSE)),\" \")","v":"Benjamin"},{"$f":"LEFT(IF(C26>0,(VLOOKUP($C26,Inscription!$A$12:$G$211,6,FALSE)),\" \"),8)","v":"509013"},{"$f":"IF(COUNTIF($F$4:$F26,$F26)<2,$F26,\" \")","v":"Bégard VTT Gwerun"},{"$error":"#REF!"},{"$f":"IF(I26=F26,#REF!,\"\")","v":{"$error":"#REF!"}},{"$f":"IF(COUNTIF($F$4:$F26,$F26)<3,$F26,\" \")","v":"Bégard VTT Gwerun"},{"$error":"#REF!"},{"$f":"IF(L26=$F26,#REF!,\"\")","v":{"$error":"#REF!"}},"",1000,{"$f":"IF(O26=$F26,#REF!,1000)","v":1000},{"$f":"IF(COUNTIF($F$4:$F26,I26)<4,$F26,\" \")","v":"Bégard VTT Gwerun"},{"$error":"#REF!"},{"$f":"IF(R26=$F26,#REF!,\"\")","v":{"$error":"#REF!"}},"","","",{"$f":"IF(V26=$F26,#REF!,\"\")","v":""}," ","T",22,{"$f":"'PRIX D EQUIPE'!B26","v":0},1000,1000,1000,1000,1000,1000," "," "]
[{"$error":"#REF!"},"absent",121,{"$f":"IF(C27>0,CONCATENATE((VLOOKUP($C27,Inscription!$A$12:$G$211,3,FALSE)),\"   \",(VLOOKUP($C27,Inscription!$A$12:$G$211,4,FALSE))),\" \")","v":"Croisier   Léa"},null,{"$f":"IF(C27>0,(VLOOKUP($C27,Inscription!$A$12:$G$211,5,FALSE)),\" \")","v":"Team Pays de Dinan"},{"$f":"IF(C27>0,(VLOOKUP($C27,Inscription!$A$12:$G$211,7,FALSE)),\" \")","v":"Benjamin"},{"$f":"LEFT(IF(C27>0,(VLOOKUP($C27,Inscription!$A$12:$G$211,6,FALSE)),\" \"),8)","v":"263040"},{"$f":"IF(COUNTIF($F$4:$F27,$F27)<2,$F27,\" \")","v":"Team Pays de Dinan"},{"$error":"#REF!"},{"$f":"IF(I27=F27,#REF!,\"\")","v":{"$error":"#REF!"}},{"$f":"IF(COUNTIF($F$4:$F27,$F27)<3,$F27,\" \")","v":"Team Pays de Dinan"},{"$error":"#REF!"},{"$f":"IF(L27=$F27,#REF!,\"\")","v":{"$error":"#REF!"}},"",1000,{"$f":"IF(O27=$F27,#REF!,1000)","v":1000},{"$f":"IF(COUNTIF($F$4:$F27,I27)<4,$F27,\" \")","v":"Team Pays de Dinan"},{"$error":"#REF!"},{"$f":"IF(R27=$F27,#REF!,\"\")","v":{"$error":"#REF!"}},"","","",{"$f":"IF(V27=$F27,#REF!,\"\")","v":""}," ","T",23,{"$f":"'PRIX D EQUIPE'!B27","v":0},1000,1000,1000,1000,1000,1000," "," "]
[1000,null,null,{"$f":"IF(C28>0,CONCATENATE((VLOOKUP($C28,Inscription!$A$12:$G$211,3,FALSE)),\"   \",(VLOOKUP($C28,Inscription!$A$12:$G$211,4,FALSE))),\" \")","v":" "},null,{"$f":"IF(C28>0,(VLOOKUP($C28,Inscription!$A$12:$G$211,5,FALSE)),\" \")","v":" "},{"$f":"IF(C28>0,(VLOOKUP($C28,Inscription!$A$12:$G$211,7,FALSE)),\" \")","v":" "},{"$f":"LEFT(IF(C28>0,(VLOOKUP($C28,Inscription!$A$12:$G$211,6,FALSE)),\" \"),8)","v":" "},{"$f":"IF(COUNTIF($F$4:$F28,$F28)<2,$F28,\" \")","v":" "},1000,{"$f":"IF(I28=F28,#REF!,\"\")","v":{"$error":"#REF!"}},{"$f":"IF(COUNTIF($F$4:$F28,$F28)<3,$F28,\" \")","v":" "},1000,{"$f":"IF(L28=$F28,#REF!,\"\")","v":{"$error":"#REF!"}},"",1000,{"$f":"IF(O28=$F28,#REF!,1000)","v":1000},{"$f":"IF(COUNTIF($F$4:$F28,I28)<4,$F28,\" \")","v":" "},1000,{"$f":"IF(R28=$F28,#REF!,\"\")","v":{"$error":"#REF!"}},"","","",{"$f":"IF(V28=$F28,#REF!,\"\")","v":""}," ",0,24,{"$f":"'PRIX D EQUIPE'!B28","v":0},1000,1000,1000,1000,1000,1000," "," "]
[1000,null,null,{"$f":"IF(C29>0,CONCATENATE((VLOOKUP($C29,Inscription!$A$12:$G$211,3,FALSE)),\"   \",(VLOOKUP($C29,Inscription!$A$12:$G$211,4,FALSE))),\" \")","v":" "},null,{"$f":"IF(C29>0,(VLOOKUP($C29,Inscription!$A$12:$G$211,5,FALSE)),\" \")","v":" "},{"$f":"IF(C29>0,(VLOOKUP($C29,Inscription!$A$12:$G$211,7,FALSE)),\" \")","v":" "},{"$f":"LEFT(IF(C29>0,(VLOOKUP($C29,Inscription!$A$12:$G$211,6,FALSE)),\" \"),8)","v":" "},{"$f":"IF(COUNTIF($F$4:$F29,$F29)<2,$F29,\" \")","v":" "},1000,{"$f":"IF(I29=F29,#REF!,\"\")","v":{"$error":"#REF!"}},{"$f":"IF(COUNTIF($F$4:$F29,$F29)<3,$F29,\" \")","v":" "},1000,{"$f":"IF(L29=$F29,#REF!,\"\")","v":{"$error":"#REF!"}},"",1000,{"$f":"IF(O29=$F29,#REF!,1000)","v":1000},{"$f":"IF(COUNTIF($F$4:$F29,I29)<4,$F29,\" \")","v":" "},1000,{"$f":"IF(R29=$F29,#REF!,\"\")","v":{"$error":"#REF!"}},"","","",{"$f":"IF(V29=$F29,#REF!,\"\")","v":""}," ",0,25,{"$f":"'PRIX D EQUIPE'!B29","v":0},1000,1000,1000,1000,1000,1000," "," "]
[{"$error":"#REF!"},1,133,{"$f":"IF(C30>0,CONCATENATE((VLOOKUP($C30,Inscription!$A$12:$G$211,3,FALSE)),\"   \",(VLOOKUP($C30,Inscription!$A$12:$G$211,4,FALSE))),\" \")","v":"Cadieu   Gabriel"},null,{"$f":"IF(C30>0,(VLOOKUP($C30,Inscription!$A$12:$G$211,5,FALSE)),\" \")","v":"VTT du Lié"},{"$f":"IF(C30>0,(VLOOKUP($C30,Inscription!$A$12:$G$211,7,FALSE)),\" \")","v":"benjamin"},{"$f":"LEFT(IF(C30>0,(VLOOKUP($C30,Inscription!$A$12:$G$211,6,FALSE)),\" \"),8)","v":""},{"$f":"IF(COUNTIF($F$4:$F30,$F30)<2,$F30,\" \")","v":"VTT du Lié"},{"$error":"#REF!"},{"$f":"IF(I30=F30,#REF!,\"\")","v":{"$error":"#REF!"}},{"$f":"IF(COUNTIF($F$4:$F30,$F30)<3,$F30,\" \")","v":"VTT du Lié"},{"$error":"#REF!"},{"$f":"IF(L30=$F30,#REF!,\"\")","v":{"$error":"#REF!"}},"",1000,{"$f":"IF(O30=$F30,#REF!,1000)","v":1000},{"$f":"IF(COUNTIF($F$4:$F30,I30)<4,$F30,\" \")","v":"VTT du Lié"},{"$error":"#REF!"},{"$f":"IF(R30=$F30,#REF!,\"\")","v":{"$error":"#REF!"}},"","","",{"$f":"IF(V30=$F30,#REF!,\"\")","v":""}," ","T",26,{"$f":"'PRIX D EQUIPE'!B30","v":0},1000,1000,1000,1000,1000,1000,{"$f":"IF(AB30=\" \",\" \",IF($AB30>0,SUM(AC30+AE30+AG30),\" \"))","v":" "},{"$f":"IF(AB30=\" \",\" \",IF($AB30>0,SUM(AD30+AF30+AH30),\" \"))","v":" "}]
[{"$error":"#REF!"},2,120,{"$f":"IF(C31>0,CONCATENATE((VLOOKUP($C31,Inscription!$A$12:$G$211,3,FALSE)),\"   \",(VLOOKUP($C31,Inscription!$A$12:$G$211,4,FALSE))),\" \")","v":"Briand   Axel"},null,{"$f":"IF(C31>0,(VLOOKUP($C31,Inscription!$A$12:$G$211,5,FALSE)),\" \")","v":"VC Evron"},{"$f":"IF(C31>0,(VLOOKUP($C31,Inscription!$A$12:$G$211,7,FALSE)),\" \")","v":"Benjamin"},{"$f":"LEFT(IF(C31>0,(VLOOKUP($C31,Inscription!$A$12:$G$211,6,FALSE)),\" \"),8)","v":"429219"},{"$f":"IF(COUNTIF($F$4:$F31,$F31)<2,$F31,\" \")","v":" "},"",{"$f":"IF(I31=F31,#REF!,\"\")","v":""},{"$f":"IF(COUNTIF($F$4:$F31,$F31)<3,$F31,\" \")","v":" "},"",{"$f":"IF(L31=$F31,#REF!,\"\")","v":""},"",1000,{"$f":"IF(O31=$F31,#REF!,1000)","v":1000},{"$f":"IF(COUNTIF($F$4:$F31,I31)<4,$F31,\" \")","v":" "},"",{"$f":"IF(R31=$F31,#REF!,\"\")","v":""},"","","",{"$f":"IF(V31=$F31,#REF!,\"\")","v":""}," ","T",27,{"$f":"'PRIX D EQUIPE'!B31","v":0},1000,1000,1000,1000,1000,1000," "," "]
[{"$error":"#REF!"},3,122,{"$f":"IF(C32>0,CONCATENATE((VLOOKUP($C32,Inscription!$A$12:$G$211,3,FALSE)),\"   \",(VLOOKUP($C32,Inscription!$A$12:$G$211,4,FALSE))),\" \")","v":"Huguet   Mathis"},null,{"$f":"IF(C32>0,(VLOOKUP($C32,Inscription!$A$12:$G$211,5,FALSE)),\" \")","v":"Team Bikers 22"},{"$f":"IF(C32>0,(VLOOKUP($C32,Inscription!$A$12:$G$211,7,FALSE)),\" \")","v":"Benjamin"},{"$f":"LEFT(IF(C32>0,(VLOOKUP($C32,Inscription!$A$12:$G$211,6,FALSE)),\" \"),8)","v":"390457"},{"$f":"IF(COUNTIF($F$4:$F32,$F32)<2,$F32,\" \")","v":" "},"",{"$f":"IF(I32=F32,#REF!,\"\")","v":""},{"$f":"IF(COUNTIF($F$4:$F32,$F32)<3,$F32,\" \")","v":" "},"",{"$f":"IF(L32=$F32,#REF!,\"\")","v":""},"",1000,{"$f":"IF(O32=$F32,#REF!,1000)","v":1000},{"$f":"IF(COUNTIF($F$4:$F32,I32)<4,$F32,\" \")","v":" "},"",{"$f":"IF(R32=$F32,#REF!,\"\")","v":""},"","","",{"$f":"IF(V32=$F32,#REF!,\"\")","v":""}," ","T",28,{"$f":"'PRIX D EQUIPE'!B32","v":0},1000,1000,1000,1000,1000,1000," "," "]
[{"$error":"#REF!"},4,126,{"$f":"IF(C33>0,CONCATENATE((VLOOKUP($C33,Inscription!$A$12:$G$211,3,FALSE)),\"   \",(VLOOKUP($C33,Inscription!$A$12:$G$211,4,FALSE))),\" \")","v":"Lanoé   Hugo"},null,{"$f":"IF(C33>0,(VLOOKUP($C33,Inscription!$A$12:$G$211,5,FALSE)),\" \")","v":"VC Evron"},{"$f":"IF(C33>0,(VLOOKUP($C33,Inscription!$A$12:$G$211,7,FALSE)),\" \")","v":"Benjamin"},{"$f":"LEFT(IF(C33>0,(VLOOKUP($C33,Inscription!$A$12:$G$211,6,FALSE)),\" \"),8)","v":"382435"},{"$f":"IF(COUNTIF($F$4:$F33,$F33)<2,$F33,\" \")","v":" "},"",{"$f":"IF(I33=F33,#REF!,\"\")","v":""},{"$f":"IF(COUNTIF($F$4:$F33,$F33)<3,$F33,\" \")","v":" "},"",{"$f":"IF(L33=$F33,#REF!,\"\")","v":""},"",1000,{"$f":"IF(O33=$F33,#REF!,1000)","v":1000},{"$f":"IF(COUNTIF($F$4:$F33,I33)<4,$F33,\" \")","v":" "},"",{"$f":"IF(R33=$F33,#REF!,\"\")","v":""},"","","",{"$f":"IF(V33=$F33,#REF!,\"\")","v":""}," ","T",29,{"$f":"'PRIX D EQUIPE'!B33","v":0},1000,1000,1000,1000,1000,1000," "," "]
[{"$error":"#REF!"},5,123,{"$f":"IF(C34>0,CONCATENATE((VLOOKUP($C34,Inscription!$A$12:$G$211,3,FALSE)),\"   \",(VLOOKUP($C34,Inscription!$A$12:$G$211,4,FALSE))),\" \")","v":"Macé   Tom"},null,{"$f":"IF(C34>0,(VLOOKUP($C34,Inscription!$A$12:$G$211,5,FALSE)),\" \")","v":"Team Broons"},{"$f":"IF(C34>0,(VLOOKUP($C34,Inscription!$A$12:$G$211,7,FALSE)),\" \")","v":"Benjamin"},{"$f":"LEFT(IF(C34>0,(VLOOKUP($C34,Inscription!$A$12:$G$211,6,FALSE)),\" \"),8)","v":"256614"},{"$f":"IF(COUNTIF($F$4:$F34,$F34)<2,$F34,\" \")","v":"Team Broons"},{"$error":"#REF!"},{"$f":"IF(I34=F34,#REF!,\"\")","v":{"$error":"#REF!"}},{"$f":"IF(COUNTIF($F$4:$F34,$F34)<3,$F34,\" \")","v":"Team Broons"},{"$error":"#REF!"},{"$f":"IF(L34=$F34,#REF!,\"\")","v":{"$error":"#REF!"}},"",1000,{"$f":"IF(O34=$F34,#REF!,1000)","v":1000},{"$f":"IF(COUNTIF($F$4:$F34,I34)<4,$F34,\" \")","v":"Team Broons"},{"$error":"#REF!"},{"$f":"IF(R34=$F34,#REF!,\"\")","v":{"$error":"#REF!"}},"","","",{"$f":"IF(V34=$F34,#REF!,\"\")","v":""}," ","T",30,{"$f":"'PRIX D EQUIPE'!B34","v":0},1000,1000,1000,1000,1000,1000," "," "]
[{"$error":"#REF!"},6,125,{"$f":"IF(C35>0,CONCATENATE((VLOOKUP($C35,Inscription!$A$12:$G$211,3,FALSE)),\"   \",(VLOOKUP($C35,Inscription!$A$12:$G$211,4,FALSE))),\" \")","v":"Lebret   Sacha"},null,{"$f":"IF(C35>0,(VLOOKUP($C35,Inscription!$A$12:$G$211,5,FALSE)),\" \")","v":"Team Bikers 22"},{"$f":"IF(C35>0,(VLOOKUP($C35,Inscription!$A$12:$G$211,7,FALSE)),\" \")","v":"Benjamin"},{"$f":"LEFT(IF(C35>0,(VLOOKUP($C35,Inscription!$A$12:$G$211,6,FALSE)),\" \"),8)","v":"390946"},{"$f":"IF(COUNTIF($F$4:$F35,$F35)<2,$F35,\" \")","v":" "},"",{"$f":"IF(I35=F35,#REF!,\"\")","v":""},{"$f":"IF(COUNTIF($F$4:$F35,$F35)<3,$F35,\" \")","v":" "},"",{"$f":"IF(L35=$F35,#REF!,\"\")","v":""},"",1000,{"$f":"IF(O35=$F35,#REF!,1000)","v":1000},{"$f":"IF(COUNTIF($F$4:$F35,I35)<4,$F35,\" \")","v":" "},"",{"$f":"IF(R35=$F35,#REF!,\"\")","v":""},"","","",{"$f":"IF(V35=$F35,#REF!,\"\")","v":""}," ","T",31,{"$f":"'PRIX D EQUIPE'!B35","v":0},1000,1000,1000,1000,1000,1000," "," "]
[{"$error":"#REF!"},7,128,{"$f":"IF(C36>0,CONCATENATE((VLOOKUP($C36,Inscription!$A$12:$G$211,3,FALSE)),\"   \",(VLOOKUP($C36,Inscription!$A$12:$G$211,4,FALSE))),\" \")","v":"Lévéque   Noé"},null,{"$f":"IF(C36>0,(VLOOKUP($C36,Inscription!$A$12:$G$211,5,FALSE)),\" \")","v":"Accro Cycles"},{"$f":"IF(C36>0,(VLOOKUP($C36,Inscription!$A$12:$G$211,7,FALSE)),\" \")","v":"Benjamin"},{"$f":"LEFT(IF(C36>0,(VLOOKUP($C36,Inscription!$A$12:$G$211,6,FALSE)),\" \"),8)","v":"337516"},{"$f":"IF(COUNTIF($F$4:$F36,$F36)<2,$F36,\" \")","v":" "},"",{"$f":"IF(I36=F36,#REF!,\"\")","v":""},{"$f":"IF(COUNTIF($F$4:$F36,$F36)<3,$F36,\" \")","v":"Accro Cycles"},{"$error":"#REF!"},{"$f":"IF(L36=$F36,#REF!,\"\")","v":{"$error":"#REF!"}},"Accro Cycles",{"$error":"#REF!"},{"$f":"IF(O36=$F36,#REF!,1000)","v":{"$error":"#REF!"}},{"$f":"IF(COUNTIF($F$4:$F36,I36)<4,$F36,\" \")","v":" "},"",{"$f":"IF(R36=$F36,#REF!,\"\")","v":""},""," ","",{"$f":"IF(V36=$F36,#REF!,\"\")","v":""}," ","T",32,{"$f":"'PRIX D EQUIPE'!B36","v":0},1000,1000,1000,1000,1000,1000," "," "]
[{"$error":"#REF!"},8,132,{"$f":"IF(C37>0,CONCATENATE((VLOOKUP($C37,Inscription!$A$12:$G$211,3,FALSE)),\"   \",(VLOOKUP($C37,Inscription!$A$12:$G$211,4,FALSE))),\" \")","v":"Gerard   Jules"},null,{"$f":"IF(C37>0,(VLOOKUP($C37,Inscription!$A$12:$G$211,5,FALSE)),\" \")","v":"Team Bikers 22"},{"$f":"IF(C37>0,(VLOOKUP($C37,Inscription!$A$12:$G$211,7,FALSE)),\" \")","v":"Benjamin"},{"$f":"LEFT(IF(C37>0,(VLOOKUP($C37,Inscription!$A$12:$G$211,6,FALSE)),\" \"),8)","v":"491636"},{"$f":"IF(COUNTIF($F$4:$F37,$F37)<2,$F37,\" \")","v":" "},"",{"$f":"IF(I37=F37,#REF!,\"\")","v":""},{"$f":"IF(COUNTIF($F$4:$F37,$F37)<3,$F37,\" \")","v":" "},"",{"$f":"IF(L37=$F37,#REF!,\"\")","v":""},"",1000,{"$f":"IF(O37=$F37,#REF!,1000)","v":1000},{"$f":"IF(COUNTIF($F$4:$F37,I37)<4,$F37,\" \")","v":" "},"",{"$f":"IF(R37=$F37,#REF!,\"\")","v":""},"","","",{"$f":"IF(V37=$F37,#REF!,\"\")","v":""}," ","T",33,{"$f":"'PRIX D EQUIPE'!B37","v":0},1000,1000,1000,1000,1000,1000," "," "]
[{"$error":"#REF!"},9,127,{"$f":"IF(C38>0,CONCATENATE((VLOOKUP($C38,Inscription!$A$12:$G$211,3,FALSE)),\"   \",(VLOOKUP($C38,Inscription!$A$12:$G$211,4,FALSE))),\" \")","v":"Creseveur   Gwenvael"},null,{"$f":"IF(C38>0,(VLOOKUP($C38,Inscription!$A$12:$G$211,5,FALSE)),\" \")","v":"Team XC du Léguer"},{"$f":"IF(C38>0,(VLOOKUP($C38,Inscription!$A$12:$G$211,7,FALSE)),\" \")","v":"Benjamin"},{"$f":"LEFT(IF(C38>0,(VLOOKUP($C38,Inscription!$A$12:$G$211,6,FALSE)),\" \"),8)","v":"330214"},{"$f":"IF(COUNTIF($F$4:$F38,$F38)<2,$F38,\" \")","v":"Team XC du Léguer"},{"$error":"#REF!"},{"$f":"IF(I38=F38,#REF!,\"\")","v":{"$error":"#REF!"}},{"$f":"IF(COUNTIF($F$4:$F38,$F38)<3,$F38,\" \")","v":"Team XC du Léguer"},{"$error":"#REF!"},{"$f":"IF(L38=$F38,#REF!,\"\")","v":{"$error":"#REF!"}},"",1000,{"$f":"IF(O38=$F38,#REF!,1000)","v":1000},{"$f":"IF(COUNTIF($F$4:$F38,I38)<4,$F38,\" \")","v":"Team XC du Léguer"},{"$error":"#REF!"},{"$f":"IF(R38=$F38,#REF!,\"\")","v":{"$error":"#REF!"}},"","","",{"$f":"IF(V38=$F38,#REF!,\"\")","v":""}," ","T",34,{"$f":"'PRIX D EQUIPE'!B38","v":0},1000,1000,1000,1000,1000,1000," "," "]
[{"$error":"#REF!"},10,131,{"$f":"IF(C39>0,CONCATENATE((VLOOKUP($C39,Inscription!$A$12:$G$211,3,FALSE)),\"   \",(VLOOKUP($C39,Inscription!$A$12:$G$211,4,FALSE))),\" \")","v":"Auffret   Siméon"},null,{"$f":"IF(C39>0,(VLOOKUP($C39,Inscription!$A$12:$G$211,5,FALSE)),\" \")","v":"VC Plurien"},{"$f":"IF(C39>0,(VLOOKUP($C39,Inscription!$A$12:$G$211,7,FALSE)),\" \")","v":"benjamin"},{"$f":"LEFT(IF(C39>0,(VLOOKUP($C39,Inscription!$A$12:$G$211,6,FALSE)),\" \"),8)","v":"459988"},{"$f":"IF(COUNTIF($F$4:$F39,$F39)<2,$F39,\" \")","v":"VC Plurien"},{"$error":"#REF!"},{"$f":"IF(I39=F39,#REF!,\"\")","v":{"$error":"#REF!"}},{"$f":"IF(COUNTIF($F$4:$F39,$F39)<3,$F39,\" \")","v":"VC Plurien"},{"$error":"#REF!"},{"$f":"IF(L39=$F39,#REF!,\"\")","v":{"$error":"#REF!"}},"",1000,{"$f":"IF(O39=$F39,#REF!,1000)","v":1000},{"$f":"IF(COUNTIF($F$4:$F39,I39)<4,$F39,\" \")","v":"VC Plurien"},{"$error":"#REF!"},{"$f":"IF(R39=$F39,#REF!,\"\")","v":{"$error":"#REF!"}},"","","",{"$f":"IF(V39=$F39,#REF!,\"\")","v":""}," ","T",35,{"$f":"'PRIX D EQUIPE'!B39","v":0},1000,1000,1000,1000,1000,1000," "," "]
[{"$error":"#REF!"},11,130,{"$f":"IF(C40>0,CONCATENATE((VLOOKUP($C40,Inscription!$A$12:$G$211,3,FALSE)),\"   \",(VLOOKUP($C40,Inscription!$A$12:$G$211,4,FALSE))),\" \")","v":"Remond   Malo"},null,{"$f":"IF(C40>0,(VLOOKUP($C40,Inscription!$A$12:$G$211,5,FALSE)),\" \")","v":"Team XC du Léguer"},{"$f":"IF(C40>0,(VLOOKUP($C40,Inscription!$A$12:$G$211,7,FALSE)),\" \")","v":"benjamin"},{"$f":"LEFT(IF(C40>0,(VLOOKUP($C40,Inscription!$A$12:$G$211,6,FALSE)),\" \"),8)","v":"395912"},{"$f":"IF(COUNTIF($F$4:$F40,$F40)<2,$F40,\" \")","v":" "},"",{"$f":"IF(I40=F40,#REF!,\"\")","v":""},{"$f":"IF(COUNTIF($F$4:$F40,$F40)<3,$F40,\" \")","v":"Team XC du Léguer"},{"$error":"#REF!"},{"$f":"IF(L40=$F40,#REF!,\"\")","v":{"$error":"#REF!"}},"Team XC du Léguer",{"$error":"#REF!"},{"$f":"IF(O40=$F40,#REF!,1000)","v":{"$error":"#REF!"}},{"$f":"IF(COUNTIF($F$4:$F40,I40)<4,$F40,\" \")","v":" "},"",{"$f":"IF(R40=$F40,#REF!,\"\")","v":""},""," ","",{"$f":"IF(V40=$F40,#REF!,\"\")","v":""}," ","T"]
[{"$error":"#REF!"},12,129,{"$f":"IF(C41>0,CONCATENATE((VLOOKUP($C41,Inscription!$A$12:$G$211,3,FALSE)),\"   \",(VLOOKUP($C41,Inscription!$A$12:$G$211,4,FALSE))),\" \")","v":"Colas   Thibault"},null,{"$f":"IF(C41>0,(VLOOKUP($C41,Inscription!$A$12:$G$211,5,FALSE)),\" \")","v":"Team XC du Léguer"},{"$f":"IF(C41>0,(VLOOKUP($C41,Inscription!$A$12:$G$211,7,FALSE)),\" \")","v":"Benjamin"},{"$f":"LEFT(IF(C41>0,(VLOOKUP($C41,Inscription!$A$12:$G$211,6,FALSE)),\" \"),8)","v":"330206"},{"$f":"IF(COUNTIF($F$4:$F41,$F41)<2,$F41,\" \")","v":" "},"",{"$f":"IF(I41=F41,#REF!,\"\")","v":""},{"$f":"IF(COUNTIF($F$4:$F41,$F41)<3,$F41,\" \")","v":" "},"",{"$f":"IF(L41=$F41,#REF!,\"\")","v":""},"",1000,{"$f":"IF(O41=$F41,#REF!,1000)","v":1000},{"$f":"IF(COUNTIF($F$4:$F41,I41)<4,$F41,\" \")","v":" "},"",{"$f":"IF(R41=$F41,#REF!,\"\")","v":""},"","","",{"$f":"IF(V41=$F41,#REF!,\"\")","v":""}," ","T"]
[]
[]
[]
[{"$f":"IF(B45<1,1000,(IF(Z45=B45,B45,(20100-SUM($Z$4:$Z$204))/(COUNTIF($Z$4:$Z$204,\"T\")))))","v":1000},null,null,{"$f":"IF(C45>0,CONCATENATE((VLOOKUP($C45,Inscription!$A$12:$G$211,3,FALSE)),\"   \",(VLOOKUP($C45,Inscription!$A$12:$G$211,4,FALSE))),\" \")","v":" "},null,{"$f":"IF(C45>0,(VLOOKUP($C45,Inscription!$A$12:$G$211,5,FALSE)),\" \")","v":" "},{"$f":"IF(C45>0,(VLOOKUP($C45,Inscription!$A$12:$G$211,7,FALSE)),\" \")","v":" "},{"$f":"LEFT(IF(C45>0,(VLOOKUP($C45,Inscription!$A$12:$G$211,6,FALSE)),\" \"),8)","v":" "},{"$f":"IF(COUNTIF($F$4:$F45,$F45)<2,$F45,\" \")","v":" "},{"$f":"IF(I45=F45,A45,\"\")","v":1000},{"$f":"IF(I45=F45,#REF!,\"\")","v":{"$error":"#REF!"}},{"$f":"IF(COUNTIF($F$4:$F45,$F45)<3,$F45,\" \")","v":" "},1000,{"$f":"IF(L45=$F45,#REF!,\"\")","v":{"$error":"#REF!"}},"",1000,{"$f":"IF(O45=$F45,#REF!,1000)","v":1000},{"$f":"IF(COUNTIF($F$4:$F45,I45)<4,$F45,\" \")","v":" "},1000,{"$f":"IF(R45=$F45,#REF!,\"\")","v":{"$error":"#REF!"}},"","","",{"$f":"IF(V45=$F45,#REF!,\"\")","v":""},{"$f":"IF(COUNTIF($C$4:$C$204,C45)>1,\"X\",\" \")","v":" "},{"$f":"IF(COUNTIF($B$4:$B$204,B45)>1,\"T\",B45)","v":0},1,0,1000,1000,1000,1000,1000,1000,{"$f":"IF(AB45=\" \",\" \",IF($AB45>0,SUM(AC45+AE45+AG45),\" \"))","v":" "},{"$f":"IF(AB45=\" \",\" \",IF($AB45>0,SUM(AD45+AF45+AH45),\" \"))","v":" "}]
[{"$error":"#REF!"},1,110,{"$f":"IF(C46>0,CONCATENATE((VLOOKUP($C46,Inscription!$A$12:$G$211,3,FALSE)),\"   \",(VLOOKUP($C46,Inscription!$A$12:$G$211,4,FALSE))),\" \")","v":"Le Bihan   Clément"},null,{"$f":"IF(C46>0,(VLOOKUP($C46,Inscription!$A$12:$G$211,5,FALSE)),\" \")","v":"UC Plaudren"},{"$f":"IF(C46>0,(VLOOKUP($C46,Inscription!$A$12:$G$211,7,FALSE)),\" \")","v":"minime"},{"$f":"LEFT(IF(C46>0,(VLOOKUP($C46,Inscription!$A$12:$G$211,6,FALSE)),\" \"),8)","v":"136145"},{"$f":"IF(COUNTIF($F$4:$F46,$F46)<2,$F46,\" \")","v":"UC Plaudren"},{"$error":"#REF!"},{"$f":"IF(I46=F46,#REF!,\"\")","v":{"$error":"#REF!"}},{"$f":"IF(COUNTIF($F$4:$F46,$F46)<3,$F46,\" \")","v":"UC Plaudren"},{"$error":"#REF!"},{"$f":"IF(L46=$F46,#REF!,\"\")","v":{"$error":"#REF!"}},"",1000,{"$f":"IF(O46=$F46,#REF!,1000)","v":1000},{"$f":"IF(COUNTIF($F$4:$F46,I46)<4,$F46,\" \")","v":"UC Plaudren"},{"$error":"#REF!"},{"$f":"IF(R46=$F46,#REF!,\"\")","v":{"$error":"#REF!"}},"","","",{"$f":"IF(V46=$F46,#REF!,\"\")","v":""}," ","T",2,0,1000,1000,1000,1000,1000,1000," "," "]
[{"$error":"#REF!"},2,112,{"$f":"IF(C47>0,CONCATENATE((VLOOKUP($C47,Inscription!$A$12:$G$211,3,FALSE)),\"   \",(VLOOKUP($C47,Inscription!$A$12:$G$211,4,FALSE))),\" \")","v":"Le Bihan   Evann"},null,{"$f":"IF(C47>0,(VLOOKUP($C47,Inscription!$A$12:$G$211,5,FALSE)),\" \")","v":"UC Plaudren"},{"$f":"IF(C47>0,(VLOOKUP($C47,Inscription!$A$12:$G$211,7,FALSE)),\" \")","v":"minime"},{"$f":"LEFT(IF(C47>0,(VLOOKUP($C47,Inscription!$A$12:$G$211,6,FALSE)),\" \"),8)","v":"379622"},{"$f":"IF(COUNTIF($F$4:$F47,$F47)<2,$F47,\" \")","v":" "},"",{"$f":"IF(I47=F47,#REF!,\"\")","v":""},{"$f":"IF(COUNTIF($F$4:$F47,$F47)<3,$F47,\" \")","v":"UC Plaudren"},{"$error":"#REF!"},{"$f":"IF(L47=$F47,#REF!,\"\")","v":{"$error":"#REF!"}},"UC Plaudren",{"$error":"#REF!"},{"$f":"IF(O47=$F47,#REF!,1000)","v":{"$error":"#REF!"}},{"$f":"IF(COUNTIF($F$4:$F47,I47)<4,$F47,\" \")","v":" "},"",{"$f":"IF(R47=$F47,#REF!,\"\")","v":""},""," ","",{"$f":"IF(V47=$F47,#REF!,\"\")","v":""}," ","T",3,0,1000,1000,1000,1000,1000,1000," "," "]
[{"$error":"#REF!"},3,111,{"$f":"IF(C48>0,CONCATENATE((VLOOKUP($C48,Inscription!$A$12:$G$211,3,FALSE)),\"   \",(VLOOKUP($C48,Inscription!$A$12:$G$211,4,FALSE))),\" \")","v":"Besnard colas   Ismaël"},null,{"$f":"IF(C48>0,(VLOOKUP($C48,Inscription!$A$12:$G$211,5,FALSE)),\" \")","v":"CC Moncontour"},{"$f":"IF(C48>0,(VLOOKUP($C48,Inscription!$A$12:$G$211,7,FALSE)),\" \")","v":"minime"},{"$f":"LEFT(IF(C48>0,(VLOOKUP($C48,Inscription!$A$12:$G$211,6,FALSE)),\" \"),8)","v":"400382"},{"$f":"IF(COUNTIF($F$4:$F48,$F48)<2,$F48,\" \")","v":"CC Moncontour"},{"$error":"#REF!"},{"$f":"IF(I48=F48,#REF!,\"\")","v":{"$error":"#REF!"}},{"$f":"IF(COUNTIF($F$4:$F48,$F48)<3,$F48,\" \")","v":"CC Moncontour"},{"$error":"#REF!"},{"$f":"IF(L48=$F48,#REF!,\"\")","v":{"$error":"#REF!"}},"",1000,{"$f":"IF(O48=$F48,#REF!,1000)","v":1000},{"$f":"IF(COUNTIF($F$4:$F48,I48)<4,$F48,\" \")","v":"CC Moncontour"},{"$error":"#REF!"},{"$f":"IF(R48=$F48,#REF!,\"\")","v":{"$error":"#REF!"}},"","","",{"$f":"IF(V48=$F48,#REF!,\"\")","v":""}," ","T",4,0,1000,1000,1000,1000,1000,1000," "," "]
[{"$error":"#REF!"},4,115,{"$f":"IF(C49>0,CONCATENATE((VLOOKUP($C49,Inscription!$A$12:$G$211,3,FALSE)),\"   \",(VLOOKUP($C49,Inscription!$A$12:$G$211,4,FALSE))),\" \")","v":"le Corguille   Brieuc"},null,{"$f":"IF(C49>0,(VLOOKUP($C49,Inscription!$A$12:$G$211,5,FALSE)),\" \")","v":"VC Plurien"},{"$f":"IF(C49>0,(VLOOKUP($C49,Inscription!$A$12:$G$211,7,FALSE)),\" \")","v":"minime"},{"$f":"LEFT(IF(C49>0,(VLOOKUP($C49,Inscription!$A$12:$G$211,6,FALSE)),\" \"),8)","v":"434773"},{"$f":"IF(COUNTIF($F$4:$F49,$F49)<2,$F49,\" \")","v":" "},"",{"$f":"IF(I49=F49,#REF!,\"\")","v":""},{"$f":"IF(COUNTIF($F$4:$F49,$F49)<3,$F49,\" \")","v":"VC Plurien"},{"$error":"#REF!"},{"$f":"IF(L49=$F49,#REF!,\"\")","v":{"$error":"#REF!"}},"VC Plurien",{"$error":"#REF!"},{"$f":"IF(O49=$F49,#REF!,1000)","v":{"$error":"#REF!"}},{"$f":"IF(COUNTIF($F$4:$F49,I49)<4,$F49,\" \")","v":" "},"",{"$f":"IF(R49=$F49,#REF!,\"\")","v":""},""," ","",{"$f":"IF(V49=$F49,#REF!,\"\")","v":""}," ","T",5,0,1000,1000,1000,1000,1000,1000," "," "]
[{"$error":"#REF!"},5,114,{"$f":"IF(C50>0,CONCATENATE((VLOOKUP($C50,Inscription!$A$12:$G$211,3,FALSE)),\"   \",(VLOOKUP($C50,Inscription!$A$12:$G$211,4,FALSE))),\" \")","v":"Briand   Mathis"},null,{"$f":"IF(C50>0,(VLOOKUP($C50,Inscription!$A$12:$G$211,5,FALSE)),\" \")","v":"VC Evron"},{"$f":"IF(C50>0,(VLOOKUP($C50,Inscription!$A$12:$G$211,7,FALSE)),\" \")","v":"minime"},{"$f":"LEFT(IF(C50>0,(VLOOKUP($C50,Inscription!$A$12:$G$211,6,FALSE)),\" \"),8)","v":"431995"},{"$f":"IF(COUNTIF($F$4:$F50,$F50)<2,$F50,\" \")","v":" "},"",{"$f":"IF(I50=F50,#REF!,\"\")","v":""},{"$f":"IF(COUNTIF($F$4:$F50,$F50)<3,$F50,\" \")","v":" "},"",{"$f":"IF(L50=$F50,#REF!,\"\")","v":""},"",1000,{"$f":"IF(O50=$F50,#REF!,1000)","v":1000},{"$f":"IF(COUNTIF($F$4:$F50,I50)<4,$F50,\" \")","v":" "},"",{"$f":"IF(R50=$F50,#REF!,\"\")","v":""},"","","",{"$f":"IF(V50=$F50,#REF!,\"\")","v":""}," ","T",6,0,1000,1000,1000,1000,1000,1000," "," "]
[null,"absent",113]
[{"$f":"IF(B52<1,1000,(IF(Z52=B52,B52,(20100-SUM($Z$4:$Z$204))/(COUNTIF($Z$4:$Z$204,\"T\")))))","v":1000},null,null,{"$f":"IF(C52>0,CONCATENATE((VLOOKUP($C52,Inscription!$A$12:$G$211,3,FALSE)),\"   \",(VLOOKUP($C52,Inscription!$A$12:$G$211,4,FALSE))),\" \")","v":" "},null,{"$f":"IF(C52>0,(VLOOKUP($C52,Inscription!$A$12:$G$211,5,FALSE)),\" \")","v":" "},{"$f":"IF(C52>0,(VLOOKUP($C52,Inscription!$A$12:$G$211,7,FALSE)),\" \")","v":" "},{"$f":"LEFT(IF(C52>0,(VLOOKUP($C52,Inscription!$A$12:$G$211,6,FALSE)),\" \"),8)","v":" "},{"$f":"IF(COUNTIF($F$4:$F52,$F52)<2,$F52,\" \")","v":" "},{"$f":"IF(I52=F52,A52,\"\")","v":1000},{"$f":"IF(I52=F52,#REF!,\"\")","v":{"$error":"#REF!"}},{"$f":"IF(COUNTIF($F$4:$F52,$F52)<3,$F52,\" \")","v":" "},1000,{"$f":"IF(L52=$F52,#REF!,\"\")","v":{"$error":"#REF!"}},"",1000,{"$f":"IF(O52=$F52,#REF!,1000)","v":1000},{"$f":"IF(COUNTIF($F$4:$F52,I52)<4,$F52,\" \")","v":" "},1000,{"$f":"IF(R52=$F52,#REF!,\"\")","v":{"$error":"#REF!"}},"","","",{"$f":"IF(V52=$F52,#REF!,\"\")","v":""},{"$f":"IF(COUNTIF($C$4:$C$204,C52)>1,\"X\",\" \")","v":" "},{"$f":"IF(COUNTIF($B$4:$B$204,B52)>1,\"T\",B52)","v":0},7,0,1000,1000,1000,1000,1000,1000," "," "]
[1000,null,null,{"$f":"IF(C53>0,CONCATENATE((VLOOKUP($C53,Inscription!$A$12:$G$211,3,FALSE)),\"   \",(VLOOKUP($C53,Inscription!$A$12:$G$211,4,FALSE))),\" \")","v":" "},null,{"$f":"IF(C53>0,(VLOOKUP($C53,Inscription!$A$12:$G$211,5,FALSE)),\" \")","v":" "},{"$f":"IF(C53>0,(VLOOKUP($C53,Inscription!$A$12:$G$211,7,FALSE)),\" \")","v":" "},{"$f":"LEFT(IF(C53>0,(VLOOKUP($C53,Inscription!$A$12:$G$211,6,FALSE)),\" \"),8)","v":" "},{"$f":"IF(COUNTIF($F$4:$F53,$F53)<2,$F53,\" \")","v":" "},1000,{"$f":"IF(I53=F53,#REF!,\"\")","v":{"$error":"#REF!"}},{"$f":"IF(COUNTIF($F$4:$F53,$F53)<3,$F53,\" \")","v":" "},1000,{"$f":"IF(L53=$F53,#REF!,\"\")","v":{"$error":"#REF!"}},"",1000,{"$f":"IF(O53=$F53,#REF!,1000)","v":1000},{"$f":"IF(COUNTIF($F$4:$F53,I53)<4,$F53,\" \")","v":" "},1000,{"$f":"IF(R53=$F53,#REF!,\"\")","v":{"$error":"#REF!"}},"","","",{"$f":"IF(V53=$F53,#REF!,\"\")","v":""}," ",0,8,0,1000,1000,1000,1000,1000,1000," "," "]
[1000,null,null,{"$f":"IF(C54>0,CONCATENATE((VLOOKUP($C54,Inscription!$A$12:$G$211,3,FALSE)),\"   \",(VLOOKUP($C54,Inscription!$A$12:$G$211,4,FALSE))),\" \")","v":" "},null,{"$f":"IF(C54>0,(VLOOKUP($C54,Inscription!$A$12:$G$211,5,FALSE)),\" \")","v":" "},{"$f":"IF(C54>0,(VLOOKUP($C54,Inscription!$A$12:$G$211,7,FALSE)),\" \")","v":" "},{"$f":"LEFT(IF(C54>0,(VLOOKUP($C54,Inscription!$A$12:$G$211,6,FALSE)),\" \"),8)","v":" "},{"$f":"IF(COUNTIF($F$4:$F54,$F54)<2,$F54,\" \")","v":" "},1000,{"$f":"IF(I54=F54,#REF!,\"\")","v":{"$error":"#REF!"}},{"$f":"IF(COUNTIF($F$4:$F54,$F54)<3,$F54,\" \")","v":" "},1000,{"$f":"IF(L54=$F54,#REF!,\"\")","v":{"$error":"#REF!"}},"",1000,{"$f":"IF(O54=$F54,#REF!,1000)","v":1000},{"$f":"IF(COUNTIF($F$4:$F54,I54)<4,$F54,\" \")","v":" "},1000,{"$f":"IF(R54=$F54,#REF!,\"\")","v":{"$error":"#REF!"}},"","","",{"$f":"IF(V54=$F54,#REF!,\"\")","v":""}," ",0,9,0,1000,1000,1000,1000,1000,1000," "," "]
[49,49,101,{"$f":"IF(C55>0,CONCATENATE((VLOOKUP($C55,Inscription!$A$12:$G$211,3,FALSE)),\"   \",(VLOOKUP($C55,Inscription!$A$12:$G$211,4,FALSE))),\" \")","v":"Flégeau   Gaël"},null,{"$f":"IF(C55>0,(VLOOKUP($C55,Inscription!$A$12:$G$211,5,FALSE)),\" \")","v":"Team Bikers 22"},{"$f":"IF(C55>0,(VLOOKUP($C55,Inscription!$A$12:$G$211,7,FALSE)),\" \")","v":"cadet"},{"$f":"LEFT(IF(C55>0,(VLOOKUP($C55,Inscription!$A$12:$G$211,6,FALSE)),\" \"),8)","v":"269847"},{"$f":"IF(COUNTIF($F$4:$F55,$F55)<2,$F55,\" \")","v":" "},"",{"$f":"IF(I55=F55,#REF!,\"\")","v":""},{"$f":"IF(COUNTIF($F$4:$F55,$F55)<3,$F55,\" \")","v":" "},"",{"$f":"IF(L55=$F55,#REF!,\"\")","v":""},"",1000,{"$f":"IF(O55=$F55,#REF!,1000)","v":1000},{"$f":"IF(COUNTIF($F$4:$F55,I55)<4,$F55,\" \")","v":" "},"",{"$f":"IF(R55=$F55,#REF!,\"\")","v":""},"","","",{"$f":"IF(V55=$F55,#REF!,\"\")","v":""}," ",49,10,0,1000,1000,1000,1000,1000,1000," "," "]
[50,50,104,{"$f":"IF(C56>0,CONCATENATE((VLOOKUP($C56,Inscription!$A$12:$G$211,3,FALSE)),\"   \",(VLOOKUP($C56,Inscription!$A$12:$G$211,4,FALSE))),\" \")","v":"Durand   Joan"},null,{"$f":"IF(C56>0,(VLOOKUP($C56,Inscription!$A$12:$G$211,5,FALSE)),\" \")","v":"Lamball'breizh"},{"$f":"IF(C56>0,(VLOOKUP($C56,Inscription!$A$12:$G$211,7,FALSE)),\" \")","v":"cadet"},{"$f":"LEFT(IF(C56>0,(VLOOKUP($C56,Inscription!$A$12:$G$211,6,FALSE)),\" \"),8)","v":"383110"},{"$f":"IF(COUNTIF($F$4:$F56,$F56)<2,$F56,\" \")","v":" "},"",{"$f":"IF(I56=F56,#REF!,\"\")","v":""},{"$f":"IF(COUNTIF($F$4:$F56,$F56)<3,$F56,\" \")","v":" "},"",{"$f":"IF(L56=$F56,#REF!,\"\")","v":""},"",1000,{"$f":"IF(O56=$F56,#REF!,1000)","v":1000},{"$f":"IF(COUNTIF($F$4:$F56,I56)<4,$F56,\" \")","v":" "},"",{"$f":"IF(R56=$F56,#REF!,\"\")","v":""},"","","",{"$f":"IF(V56=$F56,#REF!,\"\")","v":""}," ",50,11,0,1000,1000,1000,1000,1000,1000," "," "]
[51,51,100,{"$f":"IF(C57>0,CONCATENATE((VLOOKUP($C57,Inscription!$A$12:$G$211,3,FALSE)),\"   \",(VLOOKUP($C57,Inscription!$A$12:$G$211,4,FALSE))),\" \")","v":"Creseveur   Gurwan"},null,{"$f":"IF(C57>0,(VLOOKUP($C57,Inscription!$A$12:$G$211,5,FALSE)),\" \")","v":"Team XC du Léguer"},{"$f":"IF(C57>0,(VLOOKUP($C57,Inscription!$A$12:$G$211,7,FALSE)),\" \")","v":"Cadet"},{"$f":"LEFT(IF(C57>0,(VLOOKUP($C57,Inscription!$A$12:$G$211,6,FALSE)),\" \"),8)","v":"330214"},{"$f":"IF(COUNTIF($F$4:$F57,$F57)<2,$F57,\" \")","v":" "},"",{"$f":"IF(I57=F57,#REF!,\"\")","v":""},{"$f":"IF(COUNTIF($F$4:$F57,$F57)<3,$F57,\" \")","v":" "},"",{"$f":"IF(L57=$F57,#REF!,\"\")","v":""},"",1000,{"$f":"IF(O57=$F57,#REF!,1000)","v":1000},{"$f":"IF(COUNTIF($F$4:$F57,I57)<4,$F57,\" \")","v":" "},"",{"$f":"IF(R57=$F57,#REF!,\"\")","v":""},"","","",{"$f":"IF(V57=$F57,#REF!,\"\")","v":""}," ",51,12,0,1000,1000,1000,1000,1000,1000," "," "]
[52,52,105,{"$f":"IF(C58>0,CONCATENATE((VLOOKUP($C58,Inscription!$A$12:$G$211,3,FALSE)),\"   \",(VLOOKUP($C58,Inscription!$A$12:$G$211,4,FALSE))),\" \")","v":"Cadieu   Martin"},null,{"$f":"IF(C58>0,(VLOOKUP($C58,Inscription!$A$12:$G$211,5,FALSE)),\" \")","v":"VTT du Lié"},{"$f":"IF(C58>0,(VLOOKUP($C58,Inscription!$A$12:$G$211,7,FALSE)),\" \")","v":"Cadet"},{"$f":"LEFT(IF(C58>0,(VLOOKUP($C58,Inscription!$A$12:$G$211,6,FALSE)),\" \"),8)","v":""},{"$f":"IF(COUNTIF($F$4:$F58,$F58)<2,$F58,\" \")","v":" "},"",{"$f":"IF(I58=F58,#REF!,\"\")","v":""},{"$f":"IF(COUNTIF($F$4:$F58,$F58)<3,$F58,\" \")","v":"VTT du Lié"},52,{"$f":"IF(L58=$F58,#REF!,\"\")","v":{"$error":"#REF!"}},"VTT du Lié",52,{"$f":"IF(O58=$F58,#REF!,1000)","v":{"$error":"#REF!"}},{"$f":"IF(COUNTIF($F$4:$F58,I58)<4,$F58,\" \")","v":" "},"",{"$f":"IF(R58=$F58,#REF!,\"\")","v":""},""," ","",{"$f":"IF(V58=$F58,#REF!,\"\")","v":""}," ",52,13,0,1000,1000,1000,1000,1000,1000," "," "]
[53,53,102,{"$f":"IF(C59>0,CONCATENATE((VLOOKUP($C59,Inscription!$A$12:$G$211,3,FALSE)),\"   \",(VLOOKUP($C59,Inscription!$A$12:$G$211,4,FALSE))),\" \")","v":"Rouille   Robin"},null,{"$f":"IF(C59>0,(VLOOKUP($C59,Inscription!$A$12:$G$211,5,FALSE)),\" \")","v":"Team Bikers 22"},{"$f":"IF(C59>0,(VLOOKUP($C59,Inscription!$A$12:$G$211,7,FALSE)),\" \")","v":"cadet"},{"$f":"LEFT(IF(C59>0,(VLOOKUP($C59,Inscription!$A$12:$G$211,6,FALSE)),\" \"),8)","v":"390947"},{"$f":"IF(COUNTIF($F$4:$F59,$F59)<2,$F59,\" \")","v":" "},"",{"$f":"IF(I59=F59,#REF!,\"\")","v":""},{"$f":"IF(COUNTIF($F$4:$F59,$F59)<3,$F59,\" \")","v":" "},"",{"$f":"IF(L59=$F59,#REF!,\"\")","v":""},"",1000,{"$f":"IF(O59=$F59,#REF!,1000)","v":1000},{"$f":"IF(COUNTIF($F$4:$F59,I59)<4,$F59,\" \")","v":" "},"",{"$f":"IF(R59=$F59,#REF!,\"\")","v":""},"","","",{"$f":"IF(V59=$F59,#REF!,\"\")","v":""}," ",53,14,0,1000,1000,1000,1000,1000,1000," "," "]
[54,54,103,{"$f":"IF(C60>0,CONCATENATE((VLOOKUP($C60,Inscription!$A$12:$G$211,3,FALSE)),\"   \",(VLOOKUP($C60,Inscription!$A$12:$G$211,4,FALSE))),\" \")","v":"Madec   Rafael"},null,{"$f":"IF(C60>0,(VLOOKUP($C60,Inscription!$A$12:$G$211,5,FALSE)),\" \")","v":"VS Ploumagoar"},{"$f":"IF(C60>0,(VLOOKUP($C60,Inscription!$A$12:$G$211,7,FALSE)),\" \")","v":"cadet"},{"$f":"LEFT(IF(C60>0,(VLOOKUP($C60,Inscription!$A$12:$G$211,6,FALSE)),\" \"),8)","v":""},{"$f":"IF(COUNTIF($F$4:$F60,$F60)<2,$F60,\" \")","v":"VS Ploumagoar"},54,{"$f":"IF(I60=F60,#REF!,\"\")","v":{"$error":"#REF!"}},{"$f":"IF(COUNTIF($F$4:$F60,$F60)<3,$F60,\" \")","v":"VS Ploumagoar"},54,{"$f":"IF(L60=$F60,#REF!,\"\")","v":{"$error":"#REF!"}},"",1000,{"$f":"IF(O60=$F60,#REF!,1000)","v":1000},{"$f":"IF(COUNTIF($F$4:$F60,I60)<4,$F60,\" \")","v":"VS Ploumagoar"},54,{"$f":"IF(R60=$F60,#REF!,\"\")","v":{"$error":"#REF!"}},"","","",{"$f":"IF(V60=$F60,#REF!,\"\")","v":""}," ",54,15,0,1000,1000,1000,1000,1000,1000," "," "]
[1000,null,null,{"$f":"IF(C61>0,CONCATENATE((VLOOKUP($C61,Inscription!$A$12:$G$211,3,FALSE)),\"   \",(VLOOKUP($C61,Inscription!$A$12:$G$211,4,FALSE))),\" \")","v":" "},null,{"$f":"IF(C61>0,(VLOOKUP($C61,Inscription!$A$12:$G$211,5,FALSE)),\" \")","v":" "},{"$f":"IF(C61>0,(VLOOKUP($C61,Inscription!$A$12:$G$211,7,FALSE)),\" \")","v":" "},{"$f":"LEFT(IF(C61>0,(VLOOKUP($C61,Inscription!$A$12:$G$211,6,FALSE)),\" \"),8)","v":" "},{"$f":"IF(COUNTIF($F$4:$F61,$F61)<2,$F61,\" \")","v":" "},1000,{"$f":"IF(I61=F61,#REF!,\"\")","v":{"$error":"#REF!"}},{"$f":"IF(COUNTIF($F$4:$F61,$F61)<3,$F61,\" \")","v":" "},1000,{"$f":"IF(L61=$F61,#REF!,\"\")","v":{"$error":"#REF!"}},"",1000,{"$f":"IF(O61=$F61,#REF!,1000)","v":1000},{"$f":"IF(COUNTIF($F$4:$F61,I61)<4,$F61,\" \")","v":" "},1000,{"$f":"IF(R61=$F61,#REF!,\"\")","v":{"$error":"#REF!"}},"","","",{"$f":"IF(V61=$F61,#REF!,\"\")","v":""}," ",0,16,0,1000,1000,1000,1000,1000,1000," "," "]
[1000,null,null,{"$f":"IF(C62>0,CONCATENATE((VLOOKUP($C62,Inscription!$A$12:$G$211,3,FALSE)),\"   \",(VLOOKUP($C62,Inscription!$A$12:$G$211,4,FALSE))),\" \")","v":" "},null,{"$f":"IF(C62>0,(VLOOKUP($C62,Inscription!$A$12:$G$211,5,FALSE)),\" \")","v":" "},{"$f":"IF(C62>0,(VLOOKUP($C62,Inscription!$A$12:$G$211,7,FALSE)),\" \")","v":" "},{"$f":"LEFT(IF(C62>0,(VLOOKUP($C62,Inscription!$A$12:$G$211,6,FALSE)),\" \"),8)","v":" "},{"$f":"IF(COUNTIF($F$4:$F62,$F62)<2,$F62,\" \")","v":" "},1000,{"$f":"IF(I62=F62,#REF!,\"\")","v":{"$error":"#REF!"}},{"$f":"IF(COUNTIF($F$4:$F62,$F62)<3,$F62,\" \")","v":" "},1000,{"$f":"IF(L62=$F62,#REF!,\"\")","v":{"$error":"#REF!"}},"",1000,{"$f":"IF(O62=$F62,#REF!,1000)","v":1000},{"$f":"IF(COUNTIF($F$4:$F62,I62)<4,$F62,\" \")","v":" "},1000,{"$f":"IF(R62=$F62,#REF!,\"\")","v":{"$error":"#REF!"}},"","","",{"$f":"IF(V62=$F62,#REF!,\"\")","v":""}," ",0,17,0,1000,1000,1000,1000,1000,1000," "," "]
[{"$f":"IF(B117<1,1000,(IF(Z63=B117,B117,(20100-SUM($Z$4:$Z$204))/(COUNTIF($Z$4:$Z$204,\"T\")))))","v":1000},1,62,{"$f":"IF(C63>0,CONCATENATE((VLOOKUP($C63,Inscription!$A$12:$G$211,3,FALSE)),\"   \",(VLOOKUP($C63,Inscription!$A$12:$G$211,4,FALSE))),\" \")","v":"Lecellier   Raymond"},null,{"$f":"IF(C63>0,(VLOOKUP($C63,Inscription!$A$12:$G$211,5,FALSE)),\" \")","v":"Team Mégrit"},{"$f":"IF(C63>0,(VLOOKUP($C63,Inscription!$A$12:$G$211,7,FALSE)),\" \")","v":3},{"$f":"LEFT(IF(C63>0,(VLOOKUP($C63,Inscription!$A$12:$G$211,6,FALSE)),\" \"),8)","v":"143624"},{"$f":"IF(COUNTIF($F$4:$F63,$F63)<2,$F63,\" \")","v":"Team Mégrit"},1000,{"$f":"IF(I63=F63,#REF!,\"\")","v":{"$error":"#REF!"}},{"$f":"IF(COUNTIF($F$4:$F63,$F63)<3,$F63,\" \")","v":"Team Mégrit"},1000,{"$f":"IF(L63=$F63,#REF!,\"\")","v":{"$error":"#REF!"}},"",1000,{"$f":"IF(O63=$F63,#REF!,1000)","v":1000},{"$f":"IF(COUNTIF($F$4:$F63,I63)<4,$F63,\" \")","v":"Team Mégrit"},1000,{"$f":"IF(R63=$F63,#REF!,\"\")","v":{"$error":"#REF!"}},"","","",{"$f":"IF(V63=$F63,#REF!,\"\")","v":""},{"$f":"IF(COUNTIF($C$4:$C$204,C117)>1,\"X\",\" \")","v":" "},{"$f":"IF(COUNTIF($B$4:$B$204,B117)>1,\"T\",B117)","v":0},18,0,1000,1000,1000,1000,1000,1000," "," "]
[{"$f":"IF(B118<1,1000,(IF(Z64=B118,B118,(20100-SUM($Z$4:$Z$204))/(COUNTIF($Z$4:$Z$204,\"T\")))))","v":1000},2,60,{"$f":"IF(C64>0,CONCATENATE((VLOOKUP($C64,Inscription!$A$12:$G$211,3,FALSE)),\"   \",(VLOOKUP($C64,Inscription!$A$12:$G$211,4,FALSE))),\" \")","v":"Nicolas   Jean-Charles"},null,{"$f":"IF(C64>0,(VLOOKUP($C64,Inscription!$A$12:$G$211,5,FALSE)),\" \")","v":"AC Vildé-Guingalan"},{"$f":"IF(C64>0,(VLOOKUP($C64,Inscription!$A$12:$G$211,7,FALSE)),\" \")","v":3},{"$f":"LEFT(IF(C64>0,(VLOOKUP($C64,Inscription!$A$12:$G$211,6,FALSE)),\" \"),8)","v":"137756"},{"$f":"IF(COUNTIF($F$4:$F64,$F64)<2,$F64,\" \")","v":"AC Vildé-Guingalan"},1000,{"$f":"IF(I64=F64,#REF!,\"\")","v":{"$error":"#REF!"}},{"$f":"IF(COUNTIF($F$4:$F64,$F64)<3,$F64,\" \")","v":"AC Vildé-Guingalan"},1000,{"$f":"IF(L64=$F64,#REF!,\"\")","v":{"$error":"#REF!"}},"",1000,{"$f":"IF(O64=$F64,#REF!,1000)","v":1000},{"$f":"IF(COUNTIF($F$4:$F64,I64)<4,$F64,\" \")","v":"AC Vildé-Guingalan"},1000,{"$f":"IF(R64=$F64,#REF!,\"\")","v":{"$error":"#REF!"}},"","","",{"$f":"IF(V64=$F64,#REF!,\"\")","v":""},{"$f":"IF(COUNTIF($C$4:$C$204,C118)>1,\"X\",\" \")","v":" "},{"$f":"IF(COUNTIF($B$4:$B$204,B118)>1,\"T\",B118)","v":0},19,0,1000,1000,1000,1000,1000,1000," "," "]
[{"$f":"IF(B119<1,1000,(IF(Z65=B119,B119,(20100-SUM($Z$4:$Z$204))/(COUNTIF($Z$4:$Z$204,\"T\")))))","v":1000},3,69,{"$f":"IF(C65>0,CONCATENATE((VLOOKUP($C65,Inscription!$A$12:$G$211,3,FALSE)),\"   \",(VLOOKUP($C65,Inscription!$A$12:$G$211,4,FALSE))),\" \")","v":"Guillot   Denis"},null,{"$f":"IF(C65>0,(VLOOKUP($C65,Inscription!$A$12:$G$211,5,FALSE)),\" \")","v":"Team Pays de Dinan"},{"$f":"IF(C65>0,(VLOOKUP($C65,Inscription!$A$12:$G$211,7,FALSE)),\" \")","v":3},{"$f":"LEFT(IF(C65>0,(VLOOKUP($C65,Inscription!$A$12:$G$211,6,FALSE)),\" \"),8)","v":""},{"$f":"IF(COUNTIF($F$4:$F65,$F65)<2,$F65,\" \")","v":" "},"",{"$f":"IF(I65=F65,#REF!,\"\")","v":""},{"$f":"IF(COUNTIF($F$4:$F65,$F65)<3,$F65,\" \")","v":"Team Pays de Dinan"},1000,{"$f":"IF(L65=$F65,#REF!,\"\")","v":{"$error":"#REF!"}},"Team Pays de Dinan",1000,{"$f":"IF(O65=$F65,#REF!,1000)","v":{"$error":"#REF!"}},{"$f":"IF(COUNTIF($F$4:$F65,I65)<4,$F65,\" \")","v":" "},"",{"$f":"IF(R65=$F65,#REF!,\"\")","v":""},""," ","",{"$f":"IF(V65=$F65,#REF!,\"\")","v":""},{"$f":"IF(COUNTIF($C$4:$C$204,C119)>1,\"X\",\" \")","v":" "},{"$f":"IF(COUNTIF($B$4:$B$204,B119)>1,\"T\",B119)","v":0},20,0,1000,1000,1000,1000,1000,1000," "," "]
[{"$f":"IF(B120<1,1000,(IF(Z66=B120,B120,(20100-SUM($Z$4:$Z$204))/(COUNTIF($Z$4:$Z$204,\"T\")))))","v":1000},4,66,{"$f":"IF(C66>0,CONCATENATE((VLOOKUP($C66,Inscription!$A$12:$G$211,3,FALSE)),\"   \",(VLOOKUP($C66,Inscription!$A$12:$G$211,4,FALSE))),\" \")","v":"Gouya   Noël"},null,{"$f":"IF(C66>0,(VLOOKUP($C66,Inscription!$A$12:$G$211,5,FALSE)),\" \")","v":"Team Pays de Dinan"},{"$f":"IF(C66>0,(VLOOKUP($C66,Inscription!$A$12:$G$211,7,FALSE)),\" \")","v":3},{"$f":"LEFT(IF(C66>0,(VLOOKUP($C66,Inscription!$A$12:$G$211,6,FALSE)),\" \"),8)","v":"136620"},{"$f":"IF(COUNTIF($F$4:$F66,$F66)<2,$F66,\" \")","v":" "},"",{"$f":"IF(I66=F66,#REF!,\"\")","v":""},{"$f":"IF(COUNTIF($F$4:$F66,$F66)<3,$F66,\" \")","v":" "},"",{"$f":"IF(L66=$F66,#REF!,\"\")","v":""},"",1000,{"$f":"IF(O66=$F66,#REF!,1000)","v":1000},{"$f":"IF(COUNTIF($F$4:$F66,I66)<4,$F66,\" \")","v":" "},"",{"$f":"IF(R66=$F66,#REF!,\"\")","v":""},"","","",{"$f":"IF(V66=$F66,#REF!,\"\")","v":""},{"$f":"IF(COUNTIF($C$4:$C$204,C120)>1,\"X\",\" \")","v":" "},{"$f":"IF(COUNTIF($B$4:$B$204,B120)>1,\"T\",B120)","v":0},21,0,1000,1000,1000,1000,1000,1000," "," "]
[{"$f":"IF(B67<1,1000,(IF(Z67=B67,B67,(20100-SUM($Z$4:$Z$204))/(COUNTIF($Z$4:$Z$204,\"T\")))))","v":{"$error":"#REF!"}},5,61,{"$f":"IF(C67>0,CONCATENATE((VLOOKUP($C67,Inscription!$A$12:$G$211,3,FALSE)),\"   \",(VLOOKUP($C67,Inscription!$A$12:$G$211,4,FALSE))),\" \")","v":"Lemaitre    Alain"},null,{"$f":"IF(C67>0,(VLOOKUP($C67,Inscription!$A$12:$G$211,5,FALSE)),\" \")","v":"AC Vildé-Guingalan"},{"$f":"IF(C67>0,(VLOOKUP($C67,Inscription!$A$12:$G$211,7,FALSE)),\" \")","v":3},{"$f":"LEFT(IF(C67>0,(VLOOKUP($C67,Inscription!$A$12:$G$211,6,FALSE)),\" \"),8)","v":"136151"},{"$f":"IF(COUNTIF($F$4:$F67,$F67)<2,$F67,\" \")","v":" "},"",{"$f":"IF(I67=F67,#REF!,\"\")","v":""},{"$f":"IF(COUNTIF($F$4:$F67,$F67)<3,$F67,\" \")","v":"AC Vildé-Guingalan"},{"$error":"#REF!"},{"$f":"IF(L67=$F67,#REF!,\"\")","v":{"$error":"#REF!"}},"AC Vildé-Guingalan",{"$error":"#REF!"},{"$f":"IF(O67=$F67,#REF!,1000)","v":{"$error":"#REF!"}},{"$f":"IF(COUNTIF($F$4:$F67,I67)<4,$F67,\" \")","v":" "},"",{"$f":"IF(R67=$F67,#REF!,\"\")","v":""},""," ","",{"$f":"IF(V67=$F67,#REF!,\"\")","v":""},{"$f":"IF(COUNTIF($C$4:$C$204,C67)>1,\"X\",\" \")","v":" "},{"$f":"IF(COUNTIF($B$4:$B$204,B67)>1,\"T\",B67)","v":"T"},22,0,1000,1000,1000,1000,1000,1000," "," "]
[{"$error":"#REF!"},6,71,{"$f":"IF(C68>0,CONCATENATE((VLOOKUP($C68,Inscription!$A$12:$G$211,3,FALSE)),\"   \",(VLOOKUP($C68,Inscription!$A$12:$G$211,4,FALSE))),\" \")","v":"Colleu   Pascal"},null,{"$f":"IF(C68>0,(VLOOKUP($C68,Inscription!$A$12:$G$211,5,FALSE)),\" \")","v":"CCV Beaussais"},{"$f":"IF(C68>0,(VLOOKUP($C68,Inscription!$A$12:$G$211,7,FALSE)),\" \")","v":3},{"$f":"LEFT(IF(C68>0,(VLOOKUP($C68,Inscription!$A$12:$G$211,6,FALSE)),\" \"),8)","v":"137558"},{"$f":"IF(COUNTIF($F$4:$F68,$F68)<2,$F68,\" \")","v":"CCV Beaussais"},{"$error":"#REF!"},{"$f":"IF(I68=F68,#REF!,\"\")","v":{"$error":"#REF!"}},{"$f":"IF(COUNTIF($F$4:$F68,$F68)<3,$F68,\" \")","v":"CCV Beaussais"},{"$error":"#REF!"},{"$f":"IF(L68=$F68,#REF!,\"\")","v":{"$error":"#REF!"}},"",1000,{"$f":"IF(O68=$F68,#REF!,1000)","v":1000},{"$f":"IF(COUNTIF($F$4:$F68,I68)<4,$F68,\" \")","v":"CCV Beaussais"},{"$error":"#REF!"},{"$f":"IF(R68=$F68,#REF!,\"\")","v":{"$error":"#REF!"}},"","","",{"$f":"IF(V68=$F68,#REF!,\"\")","v":""}," ","T",23,0,1000,1000,1000,1000,1000,1000," "," "]
[{"$error":"#REF!"},7,74,{"$f":"IF(C69>0,CONCATENATE((VLOOKUP($C69,Inscription!$A$12:$G$211,3,FALSE)),\"   \",(VLOOKUP($C69,Inscription!$A$12:$G$211,4,FALSE))),\" \")","v":"Jeuneu   Gilles"},null,{"$f":"IF(C69>0,(VLOOKUP($C69,Inscription!$A$12:$G$211,5,FALSE)),\" \")","v":"Accro Cycles"},{"$f":"IF(C69>0,(VLOOKUP($C69,Inscription!$A$12:$G$211,7,FALSE)),\" \")","v":3},{"$f":"LEFT(IF(C69>0,(VLOOKUP($C69,Inscription!$A$12:$G$211,6,FALSE)),\" \"),8)","v":"137390"},{"$f":"IF(COUNTIF($F$4:$F69,$F69)<2,$F69,\" \")","v":" "},"",{"$f":"IF(I69=F69,#REF!,\"\")","v":""},{"$f":"IF(COUNTIF($F$4:$F69,$F69)<3,$F69,\" \")","v":" "},"",{"$f":"IF(L69=$F69,#REF!,\"\")","v":""},"",1000,{"$f":"IF(O69=$F69,#REF!,1000)","v":1000},{"$f":"IF(COUNTIF($F$4:$F69,I69)<4,$F69,\" \")","v":" "},"",{"$f":"IF(R69=$F69,#REF!,\"\")","v":""},"","","",{"$f":"IF(V69=$F69,#REF!,\"\")","v":""}," ","T",24,0,1000,1000,1000,1000,1000,1000," "," "]
[{"$error":"#REF!"},8,65,{"$f":"IF(C70>0,CONCATENATE((VLOOKUP($C70,Inscription!$A$12:$G$211,3,FALSE)),\"   \",(VLOOKUP($C70,Inscription!$A$12:$G$211,4,FALSE))),\" \")","v":"Colombier   Michel"},null,{"$f":"IF(C70>0,(VLOOKUP($C70,Inscription!$A$12:$G$211,5,FALSE)),\" \")","v":"CC Robert le Roux"},{"$f":"IF(C70>0,(VLOOKUP($C70,Inscription!$A$12:$G$211,7,FALSE)),\" \")","v":3},{"$f":"LEFT(IF(C70>0,(VLOOKUP($C70,Inscription!$A$12:$G$211,6,FALSE)),\" \"),8)","v":"286379"},{"$f":"IF(COUNTIF($F$4:$F70,$F70)<2,$F70,\" \")","v":"CC Robert le Roux"},{"$error":"#REF!"},{"$f":"IF(I70=F70,#REF!,\"\")","v":{"$error":"#REF!"}},{"$f":"IF(COUNTIF($F$4:$F70,$F70)<3,$F70,\" \")","v":"CC Robert le Roux"},{"$f":"IF(L70=$F70,$A70,\"\")","v":{"$error":"#REF!"}},{"$f":"IF(L70=$F70,#REF!,\"\")","v":{"$error":"#REF!"}},{"$f":"IF(L70=I70,\"\",L70)","v":""},{"$f":"IF(O70=$F70,$A70,1000)","v":1000},{"$f":"IF(O70=$F70,#REF!,1000)","v":1000},{"$f":"IF(COUNTIF($F$4:$F70,I70)<4,$F70,\" \")","v":"CC Robert le Roux"},{"$f":"IF(R70=$F70,$A70,\"\")","v":{"$error":"#REF!"}},{"$f":"IF(R70=$F70,#REF!,\"\")","v":{"$error":"#REF!"}},{"$f":"IF(R70=I70,\"\",R70)","v":""},{"$f":"IF(U70=O70,\"\",R70)","v":""},{"$f":"IF(V70=$F70,$A70,\"\")","v":""},{"$f":"IF(V70=$F70,#REF!,\"\")","v":""}," ","T",25,0,1000,1000,1000,1000,1000,1000," "," "]
[{"$error":"#REF!"},9,76,{"$f":"IF(C71>0,CONCATENATE((VLOOKUP($C71,Inscription!$A$12:$G$211,3,FALSE)),\"   \",(VLOOKUP($C71,Inscription!$A$12:$G$211,4,FALSE))),\" \")","v":"Colas   Roger"},null,{"$f":"IF(C71>0,(VLOOKUP($C71,Inscription!$A$12:$G$211,5,FALSE)),\" \")","v":"EC Créhen"},{"$f":"IF(C71>0,(VLOOKUP($C71,Inscription!$A$12:$G$211,7,FALSE)),\" \")","v":3},{"$f":"LEFT(IF(C71>0,(VLOOKUP($C71,Inscription!$A$12:$G$211,6,FALSE)),\" \"),8)","v":"137514"},{"$f":"IF(COUNTIF($F$4:$F71,$F71)<2,$F71,\" \")","v":"EC Créhen"},{"$error":"#REF!"},{"$f":"IF(I71=F71,#REF!,\"\")","v":{"$error":"#REF!"}},{"$f":"IF(COUNTIF($F$4:$F71,$F71)<3,$F71,\" \")","v":"EC Créhen"},{"$error":"#REF!"},{"$f":"IF(L71=$F71,#REF!,\"\")","v":{"$error":"#REF!"}},"",1000,{"$f":"IF(O71=$F71,#REF!,1000)","v":1000},{"$f":"IF(COUNTIF($F$4:$F71,I71)<4,$F71,\" \")","v":"EC Créhen"},{"$error":"#REF!"},{"$f":"IF(R71=$F71,#REF!,\"\")","v":{"$error":"#REF!"}},"","","",{"$f":"IF(V71=$F71,#REF!,\"\")","v":""}," ","T",26,0,1000,1000,1000,1000,1000,1000," "," "]
[{"$error":"#REF!"},10,75,{"$f":"IF(C72>0,CONCATENATE((VLOOKUP($C72,Inscription!$A$12:$G$211,3,FALSE)),\"   \",(VLOOKUP($C72,Inscription!$A$12:$G$211,4,FALSE))),\" \")","v":"Pezres   Didier"},null,{"$f":"IF(C72>0,(VLOOKUP($C72,Inscription!$A$12:$G$211,5,FALSE)),\" \")","v":"EC Créhen"},{"$f":"IF(C72>0,(VLOOKUP($C72,Inscription!$A$12:$G$211,7,FALSE)),\" \")","v":3},{"$f":"LEFT(IF(C72>0,(VLOOKUP($C72,Inscription!$A$12:$G$211,6,FALSE)),\" \"),8)","v":"137518"},{"$f":"IF(COUNTIF($F$4:$F72,$F72)<2,$F72,\" \")","v":" "},"",{"$f":"IF(I72=F72,#REF!,\"\")","v":""},{"$f":"IF(COUNTIF($F$4:$F72,$F72)<3,$F72,\" \")","v":"EC Créhen"},{"$error":"#REF!"},{"$f":"IF(L72=$F72,#REF!,\"\")","v":{"$error":"#REF!"}},"EC Créhen",{"$error":"#REF!"},{"$f":"IF(O72=$F72,#REF!,1000)","v":{"$error":"#REF!"}},{"$f":"IF(COUNTIF($F$4:$F72,I72)<4,$F72,\" \")","v":" "},"",{"$f":"IF(R72=$F72,#REF!,\"\")","v":""},""," ","",{"$f":"IF(V72=$F72,#REF!,\"\")","v":""}," ","T",27,0,1000,1000,1000,1000,1000,1000," "," "]
[{"$error":"#REF!"},11,73,{"$f":"IF(C73>0,CONCATENATE((VLOOKUP($C73,Inscription!$A$12:$G$211,3,FALSE)),\"   \",(VLOOKUP($C73,Inscription!$A$12:$G$211,4,FALSE))),\" \")","v":"Durand   Francky"},null,{"$f":"IF(C73>0,(VLOOKUP($C73,Inscription!$A$12:$G$211,5,FALSE)),\" \")","v":"CC Moncontour"},{"$f":"IF(C73>0,(VLOOKUP($C73,Inscription!$A$12:$G$211,7,FALSE)),\" \")","v":3},{"$f":"LEFT(IF(C73>0,(VLOOKUP($C73,Inscription!$A$12:$G$211,6,FALSE)),\" \"),8)","v":"480456"},{"$f":"IF(COUNTIF($F$4:$F73,$F73)<2,$F73,\" \")","v":" "},"",{"$f":"IF(I73=F73,#REF!,\"\")","v":""},{"$f":"IF(COUNTIF($F$4:$F73,$F73)<3,$F73,\" \")","v":"CC Moncontour"},{"$error":"#REF!"},{"$f":"IF(L73=$F73,#REF!,\"\")","v":{"$error":"#REF!"}},"CC Moncontour",{"$error":"#REF!"},{"$f":"IF(O73=$F73,#REF!,1000)","v":{"$error":"#REF!"}},{"$f":"IF(COUNTIF($F$4:$F73,I73)<4,$F73,\" \")","v":" "},"",{"$f":"IF(R73=$F73,#REF!,\"\")","v":""},""," ","",{"$f":"IF(V73=$F73,#REF!,\"\")","v":""}," ","T",28,0,1000,1000,1000,1000,1000,1000," "," "]
[{"$error":"#REF!"},12,72,{"$f":"IF(C74>0,CONCATENATE((VLOOKUP($C74,Inscription!$A$12:$G$211,3,FALSE)),\"   \",(VLOOKUP($C74,Inscription!$A$12:$G$211,4,FALSE))),\" \")","v":"Goupil   Michel"},null,{"$f":"IF(C74>0,(VLOOKUP($C74,Inscription!$A$12:$G$211,5,FALSE)),\" \")","v":"Team Mégrit"},{"$f":"IF(C74>0,(VLOOKUP($C74,Inscription!$A$12:$G$211,7,FALSE)),\" \")","v":3},{"$f":"LEFT(IF(C74>0,(VLOOKUP($C74,Inscription!$A$12:$G$211,6,FALSE)),\" \"),8)","v":""},{"$f":"IF(COUNTIF($F$4:$F74,$F74)<2,$F74,\" \")","v":" "},"",{"$f":"IF(I74=F74,#REF!,\"\")","v":""},{"$f":"IF(COUNTIF($F$4:$F74,$F74)<3,$F74,\" \")","v":"Team Mégrit"},{"$error":"#REF!"},{"$f":"IF(L74=$F74,#REF!,\"\")","v":{"$error":"#REF!"}},"Team Mégrit",{"$error":"#REF!"},{"$f":"IF(O74=$F74,#REF!,1000)","v":{"$error":"#REF!"}},{"$f":"IF(COUNTIF($F$4:$F74,I74)<4,$F74,\" \")","v":" "},"",{"$f":"IF(R74=$F74,#REF!,\"\")","v":""},""," ","",{"$f":"IF(V74=$F74,#REF!,\"\")","v":""}," ","T",29,0,1000,1000,1000,1000,1000,1000," "," "]
[13,13,67,{"$f":"IF(C75>0,CONCATENATE((VLOOKUP($C75,Inscription!$A$12:$G$211,3,FALSE)),\"   \",(VLOOKUP($C75,Inscription!$A$12:$G$211,4,FALSE))),\" \")","v":"Croisier   Ronan"},null,{"$f":"IF(C75>0,(VLOOKUP($C75,Inscription!$A$12:$G$211,5,FALSE)),\" \")","v":"Team Pays de Dinan"},{"$f":"IF(C75>0,(VLOOKUP($C75,Inscription!$A$12:$G$211,7,FALSE)),\" \")","v":3},{"$f":"LEFT(IF(C75>0,(VLOOKUP($C75,Inscription!$A$12:$G$211,6,FALSE)),\" \"),8)","v":"136268"},{"$f":"IF(COUNTIF($F$4:$F75,$F75)<2,$F75,\" \")","v":" "},"",{"$f":"IF(I75=F75,#REF!,\"\")","v":""},{"$f":"IF(COUNTIF($F$4:$F75,$F75)<3,$F75,\" \")","v":" "},"",{"$f":"IF(L75=$F75,#REF!,\"\")","v":""},"",1000,{"$f":"IF(O75=$F75,#REF!,1000)","v":1000},{"$f":"IF(COUNTIF($F$4:$F75,I75)<4,$F75,\" \")","v":" "},"",{"$f":"IF(R75=$F75,#REF!,\"\")","v":""},"","","",{"$f":"IF(V75=$F75,#REF!,\"\")","v":""}," ",13,30,0,1000,1000,1000,1000,1000,1000," "," "]
[14,14,63,{"$f":"IF(C76>0,CONCATENATE((VLOOKUP($C76,Inscription!$A$12:$G$211,3,FALSE)),\"   \",(VLOOKUP($C76,Inscription!$A$12:$G$211,4,FALSE))),\" \")","v":"Georget   Charles"},null,{"$f":"IF(C76>0,(VLOOKUP($C76,Inscription!$A$12:$G$211,5,FALSE)),\" \")","v":"Lamball'breizh"},{"$f":"IF(C76>0,(VLOOKUP($C76,Inscription!$A$12:$G$211,7,FALSE)),\" \")","v":3},{"$f":"LEFT(IF(C76>0,(VLOOKUP($C76,Inscription!$A$12:$G$211,6,FALSE)),\" \"),8)","v":"136132"},{"$f":"IF(COUNTIF($F$4:$F76,$F76)<2,$F76,\" \")","v":" "},"",{"$f":"IF(I76=F76,#REF!,\"\")","v":""},{"$f":"IF(COUNTIF($F$4:$F76,$F76)<3,$F76,\" \")","v":" "},"",{"$f":"IF(L76=$F76,#REF!,\"\")","v":""},"",1000,{"$f":"IF(O76=$F76,#REF!,1000)","v":1000},{"$f":"IF(COUNTIF($F$4:$F76,I76)<4,$F76,\" \")","v":" "},"",{"$f":"IF(R76=$F76,#REF!,\"\")","v":""},"","","",{"$f":"IF(V76=$F76,#REF!,\"\")","v":""}," ",14,31,0,1000,1000,1000,1000,1000,1000," "," "]
[15,15,64,{"$f":"IF(C77>0,CONCATENATE((VLOOKUP($C77,Inscription!$A$12:$G$211,3,FALSE)),\"   \",(VLOOKUP($C77,Inscription!$A$12:$G$211,4,FALSE))),\" \")","v":"Bedel   Michel"},null,{"$f":"IF(C77>0,(VLOOKUP($C77,Inscription!$A$12:$G$211,5,FALSE)),\" \")","v":"Lamball'breizh"},{"$f":"IF(C77>0,(VLOOKUP($C77,Inscription!$A$12:$G$211,7,FALSE)),\" \")","v":3},{"$f":"LEFT(IF(C77>0,(VLOOKUP($C77,Inscription!$A$12:$G$211,6,FALSE)),\" \"),8)","v":"267277"},{"$f":"IF(COUNTIF($F$4:$F77,$F77)<2,$F77,\" \")","v":" "},"",{"$f":"IF(I77=F77,#REF!,\"\")","v":""},{"$f":"IF(COUNTIF($F$4:$F77,$F77)<3,$F77,\" \")","v":" "},"",{"$f":"IF(L77=$F77,#REF!,\"\")","v":""},"",1000,{"$f":"IF(O77=$F77,#REF!,1000)","v":1000},{"$f":"IF(COUNTIF($F$4:$F77,I77)<4,$F77,\" \")","v":" "},"",{"$f":"IF(R77=$F77,#REF!,\"\")","v":""},"","","",{"$f":"IF(V77=$F77,#REF!,\"\")","v":""}," ",15,32,0,1000,1000,1000,1000,1000,1000," "," "]
[16,16,77,{"$f":"IF(C78>0,CONCATENATE((VLOOKUP($C78,Inscription!$A$12:$G$211,3,FALSE)),\"   \",(VLOOKUP($C78,Inscription!$A$12:$G$211,4,FALSE))),\" \")","v":"Gouya   Philippe"},null,{"$f":"IF(C78>0,(VLOOKUP($C78,Inscription!$A$12:$G$211,5,FALSE)),\" \")","v":"EC Créhen"},{"$f":"IF(C78>0,(VLOOKUP($C78,Inscription!$A$12:$G$211,7,FALSE)),\" \")","v":3},{"$f":"LEFT(IF(C78>0,(VLOOKUP($C78,Inscription!$A$12:$G$211,6,FALSE)),\" \"),8)","v":"136134"},{"$f":"IF(COUNTIF($F$4:$F78,$F78)<2,$F78,\" \")","v":" "},"",{"$f":"IF(I78=F78,#REF!,\"\")","v":""},{"$f":"IF(COUNTIF($F$4:$F78,$F78)<3,$F78,\" \")","v":" "},"",{"$f":"IF(L78=$F78,#REF!,\"\")","v":""},"",1000,{"$f":"IF(O78=$F78,#REF!,1000)","v":1000},{"$f":"IF(COUNTIF($F$4:$F78,I78)<4,$F78,\" \")","v":" "},"",{"$f":"IF(R78=$F78,#REF!,\"\")","v":""},"","","",{"$f":"IF(V78=$F78,#REF!,\"\")","v":""}," ",16,33,0,1000,1000,1000,1000,1000,1000," "," "]
[17,17,70,{"$f":"IF(C79>0,CONCATENATE((VLOOKUP($C79,Inscription!$A$12:$G$211,3,FALSE)),\"   \",(VLOOKUP($C79,Inscription!$A$12:$G$211,4,FALSE))),\" \")","v":"Gaillard   Marcel"},null,{"$f":"IF(C79>0,(VLOOKUP($C79,Inscription!$A$12:$G$211,5,FALSE)),\" \")","v":"COS Kerentrech"},{"$f":"IF(C79>0,(VLOOKUP($C79,Inscription!$A$12:$G$211,7,FALSE)),\" \")","v":3},{"$f":"LEFT(IF(C79>0,(VLOOKUP($C79,Inscription!$A$12:$G$211,6,FALSE)),\" \"),8)","v":"153464"},{"$f":"IF(COUNTIF($F$4:$F79,$F79)<2,$F79,\" \")","v":"COS Kerentrech"},17,{"$f":"IF(I79=F79,#REF!,\"\")","v":{"$error":"#REF!"}},{"$f":"IF(COUNTIF($F$4:$F79,$F79)<3,$F79,\" \")","v":"COS Kerentrech"},17,{"$f":"IF(L79=$F79,#REF!,\"\")","v":{"$error":"#REF!"}},"",1000,{"$f":"IF(O79=$F79,#REF!,1000)","v":1000},{"$f":"IF(COUNTIF($F$4:$F79,I79)<4,$F79,\" \")","v":"COS Kerentrech"},17,{"$f":"IF(R79=$F79,#REF!,\"\")","v":{"$error":"#REF!"}},"","","",{"$f":"IF(V79=$F79,#REF!,\"\")","v":""}," ",17,34,0,1000,1000,1000,1000,1000,1000," "," "]
["disqualifié","disqualifié",68,{"$f":"IF(C80>0,CONCATENATE((VLOOKUP($C80,Inscription!$A$12:$G$211,3,FALSE)),\"   \",(VLOOKUP($C80,Inscription!$A$12:$G$211,4,FALSE))),\" \")","v":"Durand   Jacques"},null,{"$f":"IF(C80>0,(VLOOKUP($C80,Inscription!$A$12:$G$211,5,FALSE)),\" \")","v":"Team Pays de Dinan"},{"$f":"IF(C80>0,(VLOOKUP($C80,Inscription!$A$12:$G$211,7,FALSE)),\" \")","v":3},{"$f":"LEFT(IF(C80>0,(VLOOKUP($C80,Inscription!$A$12:$G$211,6,FALSE)),\" \"),8)","v":"136617"},{"$f":"IF(COUNTIF($F$4:$F80,$F80)<2,$F80,\" \")","v":" "},"",{"$f":"IF(I80=F80,#REF!,\"\")","v":""},{"$f":"IF(COUNTIF($F$4:$F80,$F80)<3,$F80,\" \")","v":" "},"",{"$f":"IF(L80=$F80,#REF!,\"\")","v":""},"",1000,{"$f":"IF(O80=$F80,#REF!,1000)","v":1000},{"$f":"IF(COUNTIF($F$4:$F80,I80)<4,$F80,\" \")","v":" "},"",{"$f":"IF(R80=$F80,#REF!,\"\")","v":""},"","","",{"$f":"IF(V80=$F80,#REF!,\"\")","v":""}," ","disqualifié",35,0,1000,1000,1000,1000,1000,1000," "," "]
[{"$error":"#REF!"},"absent",78,{"$f":"IF(C81>0,CONCATENATE((VLOOKUP($C81,Inscription!$A$12:$G$211,3,FALSE)),\"   \",(VLOOKUP($C81,Inscription!$A$12:$G$211,4,FALSE))),\" \")","v":"Gilson   Frédéric"},null,{"$f":"IF(C81>0,(VLOOKUP($C81,Inscription!$A$12:$G$211,5,FALSE)),\" \")","v":"CC Moncontour"},{"$f":"IF(C81>0,(VLOOKUP($C81,Inscription!$A$12:$G$211,7,FALSE)),\" \")","v":3},{"$f":"LEFT(IF(C81>0,(VLOOKUP($C81,Inscription!$A$12:$G$211,6,FALSE)),\" \"),8)","v":"424247"},{"$f":"IF(COUNTIF($F$4:$F81,$F81)<2,$F81,\" \")","v":" "},"",{"$f":"IF(I81=F81,#REF!,\"\")","v":""},{"$f":"IF(COUNTIF($F$4:$F81,$F81)<3,$F81,\" \")","v":" "},"",{"$f":"IF(L81=$F81,#REF!,\"\")","v":""},"",1000,{"$f":"IF(O81=$F81,#REF!,1000)","v":1000},{"$f":"IF(COUNTIF($F$4:$F81,I81)<4,$F81,\" \")","v":" "},"",{"$f":"IF(R81=$F81,#REF!,\"\")","v":""},"","","",{"$f":"IF(V81=$F81,#REF!,\"\")","v":""}," ","T"]
[1000,null,null,{"$f":"IF(C82>0,CONCATENATE((VLOOKUP($C82,Inscription!$A$12:$G$211,3,FALSE)),\"   \",(VLOOKUP($C82,Inscription!$A$12:$G$211,4,FALSE))),\" \")","v":" "},null,{"$f":"IF(C82>0,(VLOOKUP($C82,Inscription!$A$12:$G$211,5,FALSE)),\" \")","v":" "},{"$f":"IF(C82>0,(VLOOKUP($C82,Inscription!$A$12:$G$211,7,FALSE)),\" \")","v":" "},{"$f":"LEFT(IF(C82>0,(VLOOKUP($C82,Inscription!$A$12:$G$211,6,FALSE)),\" \"),8)","v":" "},{"$f":"IF(COUNTIF($F$4:$F82,$F82)<2,$F82,\" \")","v":" "},1000,{"$f":"IF(I82=F82,#REF!,\"\")","v":{"$error":"#REF!"}},{"$f":"IF(COUNTIF($F$4:$F82,$F82)<3,$F82,\" \")","v":" "},1000,{"$f":"IF(L82=$F82,#REF!,\"\")","v":{"$error":"#REF!"}},"",1000,{"$f":"IF(O82=$F82,#REF!,1000)","v":1000},{"$f":"IF(COUNTIF($F$4:$F82,I82)<4,$F82,\" \")","v":" "},1000,{"$f":"IF(R82=$F82,#REF!,\"\")","v":{"$error":"#REF!"}},"","","",{"$f":"IF(V82=$F82,#REF!,\"\")","v":""}," ",0]
[1000,null,null,{"$f":"IF(C83>0,CONCATENATE((VLOOKUP($C83,Inscription!$A$12:$G$211,3,FALSE)),\"   \",(VLOOKUP($C83,Inscription!$A$12:$G$211,4,FALSE))),\" \")","v":" "},null,{"$f":"IF(C83>0,(VLOOKUP($C83,Inscription!$A$12:$G$211,5,FALSE)),\" \")","v":" "},{"$f":"IF(C83>0,(VLOOKUP($C83,Inscription!$A$12:$G$211,7,FALSE)),\" \")","v":" "},{"$f":"LEFT(IF(C83>0,(VLOOKUP($C83,Inscription!$A$12:$G$211,6,FALSE)),\" \"),8)","v":" "},{"$f":"IF(COUNTIF($F$4:$F83,$F83)<2,$F83,\" \")","v":" "},1000,{"$f":"IF(I83=F83,#REF!,\"\")","v":{"$error":"#REF!"}},{"$f":"IF(COUNTIF($F$4:$F83,$F83)<3,$F83,\" \")","v":" "},1000,{"$f":"IF(L83=$F83,#REF!,\"\")","v":{"$error":"#REF!"}},"",1000,{"$f":"IF(O83=$F83,#REF!,1000)","v":1000},{"$f":"IF(COUNTIF($F$4:$F83,I83)<4,$F83,\" \")","v":" "},1000,{"$f":"IF(R83=$F83,#REF!,\"\")","v":{"$error":"#REF!"}},"","","",{"$f":"IF(V83=$F83,#REF!,\"\")","v":""}," ",0]
[{"$error":"#REF!"},1,34,{"$f":"IF(C84>0,CONCATENATE((VLOOKUP($C84,Inscription!$A$12:$G$211,3,FALSE)),\"   \",(VLOOKUP($C84,Inscription!$A$12:$G$211,4,FALSE))),\" \")","v":"Perrennou   Claude"},null,{"$f":"IF(C84>0,(VLOOKUP($C84,Inscription!$A$12:$G$211,5,FALSE)),\" \")","v":"COS Kerentrech"},{"$f":"IF(C84>0,(VLOOKUP($C84,Inscription!$A$12:$G$211,7,FALSE)),\" \")","v":2},{"$f":"LEFT(IF(C84>0,(VLOOKUP($C84,Inscription!$A$12:$G$211,6,FALSE)),\" \"),8)","v":""},{"$f":"IF(COUNTIF($F$4:$F84,$F84)<2,$F84,\" \")","v":" "},{"$f":"IF(I84=F84,A84,\"\")","v":""},{"$f":"IF(I84=F84,#REF!,\"\")","v":""},{"$f":"IF(COUNTIF($F$4:$F84,$F84)<3,$F84,\" \")","v":"COS Kerentrech"},{"$error":"#REF!"},{"$f":"IF(L84=$F84,#REF!,\"\")","v":{"$error":"#REF!"}},"COS Kerentrech",{"$error":"#REF!"},{"$f":"IF(O84=$F84,#REF!,1000)","v":{"$error":"#REF!"}},{"$f":"IF(COUNTIF($F$4:$F84,I84)<4,$F84,\" \")","v":" "},"",{"$f":"IF(R84=$F84,#REF!,\"\")","v":""},""," ","",{"$f":"IF(V84=$F84,#REF!,\"\")","v":""}," ","T"]
[{"$error":"#REF!"},2,31,{"$f":"IF(C85>0,CONCATENATE((VLOOKUP($C85,Inscription!$A$12:$G$211,3,FALSE)),\"   \",(VLOOKUP($C85,Inscription!$A$12:$G$211,4,FALSE))),\" \")","v":"Prigent   Benoit"},null,{"$f":"IF(C85>0,(VLOOKUP($C85,Inscription!$A$12:$G$211,5,FALSE)),\" \")","v":"Lamball'breizh"},{"$f":"IF(C85>0,(VLOOKUP($C85,Inscription!$A$12:$G$211,7,FALSE)),\" \")","v":2},{"$f":"LEFT(IF(C85>0,(VLOOKUP($C85,Inscription!$A$12:$G$211,6,FALSE)),\" \"),8)","v":"468745"},{"$f":"IF(COUNTIF($F$4:$F85,$F85)<2,$F85,\" \")","v":" "},"",{"$f":"IF(I85=F85,#REF!,\"\")","v":""},{"$f":"IF(COUNTIF($F$4:$F85,$F85)<3,$F85,\" \")","v":" "},"",{"$f":"IF(L85=$F85,#REF!,\"\")","v":""},"",1000,{"$f":"IF(O85=$F85,#REF!,1000)","v":1000},{"$f":"IF(COUNTIF($F$4:$F85,I85)<4,$F85,\" \")","v":" "},"",{"$f":"IF(R85=$F85,#REF!,\"\")","v":""},"","","",{"$f":"IF(V85=$F85,#REF!,\"\")","v":""}," ","T"]
[{"$error":"#REF!"},3,41,{"$f":"IF(C86>0,CONCATENATE((VLOOKUP($C86,Inscription!$A$12:$G$211,3,FALSE)),\"   \",(VLOOKUP($C86,Inscription!$A$12:$G$211,4,FALSE))),\" \")","v":"letaconnoux   sylvain"},null,{"$f":"IF(C86>0,(VLOOKUP($C86,Inscription!$A$12:$G$211,5,FALSE)),\" \")","v":"accro cycles"},{"$f":"IF(C86>0,(VLOOKUP($C86,Inscription!$A$12:$G$211,7,FALSE)),\" \")","v":2},{"$f":"LEFT(IF(C86>0,(VLOOKUP($C86,Inscription!$A$12:$G$211,6,FALSE)),\" \"),8)","v":""},{"$f":"IF(COUNTIF($F$4:$F86,$F86)<2,$F86,\" \")","v":" "},"",{"$f":"IF(I86=F86,#REF!,\"\")","v":""},{"$f":"IF(COUNTIF($F$4:$F86,$F86)<3,$F86,\" \")","v":" "},"",{"$f":"IF(L86=$F86,#REF!,\"\")","v":""},"",1000,{"$f":"IF(O86=$F86,#REF!,1000)","v":1000},{"$f":"IF(COUNTIF($F$4:$F86,I86)<4,$F86,\" \")","v":" "},"",{"$f":"IF(R86=$F86,#REF!,\"\")","v":""},"","","",{"$f":"IF(V86=$F86,#REF!,\"\")","v":""}," ","T"]
[{"$error":"#REF!"},4,30,{"$f":"IF(C87>0,CONCATENATE((VLOOKUP($C87,Inscription!$A$12:$G$211,3,FALSE)),\"   \",(VLOOKUP($C87,Inscription!$A$12:$G$211,4,FALSE))),\" \")","v":"Huby   Laurent"},null,{"$f":"IF(C87>0,(VLOOKUP($C87,Inscription!$A$12:$G$211,5,FALSE)),\" \")","v":"CC d'Uzel"},{"$f":"IF(C87>0,(VLOOKUP($C87,Inscription!$A$12:$G$211,7,FALSE)),\" \")","v":2},{"$f":"LEFT(IF(C87>0,(VLOOKUP($C87,Inscription!$A$12:$G$211,6,FALSE)),\" \"),8)","v":"278430"},{"$f":"IF(COUNTIF($F$4:$F87,$F87)<2,$F87,\" \")","v":"CC d'Uzel"},{"$error":"#REF!"},{"$f":"IF(I87=F87,#REF!,\"\")","v":{"$error":"#REF!"}},{"$f":"IF(COUNTIF($F$4:$F87,$F87)<3,$F87,\" \")","v":"CC d'Uzel"},{"$error":"#REF!"},{"$f":"IF(L87=$F87,#REF!,\"\")","v":{"$error":"#REF!"}},"",1000,{"$f":"IF(O87=$F87,#REF!,1000)","v":1000},{"$f":"IF(COUNTIF($F$4:$F87,I87)<4,$F87,\" \")","v":"CC d'Uzel"},{"$error":"#REF!"},{"$f":"IF(R87=$F87,#REF!,\"\")","v":{"$error":"#REF!"}},"","","",{"$f":"IF(V87=$F87,#REF!,\"\")","v":""}," ","T"]
[{"$error":"#REF!"},5,33,{"$f":"IF(C88>0,CONCATENATE((VLOOKUP($C88,Inscription!$A$12:$G$211,3,FALSE)),\"   \",(VLOOKUP($C88,Inscription!$A$12:$G$211,4,FALSE))),\" \")","v":"Nicolas   Patrice"},null,{"$f":"IF(C88>0,(VLOOKUP($C88,Inscription!$A$12:$G$211,5,FALSE)),\" \")","v":"COS Kerentrech"},{"$f":"IF(C88>0,(VLOOKUP($C88,Inscription!$A$12:$G$211,7,FALSE)),\" \")","v":2},{"$f":"LEFT(IF(C88>0,(VLOOKUP($C88,Inscription!$A$12:$G$211,6,FALSE)),\" \"),8)","v":"247939"},{"$f":"IF(COUNTIF($F$4:$F88,$F88)<2,$F88,\" \")","v":" "},"",{"$f":"IF(I88=F88,#REF!,\"\")","v":""},{"$f":"IF(COUNTIF($F$4:$F88,$F88)<3,$F88,\" \")","v":" "},"",{"$f":"IF(L88=$F88,#REF!,\"\")","v":""},"",1000,{"$f":"IF(O88=$F88,#REF!,1000)","v":1000},{"$f":"IF(COUNTIF($F$4:$F88,I88)<4,$F88,\" \")","v":" "},"",{"$f":"IF(R88=$F88,#REF!,\"\")","v":""},"","","",{"$f":"IF(V88=$F88,#REF!,\"\")","v":""}," ","T"]
[{"$error":"#REF!"},6,32,{"$f":"IF(C89>0,CONCATENATE((VLOOKUP($C89,Inscription!$A$12:$G$211,3,FALSE)),\"   \",(VLOOKUP($C89,Inscription!$A$12:$G$211,4,FALSE))),\" \")","v":"Bedel   Baptiste"},null,{"$f":"IF(C89>0,(VLOOKUP($C89,Inscription!$A$12:$G$211,5,FALSE)),\" \")","v":"Lamball'breizh"},{"$f":"IF(C89>0,(VLOOKUP($C89,Inscription!$A$12:$G$211,7,FALSE)),\" \")","v":2},{"$f":"LEFT(IF(C89>0,(VLOOKUP($C89,Inscription!$A$12:$G$211,6,FALSE)),\" \"),8)","v":"136137"},{"$f":"IF(COUNTIF($F$4:$F89,$F89)<2,$F89,\" \")","v":" "},"",{"$f":"IF(I89=F89,#REF!,\"\")","v":""},{"$f":"IF(COUNTIF($F$4:$F89,$F89)<3,$F89,\" \")","v":" "},"",{"$f":"IF(L89=$F89,#REF!,\"\")","v":""},"",1000,{"$f":"IF(O89=$F89,#REF!,1000)","v":1000},{"$f":"IF(COUNTIF($F$4:$F89,I89)<4,$F89,\" \")","v":" "},"",{"$f":"IF(R89=$F89,#REF!,\"\")","v":""},"","","",{"$f":"IF(V89=$F89,#REF!,\"\")","v":""}," ","T"]
[{"$error":"#REF!"},7,37,{"$f":"IF(C90>0,CONCATENATE((VLOOKUP($C90,Inscription!$A$12:$G$211,3,FALSE)),\"   \",(VLOOKUP($C90,Inscription!$A$12:$G$211,4,FALSE))),\" \")","v":"Besnard   Jean-Jacques"},null,{"$f":"IF(C90>0,(VLOOKUP($C90,Inscription!$A$12:$G$211,5,FALSE)),\" \")","v":"CC Moncontour"},{"$f":"IF(C90>0,(VLOOKUP($C90,Inscription!$A$12:$G$211,7,FALSE)),\" \")","v":2},{"$f":"LEFT(IF(C90>0,(VLOOKUP($C90,Inscription!$A$12:$G$211,6,FALSE)),\" \"),8)","v":"425505"},{"$f":"IF(COUNTIF($F$4:$F90,$F90)<2,$F90,\" \")","v":" "},"",{"$f":"IF(I90=F90,#REF!,\"\")","v":""},{"$f":"IF(COUNTIF($F$4:$F90,$F90)<3,$F90,\" \")","v":" "},"",{"$f":"IF(L90=$F90,#REF!,\"\")","v":""},"",1000,{"$f":"IF(O90=$F90,#REF!,1000)","v":1000},{"$f":"IF(COUNTIF($F$4:$F90,I90)<4,$F90,\" \")","v":" "},"",{"$f":"IF(R90=$F90,#REF!,\"\")","v":""},"","","",{"$f":"IF(V90=$F90,#REF!,\"\")","v":""}," ","T"]
[{"$error":"#REF!"},8,35,{"$f":"IF(C91>0,CONCATENATE((VLOOKUP($C91,Inscription!$A$12:$G$211,3,FALSE)),\"   \",(VLOOKUP($C91,Inscription!$A$12:$G$211,4,FALSE))),\" \")","v":"Leroux   Jérôme"},null,{"$f":"IF(C91>0,(VLOOKUP($C91,Inscription!$A$12:$G$211,5,FALSE)),\" \")","v":"CCV Beaussais"},{"$f":"IF(C91>0,(VLOOKUP($C91,Inscription!$A$12:$G$211,7,FALSE)),\" \")","v":2},{"$f":"LEFT(IF(C91>0,(VLOOKUP($C91,Inscription!$A$12:$G$211,6,FALSE)),\" \"),8)","v":"349169"},{"$f":"IF(COUNTIF($F$4:$F91,$F91)<2,$F91,\" \")","v":" "},"",{"$f":"IF(I91=F91,#REF!,\"\")","v":""},{"$f":"IF(COUNTIF($F$4:$F91,$F91)<3,$F91,\" \")","v":"CCV Beaussais"},{"$error":"#REF!"},{"$f":"IF(L91=$F91,#REF!,\"\")","v":{"$error":"#REF!"}},"CCV Beaussais",{"$error":"#REF!"},{"$f":"IF(O91=$F91,#REF!,1000)","v":{"$error":"#REF!"}},{"$f":"IF(COUNTIF($F$4:$F91,I91)<4,$F91,\" \")","v":" "},"",{"$f":"IF(R91=$F91,#REF!,\"\")","v":""},""," ","",{"$f":"IF(V91=$F91,#REF!,\"\")","v":""}," ","T"]
[{"$error":"#REF!"},"abandon",36,{"$f":"IF(C92>0,CONCATENATE((VLOOKUP($C92,Inscription!$A$12:$G$211,3,FALSE)),\"   \",(VLOOKUP($C92,Inscription!$A$12:$G$211,4,FALSE))),\" \")","v":"Bittoré   Luca"},null,{"$f":"IF(C92>0,(VLOOKUP($C92,Inscription!$A$12:$G$211,5,FALSE)),\" \")","v":"CCV Beaussais"},{"$f":"IF(C92>0,(VLOOKUP($C92,Inscription!$A$12:$G$211,7,FALSE)),\" \")","v":2},{"$f":"LEFT(IF(C92>0,(VLOOKUP($C92,Inscription!$A$12:$G$211,6,FALSE)),\" \"),8)","v":"465568"},{"$f":"IF(COUNTIF($F$4:$F92,$F92)<2,$F92,\" \")","v":" "},"",{"$f":"IF(I92=F92,#REF!,\"\")","v":""},{"$f":"IF(COUNTIF($F$4:$F92,$F92)<3,$F92,\" \")","v":" "},"",{"$f":"IF(L92=$F92,#REF!,\"\")","v":""},"",1000,{"$f":"IF(O92=$F92,#REF!,1000)","v":1000},{"$f":"IF(COUNTIF($F$4:$F92,I92)<4,$F92,\" \")","v":" "},"",{"$f":"IF(R92=$F92,#REF!,\"\")","v":""},"","","",{"$f":"IF(V92=$F92,#REF!,\"\")","v":""}," ","T"]
[{"$error":"#REF!"},"absent",38,{"$f":"IF(C93>0,CONCATENATE((VLOOKUP($C93,Inscription!$A$12:$G$211,3,FALSE)),\"   \",(VLOOKUP($C93,Inscription!$A$12:$G$211,4,FALSE))),\" \")","v":"Macé   Jérome"},null,{"$f":"IF(C93>0,(VLOOKUP($C93,Inscription!$A$12:$G$211,5,FALSE)),\" \")","v":"VC Evron"},{"$f":"IF(C93>0,(VLOOKUP($C93,Inscription!$A$12:$G$211,7,FALSE)),\" \")","v":2},{"$f":"LEFT(IF(C93>0,(VLOOKUP($C93,Inscription!$A$12:$G$211,6,FALSE)),\" \"),8)","v":"434904"},{"$f":"IF(COUNTIF($F$4:$F93,$F93)<2,$F93,\" \")","v":" "},"",{"$f":"IF(I93=F93,#REF!,\"\")","v":""},{"$f":"IF(COUNTIF($F$4:$F93,$F93)<3,$F93,\" \")","v":" "},"",{"$f":"IF(L93=$F93,#REF!,\"\")","v":""},"",1000,{"$f":"IF(O93=$F93,#REF!,1000)","v":1000},{"$f":"IF(COUNTIF($F$4:$F93,I93)<4,$F93,\" \")","v":" "},"",{"$f":"IF(R93=$F93,#REF!,\"\")","v":""},"","","",{"$f":"IF(V93=$F93,#REF!,\"\")","v":""}," ","T"]
[{"$error":"#REF!"},"absent",39,{"$f":"IF(C94>0,CONCATENATE((VLOOKUP($C94,Inscription!$A$12:$G$211,3,FALSE)),\"   \",(VLOOKUP($C94,Inscription!$A$12:$G$211,4,FALSE))),\" \")","v":"Henry   Damien"},null,{"$f":"IF(C94>0,(VLOOKUP($C94,Inscription!$A$12:$G$211,5,FALSE)),\" \")","v":"VC Dinan"},{"$f":"IF(C94>0,(VLOOKUP($C94,Inscription!$A$12:$G$211,7,FALSE)),\" \")","v":2},{"$f":"LEFT(IF(C94>0,(VLOOKUP($C94,Inscription!$A$12:$G$211,6,FALSE)),\" \"),8)","v":"474783"},{"$f":"IF(COUNTIF($F$4:$F94,$F94)<2,$F94,\" \")","v":"VC Dinan"},{"$error":"#REF!"},{"$f":"IF(I94=F94,#REF!,\"\")","v":{"$error":"#REF!"}},{"$f":"IF(COUNTIF($F$4:$F94,$F94)<3,$F94,\" \")","v":"VC Dinan"},{"$error":"#REF!"},{"$f":"IF(L94=$F94,#REF!,\"\")","v":{"$error":"#REF!"}},"",1000,{"$f":"IF(O94=$F94,#REF!,1000)","v":1000},{"$f":"IF(COUNTIF($F$4:$F94,I94)<4,$F94,\" \")","v":"VC Dinan"},{"$error":"#REF!"},{"$f":"IF(R94=$F94,#REF!,\"\")","v":{"$error":"#REF!"}},"","","",{"$f":"IF(V94=$F94,#REF!,\"\")","v":""}," ","T"]
[1000,null,null,{"$f":"IF(C95>0,CONCATENATE((VLOOKUP($C95,Inscription!$A$12:$G$211,3,FALSE)),\"   \",(VLOOKUP($C95,Inscription!$A$12:$G$211,4,FALSE))),\" \")","v":" "},null,{"$f":"IF(C95>0,(VLOOKUP($C95,Inscription!$A$12:$G$211,5,FALSE)),\" \")","v":" "},{"$f":"IF(C95>0,(VLOOKUP($C95,Inscription!$A$12:$G$211,7,FALSE)),\" \")","v":" "},{"$f":"LEFT(IF(C95>0,(VLOOKUP($C95,Inscription!$A$12:$G$211,6,FALSE)),\" \"),8)","v":" "},{"$f":"IF(COUNTIF($F$4:$F95,$F95)<2,$F95,\" \")","v":" "},1000,{"$f":"IF(I95=F95,#REF!,\"\")","v":{"$error":"#REF!"}},{"$f":"IF(COUNTIF($F$4:$F95,$F95)<3,$F95,\" \")","v":" "},1000,{"$f":"IF(L95=$F95,#REF!,\"\")","v":{"$error":"#REF!"}},"",1000,{"$f":"IF(O95=$F95,#REF!,1000)","v":1000},{"$f":"IF(COUNTIF($F$4:$F95,I95)<4,$F95,\" \")","v":" "},1000,{"$f":"IF(R95=$F95,#REF!,\"\")","v":{"$error":"#REF!"}},"","","",{"$f":"IF(V95=$F95,#REF!,\"\")","v":""}," ",0]
[1000,null,null,{"$f":"IF(C96>0,CONCATENATE((VLOOKUP($C96,Inscription!$A$12:$G$211,3,FALSE)),\"   \",(VLOOKUP($C96,Inscription!$A$12:$G$211,4,FALSE))),\" \")","v":" "},null,{"$f":"IF(C96>0,(VLOOKUP($C96,Inscription!$A$12:$G$211,5,FALSE)),\" \")","v":" "},{"$f":"IF(C96>0,(VLOOKUP($C96,Inscription!$A$12:$G$211,7,FALSE)),\" \")","v":" "},{"$f":"LEFT(IF(C96>0,(VLOOKUP($C96,Inscription!$A$12:$G$211,6,FALSE)),\" \"),8)","v":" "},{"$f":"IF(COUNTIF($F$4:$F96,$F96)<2,$F96,\" \")","v":" "},1000,{"$f":"IF(I96=F96,#REF!,\"\")","v":{"$error":"#REF!"}},{"$f":"IF(COUNTIF($F$4:$F96,$F96)<3,$F96,\" \")","v":" "},1000,{"$f":"IF(L96=$F96,#REF!,\"\")","v":{"$error":"#REF!"}},"",1000,{"$f":"IF(O96=$F96,#REF!,1000)","v":1000},{"$f":"IF(COUNTIF($F$4:$F96,I96)<4,$F96,\" \")","v":" "},1000,{"$f":"IF(R96=$F96,#REF!,\"\")","v":{"$error":"#REF!"}},"","","",{"$f":"IF(V96=$F96,#REF!,\"\")","v":""}," ",0]
[1000,null,null,{"$f":"IF(C97>0,CONCATENATE((VLOOKUP($C97,Inscription!$A$12:$G$211,3,FALSE)),\"   \",(VLOOKUP($C97,Inscription!$A$12:$G$211,4,FALSE))),\" \")","v":" "},null,{"$f":"IF(C97>0,(VLOOKUP($C97,Inscription!$A$12:$G$211,5,FALSE)),\" \")","v":" "},{"$f":"IF(C97>0,(VLOOKUP($C97,Inscription!$A$12:$G$211,7,FALSE)),\" \")","v":" "},{"$f":"LEFT(IF(C97>0,(VLOOKUP($C97,Inscription!$A$12:$G$211,6,FALSE)),\" \"),8)","v":" "},{"$f":"IF(COUNTIF($F$4:$F97,$F97)<2,$F97,\" \")","v":" "},1000,{"$f":"IF(I97=F97,#REF!,\"\")","v":{"$error":"#REF!"}},{"$f":"IF(COUNTIF($F$4:$F97,$F97)<3,$F97,\" \")","v":" "},1000,{"$f":"IF(L97=$F97,#REF!,\"\")","v":{"$error":"#REF!"}},"",1000,{"$f":"IF(O97=$F97,#REF!,1000)","v":1000},{"$f":"IF(COUNTIF($F$4:$F97,I97)<4,$F97,\" \")","v":" "},1000,{"$f":"IF(R97=$F97,#REF!,\"\")","v":{"$error":"#REF!"}},"","","",{"$f":"IF(V97=$F97,#REF!,\"\")","v":""}," ",0]
[1000,null,null,"1ère Catégorie",null,{"$f":"IF(C98>0,(VLOOKUP($C98,Inscription!$A$12:$G$211,5,FALSE)),\" \")","v":" "},{"$f":"IF(C98>0,(VLOOKUP($C98,Inscription!$A$12:$G$211,7,FALSE)),\" \")","v":" "},{"$f":"LEFT(IF(C98>0,(VLOOKUP($C98,Inscription!$A$12:$G$211,6,FALSE)),\" \"),8)","v":" "},{"$f":"IF(COUNTIF($F$4:$F98,$F98)<2,$F98,\" \")","v":" "},1000,{"$f":"IF(I98=F98,#REF!,\"\")","v":{"$error":"#REF!"}},{"$f":"IF(COUNTIF($F$4:$F98,$F98)<3,$F98,\" \")","v":" "},1000,{"$f":"IF(L98=$F98,#REF!,\"\")","v":{"$error":"#REF!"}},"",1000,{"$f":"IF(O98=$F98,#REF!,1000)","v":1000},{"$f":"IF(COUNTIF($F$4:$F98,I98)<4,$F98,\" \")","v":" "},1000,{"$f":"IF(R98=$F98,#REF!,\"\")","v":{"$error":"#REF!"}},"","","",{"$f":"IF(V98=$F98,#REF!,\"\")","v":""}," ",0]
[{"$f":"IF(B99<1,1000,(IF(Z99=B99,B99,(20100-SUM($Z$4:$Z$204))/(COUNTIF($Z$4:$Z$204,\"T\")))))","v":{"$error":"#REF!"}},1,4,{"$f":"IF(C99>0,CONCATENATE((VLOOKUP($C99,Inscription!$A$12:$G$211,3,FALSE)),\"   \",(VLOOKUP($C99,Inscription!$A$12:$G$211,4,FALSE))),\" \")","v":"Allot   Sébastien"},null,{"$f":"IF(C99>0,(VLOOKUP($C99,Inscription!$A$12:$G$211,5,FALSE)),\" \")","v":"VS Ploumagoar"},{"$f":"IF(C99>0,(VLOOKUP($C99,Inscription!$A$12:$G$211,7,FALSE)),\" \")","v":1},{"$f":"LEFT(IF(C99>0,(VLOOKUP($C99,Inscription!$A$12:$G$211,6,FALSE)),\" \"),8)","v":""},{"$f":"IF(COUNTIF($F$4:$F99,$F99)<2,$F99,\" \")","v":" "},"",{"$f":"IF(I99=F99,#REF!,\"\")","v":""},{"$f":"IF(COUNTIF($F$4:$F99,$F99)<3,$F99,\" \")","v":"VS Ploumagoar"},{"$error":"#REF!"},{"$f":"IF(L99=$F99,#REF!,\"\")","v":{"$error":"#REF!"}},"VS Ploumagoar",{"$error":"#REF!"},{"$f":"IF(O99=$F99,#REF!,1000)","v":{"$error":"#REF!"}},{"$f":"IF(COUNTIF($F$4:$F99,I99)<4,$F99,\" \")","v":" "},"",{"$f":"IF(R99=$F99,#REF!,\"\")","v":""},""," ","",{"$f":"IF(V99=$F99,#REF!,\"\")","v":""},{"$f":"IF(COUNTIF($C$4:$C$204,C99)>1,\"X\",\" \")","v":" "},{"$f":"IF(COUNTIF($B$4:$B$204,B99)>1,\"T\",B99)","v":"T"}]
[{"$error":"#REF!"},2,8,{"$f":"IF(C100>0,CONCATENATE((VLOOKUP($C100,Inscription!$A$12:$G$211,3,FALSE)),\"   \",(VLOOKUP($C100,Inscription!$A$12:$G$211,4,FALSE))),\" \")","v":"Le Ponner   Christophe"},null,{"$f":"IF(C100>0,(VLOOKUP($C100,Inscription!$A$12:$G$211,5,FALSE)),\" \")","v":"UC Plaudren"},{"$f":"IF(C100>0,(VLOOKUP($C100,Inscription!$A$12:$G$211,7,FALSE)),\" \")","v":1},{"$f":"LEFT(IF(C100>0,(VLOOKUP($C100,Inscription!$A$12:$G$211,6,FALSE)),\" \"),8)","v":""},{"$f":"IF(COUNTIF($F$4:$F100,$F100)<2,$F100,\" \")","v":" "},"",{"$f":"IF(I100=F100,#REF!,\"\")","v":""},{"$f":"IF(COUNTIF($F$4:$F100,$F100)<3,$F100,\" \")","v":" "},"",{"$f":"IF(L100=$F100,#REF!,\"\")","v":""},"",1000,{"$f":"IF(O100=$F100,#REF!,1000)","v":1000},{"$f":"IF(COUNTIF($F$4:$F100,I100)<4,$F100,\" \")","v":" "},"",{"$f":"IF(R100=$F100,#REF!,\"\")","v":""},"","","",{"$f":"IF(V100=$F100,#REF!,\"\")","v":""}," ","T"]
[{"$error":"#REF!"},3,2,{"$f":"IF(C101>0,CONCATENATE((VLOOKUP($C101,Inscription!$A$12:$G$211,3,FALSE)),\"   \",(VLOOKUP($C101,Inscription!$A$12:$G$211,4,FALSE))),\" \")","v":"Coualan   Jordan"},null,{"$f":"IF(C101>0,(VLOOKUP($C101,Inscription!$A$12:$G$211,5,FALSE)),\" \")","v":"CC Pleven"},{"$f":"IF(C101>0,(VLOOKUP($C101,Inscription!$A$12:$G$211,7,FALSE)),\" \")","v":1},{"$f":"LEFT(IF(C101>0,(VLOOKUP($C101,Inscription!$A$12:$G$211,6,FALSE)),\" \"),8)","v":"511484"},{"$f":"IF(COUNTIF($F$4:$F101,$F101)<2,$F101,\" \")","v":"CC Pleven"},{"$error":"#REF!"},{"$f":"IF(I101=F101,#REF!,\"\")","v":{"$error":"#REF!"}},{"$f":"IF(COUNTIF($F$4:$F101,$F101)<3,$F101,\" \")","v":"CC Pleven"},{"$error":"#REF!"},{"$f":"IF(L101=$F101,#REF!,\"\")","v":{"$error":"#REF!"}},"",1000,{"$f":"IF(O101=$F101,#REF!,1000)","v":1000},{"$f":"IF(COUNTIF($F$4:$F101,I101)<4,$F101,\" \")","v":"CC Pleven"},{"$error":"#REF!"},{"$f":"IF(R101=$F101,#REF!,\"\")","v":{"$error":"#REF!"}},"","","",{"$f":"IF(V101=$F101,#REF!,\"\")","v":""}," ","T"]
[{"$error":"#REF!"},4,6,{"$f":"IF(C102>0,CONCATENATE((VLOOKUP($C102,Inscription!$A$12:$G$211,3,FALSE)),\"   \",(VLOOKUP($C102,Inscription!$A$12:$G$211,4,FALSE))),\" \")","v":"Le Bellego   Maxime"},null,{"$f":"IF(C102>0,(VLOOKUP($C102,Inscription!$A$12:$G$211,5,FALSE)),\" \")","v":"VTT du Lié"},{"$f":"IF(C102>0,(VLOOKUP($C102,Inscription!$A$12:$G$211,7,FALSE)),\" \")","v":1},{"$f":"LEFT(IF(C102>0,(VLOOKUP($C102,Inscription!$A$12:$G$211,6,FALSE)),\" \"),8)","v":"480114"},{"$f":"IF(COUNTIF($F$4:$F102,$F102)<2,$F102,\" \")","v":" "},"",{"$f":"IF(I102=F102,#REF!,\"\")","v":""},{"$f":"IF(COUNTIF($F$4:$F102,$F102)<3,$F102,\" \")","v":" "},"",{"$f":"IF(L102=$F102,#REF!,\"\")","v":""},"",1000,{"$f":"IF(O102=$F102,#REF!,1000)","v":1000},{"$f":"IF(COUNTIF($F$4:$F102,I102)<4,$F102,\" \")","v":" "},"",{"$f":"IF(R102=$F102,#REF!,\"\")","v":""},"","","",{"$f":"IF(V102=$F102,#REF!,\"\")","v":""}," ","T"]
[{"$error":"#REF!"},5,3,{"$f":"IF(C103>0,CONCATENATE((VLOOKUP($C103,Inscription!$A$12:$G$211,3,FALSE)),\"   \",(VLOOKUP($C103,Inscription!$A$12:$G$211,4,FALSE))),\" \")","v":"Sieurin   Sébastien"},null,{"$f":"IF(C103>0,(VLOOKUP($C103,Inscription!$A$12:$G$211,5,FALSE)),\" \")","v":"VC Evron"},{"$f":"IF(C103>0,(VLOOKUP($C103,Inscription!$A$12:$G$211,7,FALSE)),\" \")","v":1},{"$f":"LEFT(IF(C103>0,(VLOOKUP($C103,Inscription!$A$12:$G$211,6,FALSE)),\" \"),8)","v":""},{"$f":"IF(COUNTIF($F$4:$F103,$F103)<2,$F103,\" \")","v":" "},"",{"$f":"IF(I103=F103,#REF!,\"\")","v":""},{"$f":"IF(COUNTIF($F$4:$F103,$F103)<3,$F103,\" \")","v":" "},"",{"$f":"IF(L103=$F103,#REF!,\"\")","v":""},"",1000,{"$f":"IF(O103=$F103,#REF!,1000)","v":1000},{"$f":"IF(COUNTIF($F$4:$F103,I103)<4,$F103,\" \")","v":" "},"",{"$f":"IF(R103=$F103,#REF!,\"\")","v":""},"","","",{"$f":"IF(V103=$F103,#REF!,\"\")","v":""}," ","T"]
[{"$error":"#REF!"},6,7,{"$f":"IF(C104>0,CONCATENATE((VLOOKUP($C104,Inscription!$A$12:$G$211,3,FALSE)),\"   \",(VLOOKUP($C104,Inscription!$A$12:$G$211,4,FALSE))),\" \")","v":"Flégeau   David"},null,{"$f":"IF(C104>0,(VLOOKUP($C104,Inscription!$A$12:$G$211,5,FALSE)),\" \")","v":"Team Bikers 22"},{"$f":"IF(C104>0,(VLOOKUP($C104,Inscription!$A$12:$G$211,7,FALSE)),\" \")","v":1},{"$f":"LEFT(IF(C104>0,(VLOOKUP($C104,Inscription!$A$12:$G$211,6,FALSE)),\" \"),8)","v":"137996"},{"$f":"IF(COUNTIF($F$4:$F104,$F104)<2,$F104,\" \")","v":" "},"",{"$f":"IF(I104=F104,#REF!,\"\")","v":""},{"$f":"IF(COUNTIF($F$4:$F104,$F104)<3,$F104,\" \")","v":" "},"",{"$f":"IF(L104=$F104,#REF!,\"\")","v":""},"",1000,{"$f":"IF(O104=$F104,#REF!,1000)","v":1000},{"$f":"IF(COUNTIF($F$4:$F104,I104)<4,$F104,\" \")","v":" "},"",{"$f":"IF(R104=$F104,#REF!,\"\")","v":""},"","","",{"$f":"IF(V104=$F104,#REF!,\"\")","v":""}," ","T"]
[{"$error":"#REF!"},7,5,{"$f":"IF(C105>0,CONCATENATE((VLOOKUP($C105,Inscription!$A$12:$G$211,3,FALSE)),\"   \",(VLOOKUP($C105,Inscription!$A$12:$G$211,4,FALSE))),\" \")","v":"Joannot   Jérémy"},null,{"$f":"IF(C105>0,(VLOOKUP($C105,Inscription!$A$12:$G$211,5,FALSE)),\" \")","v":"Team Broons"},{"$f":"IF(C105>0,(VLOOKUP($C105,Inscription!$A$12:$G$211,7,FALSE)),\" \")","v":1},{"$f":"LEFT(IF(C105>0,(VLOOKUP($C105,Inscription!$A$12:$G$211,6,FALSE)),\" \"),8)","v":"506026"},{"$f":"IF(COUNTIF($F$4:$F105,$F105)<2,$F105,\" \")","v":" "},"",{"$f":"IF(I105=F105,#REF!,\"\")","v":""},{"$f":"IF(COUNTIF($F$4:$F105,$F105)<3,$F105,\" \")","v":"Team Broons"},{"$error":"#REF!"},{"$f":"IF(L105=$F105,#REF!,\"\")","v":{"$error":"#REF!"}},"Team Broons",{"$error":"#REF!"},{"$f":"IF(O105=$F105,#REF!,1000)","v":{"$error":"#REF!"}},{"$f":"IF(COUNTIF($F$4:$F105,I105)<4,$F105,\" \")","v":" "},"",{"$f":"IF(R105=$F105,#REF!,\"\")","v":""},""," ","",{"$f":"IF(V105=$F105,#REF!,\"\")","v":""}," ","T"]
[{"$error":"#REF!"},"absent",1,{"$f":"IF(C106>0,CONCATENATE((VLOOKUP($C106,Inscription!$A$12:$G$211,3,FALSE)),\"   \",(VLOOKUP($C106,Inscription!$A$12:$G$211,4,FALSE))),\" \")","v":"Saulnier   Florentin"},null,{"$f":"IF(C106>0,(VLOOKUP($C106,Inscription!$A$12:$G$211,5,FALSE)),\" \")","v":"CCV Beaussais"},{"$f":"IF(C106>0,(VLOOKUP($C106,Inscription!$A$12:$G$211,7,FALSE)),\" \")","v":1},{"$f":"LEFT(IF(C106>0,(VLOOKUP($C106,Inscription!$A$12:$G$211,6,FALSE)),\" \"),8)","v":"137523"},{"$f":"IF(COUNTIF($F$4:$F106,$F106)<2,$F106,\" \")","v":" "},"",{"$f":"IF(I106=F106,#REF!,\"\")","v":""},{"$f":"IF(COUNTIF($F$4:$F106,$F106)<3,$F106,\" \")","v":" "},"",{"$f":"IF(L106=$F106,#REF!,\"\")","v":""},"",1000,{"$f":"IF(O106=$F106,#REF!,1000)","v":1000},{"$f":"IF(COUNTIF($F$4:$F106,I106)<4,$F106,\" \")","v":" "},"",{"$f":"IF(R106=$F106,#REF!,\"\")","v":""},"","","",{"$f":"IF(V106=$F106,#REF!,\"\")","v":""}," ","T"]
[1000,null,null,{"$f":"IF(C107>0,CONCATENATE((VLOOKUP($C107,Inscription!$A$12:$G$211,3,FALSE)),\"   \",(VLOOKUP($C107,Inscription!$A$12:$G$211,4,FALSE))),\" \")","v":" "},null,{"$f":"IF(C107>0,(VLOOKUP($C107,Inscription!$A$12:$G$211,5,FALSE)),\" \")","v":" "},{"$f":"IF(C107>0,(VLOOKUP($C107,Inscription!$A$12:$G$211,7,FALSE)),\" \")","v":" "},{"$f":"LEFT(IF(C107>0,(VLOOKUP($C107,Inscription!$A$12:$G$211,6,FALSE)),\" \"),8)","v":" "},{"$f":"IF(COUNTIF($F$4:$F107,$F107)<2,$F107,\" \")","v":" "},1000,{"$f":"IF(I107=F107,#REF!,\"\")","v":{"$error":"#REF!"}},{"$f":"IF(COUNTIF($F$4:$F107,$F107)<3,$F107,\" \")","v":" "},1000,{"$f":"IF(L107=$F107,#REF!,\"\")","v":{"$error":"#REF!"}},"",1000,{"$f":"IF(O107=$F107,#REF!,1000)","v":1000},{"$f":"IF(COUNTIF($F$4:$F107,I107)<4,$F107,\" \")","v":" "},1000,{"$f":"IF(R107=$F107,#REF!,\"\")","v":{"$error":"#REF!"}},"","","",{"$f":"IF(V107=$F107,#REF!,\"\")","v":""}," ",0]
[1000,null,null,"Junior",null,{"$f":"IF(C108>0,(VLOOKUP($C108,Inscription!$A$12:$G$211,5,FALSE)),\" \")","v":" "},{"$f":"IF(C108>0,(VLOOKUP($C108,Inscription!$A$12:$G$211,7,FALSE)),\" \")","v":" "},{"$f":"LEFT(IF(C108>0,(VLOOKUP($C108,Inscription!$A$12:$G$211,6,FALSE)),\" \"),8)","v":" "},{"$f":"IF(COUNTIF($F$4:$F108,$F108)<2,$F108,\" \")","v":" "},1000,{"$f":"IF(I108=F108,#REF!,\"\")","v":{"$error":"#REF!"}},{"$f":"IF(COUNTIF($F$4:$F108,$F108)<3,$F108,\" \")","v":" "},1000,{"$f":"IF(L108=$F108,#REF!,\"\")","v":{"$error":"#REF!"}},"",1000,{"$f":"IF(O108=$F108,#REF!,1000)","v":1000},{"$f":"IF(COUNTIF($F$4:$F108,I108)<4,$F108,\" \")","v":" "},1000,{"$f":"IF(R108=$F108,#REF!,\"\")","v":{"$error":"#REF!"}},"","","",{"$f":"IF(V108=$F108,#REF!,\"\")","v":""}," ",0]
[1000,null,20,{"$f":"IF(C109>0,CONCATENATE((VLOOKUP($C109,Inscription!$A$12:$G$211,3,FALSE)),\"   \",(VLOOKUP($C109,Inscription!$A$12:$G$211,4,FALSE))),\" \")","v":"Ruffet   Titouan"},null,{"$f":"IF(C109>0,(VLOOKUP($C109,Inscription!$A$12:$G$211,5,FALSE)),\" \")","v":"CC Moncontour"},{"$f":"IF(C109>0,(VLOOKUP($C109,Inscription!$A$12:$G$211,7,FALSE)),\" \")","v":"junior"},{"$f":"LEFT(IF(C109>0,(VLOOKUP($C109,Inscription!$A$12:$G$211,6,FALSE)),\" \"),8)","v":"457920"},{"$f":"IF(COUNTIF($F$4:$F109,$F109)<2,$F109,\" \")","v":" "},"",{"$f":"IF(I109=F109,#REF!,\"\")","v":""},{"$f":"IF(COUNTIF($F$4:$F109,$F109)<3,$F109,\" \")","v":" "},"",{"$f":"IF(L109=$F109,#REF!,\"\")","v":""},"",1000,{"$f":"IF(O109=$F109,#REF!,1000)","v":1000},{"$f":"IF(COUNTIF($F$4:$F109,I109)<4,$F109,\" \")","v":" "},"",{"$f":"IF(R109=$F109,#REF!,\"\")","v":""},"","","",{"$f":"IF(V109=$F109,#REF!,\"\")","v":""}," ",0]
[{"$error":"#REF!"},"absent",21,{"$f":"IF(C110>0,CONCATENATE((VLOOKUP($C110,Inscription!$A$12:$G$211,3,FALSE)),\"   \",(VLOOKUP($C110,Inscription!$A$12:$G$211,4,FALSE))),\" \")","v":"Le Masson   Hugo"},null,{"$f":"IF(C110>0,(VLOOKUP($C110,Inscription!$A$12:$G$211,5,FALSE)),\" \")","v":"VC Evron"},{"$f":"IF(C110>0,(VLOOKUP($C110,Inscription!$A$12:$G$211,7,FALSE)),\" \")","v":"Junior"},{"$f":"LEFT(IF(C110>0,(VLOOKUP($C110,Inscription!$A$12:$G$211,6,FALSE)),\" \"),8)","v":""},{"$f":"IF(COUNTIF($F$4:$F110,$F110)<2,$F110,\" \")","v":" "},"",{"$f":"IF(I110=F110,#REF!,\"\")","v":""},{"$f":"IF(COUNTIF($F$4:$F110,$F110)<3,$F110,\" \")","v":" "},"",{"$f":"IF(L110=$F110,#REF!,\"\")","v":""},"",1000,{"$f":"IF(O110=$F110,#REF!,1000)","v":1000},{"$f":"IF(COUNTIF($F$4:$F110,I110)<4,$F110,\" \")","v":" "},"",{"$f":"IF(R110=$F110,#REF!,\"\")","v":""},"","","",{"$f":"IF(V110=$F110,#REF!,\"\")","v":""}," ","T"]
[1000,null,null,{"$f":"IF(C111>0,CONCATENATE((VLOOKUP($C111,Inscription!$A$12:$G$211,3,FALSE)),\"   \",(VLOOKUP($C111,Inscription!$A$12:$G$211,4,FALSE))),\" \")","v":" "},null,{"$f":"IF(C111>0,(VLOOKUP($C111,Inscription!$A$12:$G$211,5,FALSE)),\" \")","v":" "},{"$f":"IF(C111>0,(VLOOKUP($C111,Inscription!$A$12:$G$211,7,FALSE)),\" \")","v":" "},{"$f":"LEFT(IF(C111>0,(VLOOKUP($C111,Inscription!$A$12:$G$211,6,FALSE)),\" \"),8)","v":" "},{"$f":"IF(COUNTIF($F$4:$F111,$F111)<2,$F111,\" \")","v":" "},1000,{"$f":"IF(I111=F111,#REF!,\"\")","v":{"$error":"#REF!"}},{"$f":"IF(COUNTIF($F$4:$F111,$F111)<3,$F111,\" \")","v":" "},1000,{"$f":"IF(L111=$F111,#REF!,\"\")","v":{"$error":"#REF!"}},"",1000,{"$f":"IF(O111=$F111,#REF!,1000)","v":1000},{"$f":"IF(COUNTIF($F$4:$F111,I111)<4,$F111,\" \")","v":" "},1000,{"$f":"IF(R111=$F111,#REF!,\"\")","v":{"$error":"#REF!"}},"","","",{"$f":"IF(V111=$F111,#REF!,\"\")","v":""}," ",0]
[1000,null,null,"Féminine",null,{"$f":"IF(C112>0,(VLOOKUP($C112,Inscription!$A$12:$G$211,5,FALSE)),\" \")","v":" "},{"$f":"IF(C112>0,(VLOOKUP($C112,Inscription!$A$12:$G$211,7,FALSE)),\" \")","v":" "},{"$f":"LEFT(IF(C112>0,(VLOOKUP($C112,Inscription!$A$12:$G$211,6,FALSE)),\" \"),8)","v":" "},{"$f":"IF(COUNTIF($F$4:$F112,$F112)<2,$F112,\" \")","v":" "},1000,{"$f":"IF(I112=F112,#REF!,\"\")","v":{"$error":"#REF!"}},{"$f":"IF(COUNTIF($F$4:$F112,$F112)<3,$F112,\" \")","v":" "},1000,{"$f":"IF(L112=$F112,#REF!,\"\")","v":{"$error":"#REF!"}},"",1000,{"$f":"IF(O112=$F112,#REF!,1000)","v":1000},{"$f":"IF(COUNTIF($F$4:$F112,I112)<4,$F112,\" \")","v":" "},1000,{"$f":"IF(R112=$F112,#REF!,\"\")","v":{"$error":"#REF!"}},"","","",{"$f":"IF(V112=$F112,#REF!,\"\")","v":""}," ",0]
[{"$error":"#REF!"},1,93,{"$f":"IF(C113>0,CONCATENATE((VLOOKUP($C113,Inscription!$A$12:$G$211,3,FALSE)),\"   \",(VLOOKUP($C113,Inscription!$A$12:$G$211,4,FALSE))),\" \")","v":"Amice   Florine"},null,{"$f":"IF(C113>0,(VLOOKUP($C113,Inscription!$A$12:$G$211,5,FALSE)),\" \")","v":"Souffle d'espoir"},{"$f":"IF(C113>0,(VLOOKUP($C113,Inscription!$A$12:$G$211,7,FALSE)),\" \")","v":"féminine"},{"$f":"LEFT(IF(C113>0,(VLOOKUP($C113,Inscription!$A$12:$G$211,6,FALSE)),\" \"),8)","v":"137425"},{"$f":"IF(COUNTIF($F$4:$F113,$F113)<2,$F113,\" \")","v":"Souffle d'espoir"},{"$error":"#REF!"},{"$f":"IF(I113=F113,#REF!,\"\")","v":{"$error":"#REF!"}},{"$f":"IF(COUNTIF($F$4:$F113,$F113)<3,$F113,\" \")","v":"Souffle d'espoir"},{"$error":"#REF!"},{"$f":"IF(L113=$F113,#REF!,\"\")","v":{"$error":"#REF!"}},"",1000,{"$f":"IF(O113=$F113,#REF!,1000)","v":1000},{"$f":"IF(COUNTIF($F$4:$F113,I113)<4,$F113,\" \")","v":"Souffle d'espoir"},{"$error":"#REF!"},{"$f":"IF(R113=$F113,#REF!,\"\")","v":{"$error":"#REF!"}},"","","",{"$f":"IF(V113=$F113,#REF!,\"\")","v":""}," ","T"]
[{"$error":"#REF!"},2,91,{"$f":"IF(C114>0,CONCATENATE((VLOOKUP($C114,Inscription!$A$12:$G$211,3,FALSE)),\"   \",(VLOOKUP($C114,Inscription!$A$12:$G$211,4,FALSE))),\" \")","v":"Rivolet   Agnes"},null,{"$f":"IF(C114>0,(VLOOKUP($C114,Inscription!$A$12:$G$211,5,FALSE)),\" \")","v":"VTT Côtes d'Armor Hillion"},{"$f":"IF(C114>0,(VLOOKUP($C114,Inscription!$A$12:$G$211,7,FALSE)),\" \")","v":"féminine"},{"$f":"LEFT(IF(C114>0,(VLOOKUP($C114,Inscription!$A$12:$G$211,6,FALSE)),\" \"),8)","v":"443442"},{"$f":"IF(COUNTIF($F$4:$F114,$F114)<2,$F114,\" \")","v":" "},"",{"$f":"IF(I114=F114,#REF!,\"\")","v":""},{"$f":"IF(COUNTIF($F$4:$F114,$F114)<3,$F114,\" \")","v":" "},"",{"$f":"IF(L114=$F114,#REF!,\"\")","v":""},"",1000,{"$f":"IF(O114=$F114,#REF!,1000)","v":1000},{"$f":"IF(COUNTIF($F$4:$F114,I114)<4,$F114,\" \")","v":" "},"",{"$f":"IF(R114=$F114,#REF!,\"\")","v":""},"","","",{"$f":"IF(V114=$F114,#REF!,\"\")","v":""}," ","T"]
[{"$error":"#REF!"},3,92,{"$f":"IF(C115>0,CONCATENATE((VLOOKUP($C115,Inscription!$A$12:$G$211,3,FALSE)),\"   \",(VLOOKUP($C115,Inscription!$A$12:$G$211,4,FALSE))),\" \")","v":"Leray   Gwladys"},null,{"$f":"IF(C115>0,(VLOOKUP($C115,Inscription!$A$12:$G$211,5,FALSE)),\" \")","v":"Team XC du Léguer"},{"$f":"IF(C115>0,(VLOOKUP($C115,Inscription!$A$12:$G$211,7,FALSE)),\" \")","v":"féminine"},{"$f":"LEFT(IF(C115>0,(VLOOKUP($C115,Inscription!$A$12:$G$211,6,FALSE)),\" \"),8)","v":"359228"},{"$f":"IF(COUNTIF($F$4:$F115,$F115)<2,$F115,\" \")","v":" "},"",{"$f":"IF(I115=F115,#REF!,\"\")","v":""},{"$f":"IF(COUNTIF($F$4:$F115,$F115)<3,$F115,\" \")","v":" "},"",{"$f":"IF(L115=$F115,#REF!,\"\")","v":""},"",1000,{"$f":"IF(O115=$F115,#REF!,1000)","v":1000},{"$f":"IF(COUNTIF($F$4:$F115,I115)<4,$F115,\" \")","v":" "},"",{"$f":"IF(R115=$F115,#REF!,\"\")","v":""},"","","",{"$f":"IF(V115=$F115,#REF!,\"\")","v":""}," ","T"]
[{"$error":"#REF!"},"abandon",90,{"$f":"IF(C116>0,CONCATENATE((VLOOKUP($C116,Inscription!$A$12:$G$211,3,FALSE)),\"   \",(VLOOKUP($C116,Inscription!$A$12:$G$211,4,FALSE))),\" \")","v":"Camus   Kristell"},null,{"$f":"IF(C116>0,(VLOOKUP($C116,Inscription!$A$12:$G$211,5,FALSE)),\" \")","v":"VC Evron"},{"$f":"IF(C116>0,(VLOOKUP($C116,Inscription!$A$12:$G$211,7,FALSE)),\" \")","v":"féminine"},{"$f":"LEFT(IF(C116>0,(VLOOKUP($C116,Inscription!$A$12:$G$211,6,FALSE)),\" \"),8)","v":""},{"$f":"IF(COUNTIF($F$4:$F116,$F116)<2,$F116,\" \")","v":" "},{"$f":"IF(I116=F116,A116,\"\")","v":""},{"$f":"IF(I116=F116,#REF!,\"\")","v":""},{"$f":"IF(COUNTIF($F$4:$F116,$F116)<3,$F116,\" \")","v":" "},"",{"$f":"IF(L116=$F116,#REF!,\"\")","v":""},"",1000,{"$f":"IF(O116=$F116,#REF!,1000)","v":1000},{"$f":"IF(COUNTIF($F$4:$F116,I116)<4,$F116,\" \")","v":" "},"",{"$f":"IF(R116=$F116,#REF!,\"\")","v":""},"","","",{"$f":"IF(V116=$F116,#REF!,\"\")","v":""}," ","T"]
[{"$f":"IF(#REF!<1,1000,(IF(Z117=#REF!,#REF!,(20100-SUM($Z$4:$Z$204))/(COUNTIF($Z$4:$Z$204,\"T\")))))","v":{"$error":"#REF!"}},null,null,{"$f":"IF(C117>0,CONCATENATE((VLOOKUP($C117,Inscription!$A$12:$G$211,3,FALSE)),\"   \",(VLOOKUP($C117,Inscription!$A$12:$G$211,4,FALSE))),\" \")","v":" "},null,{"$f":"IF(C117>0,(VLOOKUP($C117,Inscription!$A$12:$G$211,5,FALSE)),\" \")","v":" "},{"$f":"IF(C117>0,(VLOOKUP($C117,Inscription!$A$12:$G$211,7,FALSE)),\" \")","v":" "},{"$f":"LEFT(IF(C117>0,(VLOOKUP($C117,Inscription!$A$12:$G$211,6,FALSE)),\" \"),8)","v":" "},{"$f":"IF(COUNTIF($F$4:$F117,$F117)<2,$F117,\" \")","v":" "},{"$error":"#REF!"},{"$f":"IF(I117=F117,#REF!,\"\")","v":{"$error":"#REF!"}},{"$f":"IF(COUNTIF($F$4:$F117,$F117)<3,$F117,\" \")","v":" "},{"$error":"#REF!"},{"$f":"IF(L117=$F117,#REF!,\"\")","v":{"$error":"#REF!"}},"",1000,{"$f":"IF(O117=$F117,#REF!,1000)","v":1000},{"$f":"IF(COUNTIF($F$4:$F117,I117)<4,$F117,\" \")","v":" "},{"$error":"#REF!"},{"$f":"IF(R117=$F117,#REF!,\"\")","v":{"$error":"#REF!"}},"","","",{"$f":"IF(V117=$F117,#REF!,\"\")","v":""},{"$f":"IF(COUNTIF($C$4:$C$204,#REF!)>1,\"X\",\" \")","v":" "},{"$f":"IF(COUNTIF($B$4:$B$204,#REF!)>1,\"T\",#REF!)","v":{"$error":"#REF!"}}]
[{"$f":"IF(#REF!<1,1000,(IF(Z118=#REF!,#REF!,(20100-SUM($Z$4:$Z$204))/(COUNTIF($Z$4:$Z$204,\"T\")))))","v":{"$error":"#REF!"}},null,null,{"$f":"IF(C118>0,CONCATENATE((VLOOKUP($C118,Inscription!$A$12:$G$211,3,FALSE)),\"   \",(VLOOKUP($C118,Inscription!$A$12:$G$211,4,FALSE))),\" \")","v":" "},null,{"$f":"IF(C118>0,(VLOOKUP($C118,Inscription!$A$12:$G$211,5,FALSE)),\" \")","v":" "},{"$f":"IF(C118>0,(VLOOKUP($C118,Inscription!$A$12:$G$211,7,FALSE)),\" \")","v":" "},{"$f":"LEFT(IF(C118>0,(VLOOKUP($C118,Inscription!$A$12:$G$211,6,FALSE)),\" \"),8)","v":" "},{"$f":"IF(COUNTIF($F$4:$F118,$F118)<2,$F118,\" \")","v":" "},{"$error":"#REF!"},{"$f":"IF(I118=F118,#REF!,\"\")","v":{"$error":"#REF!"}},{"$f":"IF(COUNTIF($F$4:$F118,$F118)<3,$F118,\" \")","v":" "},{"$error":"#REF!"},{"$f":"IF(L118=$F118,#REF!,\"\")","v":{"$error":"#REF!"}},"",1000,{"$f":"IF(O118=$F118,#REF!,1000)","v":1000},{"$f":"IF(COUNTIF($F$4:$F118,I118)<4,$F118,\" \")","v":" "},{"$error":"#REF!"},{"$f":"IF(R118=$F118,#REF!,\"\")","v":{"$error":"#REF!"}},"","","",{"$f":"IF(V118=$F118,#REF!,\"\")","v":""},{"$f":"IF(COUNTIF($C$4:$C$204,#REF!)>1,\"X\",\" \")","v":" "},{"$f":"IF(COUNTIF($B$4:$B$204,#REF!)>1,\"T\",#REF!)","v":{"$error":"#REF!"}}]
[{"$f":"IF(#REF!<1,1000,(IF(Z119=#REF!,#REF!,(20100-SUM($Z$4:$Z$204))/(COUNTIF($Z$4:$Z$204,\"T\")))))","v":{"$error":"#REF!"}},null,null,{"$f":"IF(C119>0,CONCATENATE((VLOOKUP($C119,Inscription!$A$12:$G$211,3,FALSE)),\"   \",(VLOOKUP($C119,Inscription!$A$12:$G$211,4,FALSE))),\" \")","v":" "},null,{"$f":"IF(C119>0,(VLOOKUP($C119,Inscription!$A$12:$G$211,5,FALSE)),\" \")","v":" "},{"$f":"IF(C119>0,(VLOOKUP($C119,Inscription!$A$12:$G$211,7,FALSE)),\" \")","v":" "},{"$f":"LEFT(IF(C119>0,(VLOOKUP($C119,Inscription!$A$12:$G$211,6,FALSE)),\" \"),8)","v":" "},{"$f":"IF(COUNTIF($F$4:$F119,$F119)<2,$F119,\" \")","v":" "},{"$error":"#REF!"},{"$f":"IF(I119=F119,#REF!,\"\")","v":{"$error":"#REF!"}},{"$f":"IF(COUNTIF($F$4:$F119,$F119)<3,$F119,\" \")","v":" "},{"$error":"#REF!"},{"$f":"IF(L119=$F119,#REF!,\"\")","v":{"$error":"#REF!"}},"",1000,{"$f":"IF(O119=$F119,#REF!,1000)","v":1000},{"$f":"IF(COUNTIF($F$4:$F119,I119)<4,$F119,\" \")","v":" "},{"$error":"#REF!"},{"$f":"IF(R119=$F119,#REF!,\"\")","v":{"$error":"#REF!"}},"","","",{"$f":"IF(V119=$F119,#REF!,\"\")","v":""},{"$f":"IF(COUNTIF($C$4:$C$204,#REF!)>1,\"X\",\" \")","v":" "},{"$f":"IF(COUNTIF($B$4:$B$204,#REF!)>1,\"T\",#REF!)","v":{"$error":"#REF!"}}]
[{"$f":"IF(#REF!<1,1000,(IF(Z120=#REF!,#REF!,(20100-SUM($Z$4:$Z$204))/(COUNTIF($Z$4:$Z$204,\"T\")))))","v":{"$error":"#REF!"}},null,null,{"$f":"IF(C120>0,CONCATENATE((VLOOKUP($C120,Inscription!$A$12:$G$211,3,FALSE)),\"   \",(VLOOKUP($C120,Inscription!$A$12:$G$211,4,FALSE))),\" \")","v":" "},null,{"$f":"IF(C120>0,(VLOOKUP($C120,Inscription!$A$12:$G$211,5,FALSE)),\" \")","v":" "},{"$f":"IF(C120>0,(VLOOKUP($C120,Inscription!$A$12:$G$211,7,FALSE)),\" \")","v":" "},{"$f":"LEFT(IF(C120>0,(VLOOKUP($C120,Inscription!$A$12:$G$211,6,FALSE)),\" \"),8)","v":" "},{"$f":"IF(COUNTIF($F$4:$F120,$F120)<2,$F120,\" \")","v":" "},{"$error":"#REF!"},{"$f":"IF(I120=F120,#REF!,\"\")","v":{"$error":"#REF!"}},{"$f":"IF(COUNTIF($F$4:$F120,$F120)<3,$F120,\" \")","v":" "},{"$error":"#REF!"},{"$f":"IF(L120=$F120,#REF!,\"\")","v":{"$error":"#REF!"}},"",1000,{"$f":"IF(O120=$F120,#REF!,1000)","v":1000},{"$f":"IF(COUNTIF($F$4:$F120,I120)<4,$F120,\" \")","v":" "},{"$error":"#REF!"},{"$f":"IF(R120=$F120,#REF!,\"\")","v":{"$error":"#REF!"}},"","","",{"$f":"IF(V120=$F120,#REF!,\"\")","v":""},{"$f":"IF(COUNTIF($C$4:$C$204,#REF!)>1,\"X\",\" \")","v":" "},{"$f":"IF(COUNTIF($B$4:$B$204,#REF!)>1,\"T\",#REF!)","v":{"$error":"#REF!"}}]
[{"$f":"IF(B121<1,1000,(IF(Z121=B121,B121,(20100-SUM($Z$4:$Z$204))/(COUNTIF($Z$4:$Z$204,\"T\")))))","v":1000},null,null,{"$f":"IF(C121>0,CONCATENATE((VLOOKUP($C121,Inscription!$A$12:$G$211,3,FALSE)),\"   \",(VLOOKUP($C121,Inscription!$A$12:$G$211,4,FALSE))),\" \")","v":" "},null,{"$f":"IF(C121>0,(VLOOKUP($C121,Inscription!$A$12:$G$211,5,FALSE)),\" \")","v":" "},{"$f":"IF(C121>0,(VLOOKUP($C121,Inscription!$A$12:$G$211,7,FALSE)),\" \")","v":" "},{"$f":"LEFT(IF(C121>0,(VLOOKUP($C121,Inscription!$A$12:$G$211,6,FALSE)),\" \"),8)","v":" "},{"$f":"IF(COUNTIF($F$4:$F121,$F121)<2,$F121,\" \")","v":" "},1000,{"$f":"IF(I121=F121,#REF!,\"\")","v":{"$error":"#REF!"}},{"$f":"IF(COUNTIF($F$4:$F121,$F121)<3,$F121,\" \")","v":" "},1000,{"$f":"IF(L121=$F121,#REF!,\"\")","v":{"$error":"#REF!"}},"",1000,{"$f":"IF(O121=$F121,#REF!,1000)","v":1000},{"$f":"IF(COUNTIF($F$4:$F121,I121)<4,$F121,\" \")","v":" "},1000,{"$f":"IF(R121=$F121,#REF!,\"\")","v":{"$error":"#REF!"}},"","","",{"$f":"IF(V121=$F121,#REF!,\"\")","v":""},{"$f":"IF(COUNTIF($C$4:$C$204,C121)>1,\"X\",\" \")","v":" "},{"$f":"IF(COUNTIF($B$4:$B$204,B121)>1,\"T\",B121)","v":0}]
[1000,null,null,{"$f":"IF(C122>0,CONCATENATE((VLOOKUP($C122,Inscription!$A$12:$G$211,3,FALSE)),\"   \",(VLOOKUP($C122,Inscription!$A$12:$G$211,4,FALSE))),\" \")","v":" "},null,{"$f":"IF(C122>0,(VLOOKUP($C122,Inscription!$A$12:$G$211,5,FALSE)),\" \")","v":" "},{"$f":"IF(C122>0,(VLOOKUP($C122,Inscription!$A$12:$G$211,7,FALSE)),\" \")","v":" "},{"$f":"LEFT(IF(C122>0,(VLOOKUP($C122,Inscription!$A$12:$G$211,6,FALSE)),\" \"),8)","v":" "},{"$f":"IF(COUNTIF($F$4:$F122,$F122)<2,$F122,\" \")","v":" "},1000,{"$f":"IF(I122=F122,#REF!,\"\")","v":{"$error":"#REF!"}},{"$f":"IF(COUNTIF($F$4:$F122,$F122)<3,$F122,\" \")","v":" "},1000,{"$f":"IF(L122=$F122,#REF!,\"\")","v":{"$error":"#REF!"}},"",1000,{"$f":"IF(O122=$F122,#REF!,1000)","v":1000},{"$f":"IF(COUNTIF($F$4:$F122,I122)<4,$F122,\" \")","v":" "},1000,{"$f":"IF(R122=$F122,#REF!,\"\")","v":{"$error":"#REF!"}},"","","",{"$f":"IF(V122=$F122,#REF!,\"\")","v":""}," ",0]
[1000,null,null,{"$f":"IF(C123>0,CONCATENATE((VLOOKUP($C123,Inscription!$A$12:$G$211,3,FALSE)),\"   \",(VLOOKUP($C123,Inscription!$A$12:$G$211,4,FALSE))),\" \")","v":" "},null,{"$f":"IF(C123>0,(VLOOKUP($C123,Inscription!$A$12:$G$211,5,FALSE)),\" \")","v":" "},{"$f":"IF(C123>0,(VLOOKUP($C123,Inscription!$A$12:$G$211,7,FALSE)),\" \")","v":" "},{"$f":"LEFT(IF(C123>0,(VLOOKUP($C123,Inscription!$A$12:$G$211,6,FALSE)),\" \"),8)","v":" "},{"$f":"IF(COUNTIF($F$4:$F123,$F123)<2,$F123,\" \")","v":" "},1000,{"$f":"IF(I123=F123,#REF!,\"\")","v":{"$error":"#REF!"}},{"$f":"IF(COUNTIF($F$4:$F123,$F123)<3,$F123,\" \")","v":" "},1000,{"$f":"IF(L123=$F123,#REF!,\"\")","v":{"$error":"#REF!"}},"",1000,{"$f":"IF(O123=$F123,#REF!,1000)","v":1000},{"$f":"IF(COUNTIF($F$4:$F123,I123)<4,$F123,\" \")","v":" "},1000,{"$f":"IF(R123=$F123,#REF!,\"\")","v":{"$error":"#REF!"}},"","","",{"$f":"IF(V123=$F123,#REF!,\"\")","v":""}," ",0]
[1000,null,null,{"$f":"IF(C124>0,CONCATENATE((VLOOKUP($C124,Inscription!$A$12:$G$211,3,FALSE)),\"   \",(VLOOKUP($C124,Inscription!$A$12:$G$211,4,FALSE))),\" \")","v":" "},null,{"$f":"IF(C124>0,(VLOOKUP($C124,Inscription!$A$12:$G$211,5,FALSE)),\" \")","v":" "},{"$f":"IF(C124>0,(VLOOKUP($C124,Inscription!$A$12:$G$211,7,FALSE)),\" \")","v":" "},{"$f":"LEFT(IF(C124>0,(VLOOKUP($C124,Inscription!$A$12:$G$211,6,FALSE)),\" \"),8)","v":" "},{"$f":"IF(COUNTIF($F$4:$F124,$F124)<2,$F124,\" \")","v":" "},1000,{"$f":"IF(I124=F124,#REF!,\"\")","v":{"$error":"#REF!"}},{"$f":"IF(COUNTIF($F$4:$F124,$F124)<3,$F124,\" \")","v":" "},1000,{"$f":"IF(L124=$F124,#REF!,\"\")","v":{"$error":"#REF!"}},"",1000,{"$f":"IF(O124=$F124,#REF!,1000)","v":1000},{"$f":"IF(COUNTIF($F$4:$F124,I124)<4,$F124,\" \")","v":" "},1000,{"$f":"IF(R124=$F124,#REF!,\"\")","v":{"$error":"#REF!"}},"","","",{"$f":"IF(V124=$F124,#REF!,\"\")","v":""}," ",0]
[1000,null,null,{"$f":"IF(C125>0,CONCATENATE((VLOOKUP($C125,Inscription!$A$12:$G$211,3,FALSE)),\"   \",(VLOOKUP($C125,Inscription!$A$12:$G$211,4,FALSE))),\" \")","v":" "},null,{"$f":"IF(C125>0,(VLOOKUP($C125,Inscription!$A$12:$G$211,5,FALSE)),\" \")","v":" "},{"$f":"IF(C125>0,(VLOOKUP($C125,Inscription!$A$12:$G$211,7,FALSE)),\" \")","v":" "},{"$f":"LEFT(IF(C125>0,(VLOOKUP($C125,Inscription!$A$12:$G$211,6,FALSE)),\" \"),8)","v":" "},{"$f":"IF(COUNTIF($F$4:$F125,$F125)<2,$F125,\" \")","v":" "},1000,{"$f":"IF(I125=F125,#REF!,\"\")","v":{"$error":"#REF!"}},{"$f":"IF(COUNTIF($F$4:$F125,$F125)<3,$F125,\" \")","v":" "},1000,{"$f":"IF(L125=$F125,#REF!,\"\")","v":{"$error":"#REF!"}},"",1000,{"$f":"IF(O125=$F125,#REF!,1000)","v":1000},{"$f":"IF(COUNTIF($F$4:$F125,I125)<4,$F125,\" \")","v":" "},1000,{"$f":"IF(R125=$F125,#REF!,\"\")","v":{"$error":"#REF!"}},"","","",{"$f":"IF(V125=$F125,#REF!,\"\")","v":""}," ",0]
[1000,null,null,{"$f":"IF(C126>0,CONCATENATE((VLOOKUP($C126,Inscription!$A$12:$G$211,3,FALSE)),\"   \",(VLOOKUP($C126,Inscription!$A$12:$G$211,4,FALSE))),\" \")","v":" "},null,{"$f":"IF(C126>0,(VLOOKUP($C126,Inscription!$A$12:$G$211,5,FALSE)),\" \")","v":" "},{"$f":"IF(C126>0,(VLOOKUP($C126,Inscription!$A$12:$G$211,7,FALSE)),\" \")","v":" "},{"$f":"LEFT(IF(C126>0,(VLOOKUP($C126,Inscription!$A$12:$G$211,6,FALSE)),\" \"),8)","v":" "},{"$f":"IF(COUNTIF($F$4:$F126,$F126)<2,$F126,\" \")","v":" "},1000,{"$f":"IF(I126=F126,#REF!,\"\")","v":{"$error":"#REF!"}},{"$f":"IF(COUNTIF($F$4:$F126,$F126)<3,$F126,\" \")","v":" "},1000,{"$f":"IF(L126=$F126,#REF!,\"\")","v":{"$error":"#REF!"}},"",1000,{"$f":"IF(O126=$F126,#REF!,1000)","v":1000},{"$f":"IF(COUNTIF($F$4:$F126,I126)<4,$F126,\" \")","v":" "},1000,{"$f":"IF(R126=$F126,#REF!,\"\")","v":{"$error":"#REF!"}},"","","",{"$f":"IF(V126=$F126,#REF!,\"\")","v":""}," ",0]
[1000,null,null,{"$f":"IF(C127>0,CONCATENATE((VLOOKUP($C127,Inscription!$A$12:$G$211,3,FALSE)),\"   \",(VLOOKUP($C127,Inscription!$A$12:$G$211,4,FALSE))),\" \")","v":" "},null,{"$f":"IF(C127>0,(VLOOKUP($C127,Inscription!$A$12:$G$211,5,FALSE)),\" \")","v":" "},{"$f":"IF(C127>0,(VLOOKUP($C127,Inscription!$A$12:$G$211,7,FALSE)),\" \")","v":" "},{"$f":"LEFT(IF(C127>0,(VLOOKUP($C127,Inscription!$A$12:$G$211,6,FALSE)),\" \"),8)","v":" "},{"$f":"IF(COUNTIF($F$4:$F127,$F127)<2,$F127,\" \")","v":" "},1000,{"$f":"IF(I127=F127,#REF!,\"\")","v":{"$error":"#REF!"}},{"$f":"IF(COUNTIF($F$4:$F127,$F127)<3,$F127,\" \")","v":" "},1000,{"$f":"IF(L127=$F127,#REF!,\"\")","v":{"$error":"#REF!"}},"",1000,{"$f":"IF(O127=$F127,#REF!,1000)","v":1000},{"$f":"IF(COUNTIF($F$4:$F127,I127)<4,$F127,\" \")","v":" "},1000,{"$f":"IF(R127=$F127,#REF!,\"\")","v":{"$error":"#REF!"}},"","","",{"$f":"IF(V127=$F127,#REF!,\"\")","v":""}," ",0]
[1000,null,null,{"$f":"IF(C128>0,CONCATENATE((VLOOKUP($C128,Inscription!$A$12:$G$211,3,FALSE)),\"   \",(VLOOKUP($C128,Inscription!$A$12:$G$211,4,FALSE))),\" \")","v":" "},null,{"$f":"IF(C128>0,(VLOOKUP($C128,Inscription!$A$12:$G$211,5,FALSE)),\" \")","v":" "},{"$f":"IF(C128>0,(VLOOKUP($C128,Inscription!$A$12:$G$211,7,FALSE)),\" \")","v":" "},{"$f":"LEFT(IF(C128>0,(VLOOKUP($C128,Inscription!$A$12:$G$211,6,FALSE)),\" \"),8)","v":" "},{"$f":"IF(COUNTIF($F$4:$F128,$F128)<2,$F128,\" \")","v":" "},1000,{"$f":"IF(I128=F128,#REF!,\"\")","v":{"$error":"#REF!"}},{"$f":"IF(COUNTIF($F$4:$F128,$F128)<3,$F128,\" \")","v":" "},1000,{"$f":"IF(L128=$F128,#REF!,\"\")","v":{"$error":"#REF!"}},"",1000,{"$f":"IF(O128=$F128,#REF!,1000)","v":1000},{"$f":"IF(COUNTIF($F$4:$F128,I128)<4,$F128,\" \")","v":" "},1000,{"$f":"IF(R128=$F128,#REF!,\"\")","v":{"$error":"#REF!"}},"","","",{"$f":"IF(V128=$F128,#REF!,\"\")","v":""}," ",0]
[1000,null,null,{"$f":"IF(C129>0,CONCATENATE((VLOOKUP($C129,Inscription!$A$12:$G$211,3,FALSE)),\"   \",(VLOOKUP($C129,Inscription!$A$12:$G$211,4,FALSE))),\" \")","v":" "},null,{"$f":"IF(C129>0,(VLOOKUP($C129,Inscription!$A$12:$G$211,5,FALSE)),\" \")","v":" "},{"$f":"IF(C129>0,(VLOOKUP($C129,Inscription!$A$12:$G$211,7,FALSE)),\" \")","v":" "},{"$f":"LEFT(IF(C129>0,(VLOOKUP($C129,Inscription!$A$12:$G$211,6,FALSE)),\" \"),8)","v":" "},{"$f":"IF(COUNTIF($F$4:$F129,$F129)<2,$F129,\" \")","v":" "},1000,{"$f":"IF(I129=F129,#REF!,\"\")","v":{"$error":"#REF!"}},{"$f":"IF(COUNTIF($F$4:$F129,$F129)<3,$F129,\" \")","v":" "},1000,{"$f":"IF(L129=$F129,#REF!,\"\")","v":{"$error":"#REF!"}},"",1000,{"$f":"IF(O129=$F129,#REF!,1000)","v":1000},{"$f":"IF(COUNTIF($F$4:$F129,I129)<4,$F129,\" \")","v":" "},1000,{"$f":"IF(R129=$F129,#REF!,\"\")","v":{"$error":"#REF!"}},"","","",{"$f":"IF(V129=$F129,#REF!,\"\")","v":""}," ",0]
[1000,null,null,{"$f":"IF(C130>0,CONCATENATE((VLOOKUP($C130,Inscription!$A$12:$G$211,3,FALSE)),\"   \",(VLOOKUP($C130,Inscription!$A$12:$G$211,4,FALSE))),\" \")","v":" "},null,{"$f":"IF(C130>0,(VLOOKUP($C130,Inscription!$A$12:$G$211,5,FALSE)),\" \")","v":" "},{"$f":"IF(C130>0,(VLOOKUP($C130,Inscription!$A$12:$G$211,7,FALSE)),\" \")","v":" "},{"$f":"LEFT(IF(C130>0,(VLOOKUP($C130,Inscription!$A$12:$G$211,6,FALSE)),\" \"),8)","v":" "},{"$f":"IF(COUNTIF($F$4:$F130,$F130)<2,$F130,\" \")","v":" "},1000,{"$f":"IF(I130=F130,#REF!,\"\")","v":{"$error":"#REF!"}},{"$f":"IF(COUNTIF($F$4:$F130,$F130)<3,$F130,\" \")","v":" "},1000,{"$f":"IF(L130=$F130,#REF!,\"\")","v":{"$error":"#REF!"}},"",1000,{"$f":"IF(O130=$F130,#REF!,1000)","v":1000},{"$f":"IF(COUNTIF($F$4:$F130,I130)<4,$F130,\" \")","v":" "},1000,{"$f":"IF(R130=$F130,#REF!,\"\")","v":{"$error":"#REF!"}},"","","",{"$f":"IF(V130=$F130,#REF!,\"\")","v":""}," ",0]
[1000,null,null,{"$f":"IF(C131>0,CONCATENATE((VLOOKUP($C131,Inscription!$A$12:$G$211,3,FALSE)),\"   \",(VLOOKUP($C131,Inscription!$A$12:$G$211,4,FALSE))),\" \")","v":" "},null,{"$f":"IF(C131>0,(VLOOKUP($C131,Inscription!$A$12:$G$211,5,FALSE)),\" \")","v":" "},{"$f":"IF(C131>0,(VLOOKUP($C131,Inscription!$A$12:$G$211,7,FALSE)),\" \")","v":" "},{"$f":"LEFT(IF(C131>0,(VLOOKUP($C131,Inscription!$A$12:$G$211,6,FALSE)),\" \"),8)","v":" "},{"$f":"IF(COUNTIF($F$4:$F131,$F131)<2,$F131,\" \")","v":" "},1000,{"$f":"IF(I131=F131,#REF!,\"\")","v":{"$error":"#REF!"}},{"$f":"IF(COUNTIF($F$4:$F131,$F131)<3,$F131,\" \")","v":" "},1000,{"$f":"IF(L131=$F131,#REF!,\"\")","v":{"$error":"#REF!"}},"",1000,{"$f":"IF(O131=$F131,#REF!,1000)","v":1000},{"$f":"IF(COUNTIF($F$4:$F131,I131)<4,$F131,\" \")","v":" "},1000,{"$f":"IF(R131=$F131,#REF!,\"\")","v":{"$error":"#REF!"}},"","","",{"$f":"IF(V131=$F131,#REF!,\"\")","v":""}," ",0]
[1000,null,null,{"$f":"IF(C132>0,CONCATENATE((VLOOKUP($C132,Inscription!$A$12:$G$211,3,FALSE)),\"   \",(VLOOKUP($C132,Inscription!$A$12:$G$211,4,FALSE))),\" \")","v":" "},null,{"$f":"IF(C132>0,(VLOOKUP($C132,Inscription!$A$12:$G$211,5,FALSE)),\" \")","v":" "},{"$f":"IF(C132>0,(VLOOKUP($C132,Inscription!$A$12:$G$211,7,FALSE)),\" \")","v":" "},{"$f":"LEFT(IF(C132>0,(VLOOKUP($C132,Inscription!$A$12:$G$211,6,FALSE)),\" \"),8)","v":" "},{"$f":"IF(COUNTIF($F$4:$F132,$F132)<2,$F132,\" \")","v":" "},1000,{"$f":"IF(I132=F132,#REF!,\"\")","v":{"$error":"#REF!"}},{"$f":"IF(COUNTIF($F$4:$F132,$F132)<3,$F132,\" \")","v":" "},1000,{"$f":"IF(L132=$F132,#REF!,\"\")","v":{"$error":"#REF!"}},"",1000,{"$f":"IF(O132=$F132,#REF!,1000)","v":1000},{"$f":"IF(COUNTIF($F$4:$F132,I132)<4,$F132,\" \")","v":" "},1000,{"$f":"IF(R132=$F132,#REF!,\"\")","v":{"$error":"#REF!"}},"","","",{"$f":"IF(V132=$F132,#REF!,\"\")","v":""}," ",0]
[1000,null,null,{"$f":"IF(C133>0,CONCATENATE((VLOOKUP($C133,Inscription!$A$12:$G$211,3,FALSE)),\"   \",(VLOOKUP($C133,Inscription!$A$12:$G$211,4,FALSE))),\" \")","v":" "},null,{"$f":"IF(C133>0,(VLOOKUP($C133,Inscription!$A$12:$G$211,5,FALSE)),\" \")","v":" "},{"$f":"IF(C133>0,(VLOOKUP($C133,Inscription!$A$12:$G$211,7,FALSE)),\" \")","v":" "},{"$f":"LEFT(IF(C133>0,(VLOOKUP($C133,Inscription!$A$12:$G$211,6,FALSE)),\" \"),8)","v":" "},{"$f":"IF(COUNTIF($F$4:$F133,$F133)<2,$F133,\" \")","v":" "},1000,{"$f":"IF(I133=F133,#REF!,\"\")","v":{"$error":"#REF!"}},{"$f":"IF(COUNTIF($F$4:$F133,$F133)<3,$F133,\" \")","v":" "},1000,{"$f":"IF(L133=$F133,#REF!,\"\")","v":{"$error":"#REF!"}},"",1000,{"$f":"IF(O133=$F133,#REF!,1000)","v":1000},{"$f":"IF(COUNTIF($F$4:$F133,I133)<4,$F133,\" \")","v":" "},1000,{"$f":"IF(R133=$F133,#REF!,\"\")","v":{"$error":"#REF!"}},"","","",{"$f":"IF(V133=$F133,#REF!,\"\")","v":""}," ",0]
[130,130,null,{"$f":"IF(C134>0,CONCATENATE((VLOOKUP($C134,Inscription!$A$12:$G$211,3,FALSE)),\"   \",(VLOOKUP($C134,Inscription!$A$12:$G$211,4,FALSE))),\" \")","v":" "},null,{"$f":"IF(C134>0,(VLOOKUP($C134,Inscription!$A$12:$G$211,5,FALSE)),\" \")","v":" "},{"$f":"IF(C134>0,(VLOOKUP($C134,Inscription!$A$12:$G$211,7,FALSE)),\" \")","v":" "},{"$f":"LEFT(IF(C134>0,(VLOOKUP($C134,Inscription!$A$12:$G$211,6,FALSE)),\" \"),8)","v":" "},{"$f":"IF(COUNTIF($F$4:$F134,$F134)<2,$F134,\" \")","v":" "},130,{"$f":"IF(I134=F134,#REF!,\"\")","v":{"$error":"#REF!"}},{"$f":"IF(COUNTIF($F$4:$F134,$F134)<3,$F134,\" \")","v":" "},{"$f":"IF(L134=$F134,$A134,\"\")","v":130},{"$f":"IF(L134=$F134,#REF!,\"\")","v":{"$error":"#REF!"}},{"$f":"IF(L134=I134,\"\",L134)","v":""},{"$f":"IF(O134=$F134,$A134,1000)","v":1000},{"$f":"IF(O134=$F134,#REF!,1000)","v":1000},{"$f":"IF(COUNTIF($F$4:$F134,I134)<4,$F134,\" \")","v":" "},{"$f":"IF(R134=$F134,$A134,\"\")","v":130},{"$f":"IF(R134=$F134,#REF!,\"\")","v":{"$error":"#REF!"}},{"$f":"IF(R134=I134,\"\",R134)","v":""},{"$f":"IF(U134=O134,\"\",R134)","v":""},{"$f":"IF(V134=$F134,$A134,\"\")","v":""},{"$f":"IF(V134=$F134,#REF!,\"\")","v":""}," ",130]
[131,131,null,{"$f":"IF(C135>0,CONCATENATE((VLOOKUP($C135,Inscription!$A$12:$G$211,3,FALSE)),\"   \",(VLOOKUP($C135,Inscription!$A$12:$G$211,4,FALSE))),\" \")","v":" "},null,{"$f":"IF(C135>0,(VLOOKUP($C135,Inscription!$A$12:$G$211,5,FALSE)),\" \")","v":" "},{"$f":"IF(C135>0,(VLOOKUP($C135,Inscription!$A$12:$G$211,7,FALSE)),\" \")","v":" "},{"$f":"LEFT(IF(C135>0,(VLOOKUP($C135,Inscription!$A$12:$G$211,6,FALSE)),\" \"),8)","v":" "},{"$f":"IF(COUNTIF($F$4:$F135,$F135)<2,$F135,\" \")","v":" "},131,{"$f":"IF(I135=F135,#REF!,\"\")","v":{"$error":"#REF!"}},{"$f":"IF(COUNTIF($F$4:$F135,$F135)<3,$F135,\" \")","v":" "},131,{"$f":"IF(L135=$F135,#REF!,\"\")","v":{"$error":"#REF!"}},"",1000,{"$f":"IF(O135=$F135,#REF!,1000)","v":1000},{"$f":"IF(COUNTIF($F$4:$F135,I135)<4,$F135,\" \")","v":" "},131,{"$f":"IF(R135=$F135,#REF!,\"\")","v":{"$error":"#REF!"}},"","","",{"$f":"IF(V135=$F135,#REF!,\"\")","v":""}," ",131]
[132,132,null,{"$f":"IF(C136>0,CONCATENATE((VLOOKUP($C136,Inscription!$A$12:$G$211,3,FALSE)),\"   \",(VLOOKUP($C136,Inscription!$A$12:$G$211,4,FALSE))),\" \")","v":" "},null,{"$f":"IF(C136>0,(VLOOKUP($C136,Inscription!$A$12:$G$211,5,FALSE)),\" \")","v":" "},{"$f":"IF(C136>0,(VLOOKUP($C136,Inscription!$A$12:$G$211,7,FALSE)),\" \")","v":" "},{"$f":"LEFT(IF(C136>0,(VLOOKUP($C136,Inscription!$A$12:$G$211,6,FALSE)),\" \"),8)","v":" "},{"$f":"IF(COUNTIF($F$4:$F136,$F136)<2,$F136,\" \")","v":" "},132,{"$f":"IF(I136=F136,#REF!,\"\")","v":{"$error":"#REF!"}},{"$f":"IF(COUNTIF($F$4:$F136,$F136)<3,$F136,\" \")","v":" "},132,{"$f":"IF(L136=$F136,#REF!,\"\")","v":{"$error":"#REF!"}},"",1000,{"$f":"IF(O136=$F136,#REF!,1000)","v":1000},{"$f":"IF(COUNTIF($F$4:$F136,I136)<4,$F136,\" \")","v":" "},132,{"$f":"IF(R136=$F136,#REF!,\"\")","v":{"$error":"#REF!"}},"","","",{"$f":"IF(V136=$F136,#REF!,\"\")","v":""}," ",132]
[133,133,null,{"$f":"IF(C137>0,CONCATENATE((VLOOKUP($C137,Inscription!$A$12:$G$211,3,FALSE)),\"   \",(VLOOKUP($C137,Inscription!$A$12:$G$211,4,FALSE))),\" \")","v":" "},null,{"$f":"IF(C137>0,(VLOOKUP($C137,Inscription!$A$12:$G$211,5,FALSE)),\" \")","v":" "},{"$f":"IF(C137>0,(VLOOKUP($C137,Inscription!$A$12:$G$211,7,FALSE)),\" \")","v":" "},{"$f":"LEFT(IF(C137>0,(VLOOKUP($C137,Inscription!$A$12:$G$211,6,FALSE)),\" \"),8)","v":" "},{"$f":"IF(COUNTIF($F$4:$F137,$F137)<2,$F137,\" \")","v":" "},133,{"$f":"IF(I137=F137,#REF!,\"\")","v":{"$error":"#REF!"}},{"$f":"IF(COUNTIF($F$4:$F137,$F137)<3,$F137,\" \")","v":" "},133,{"$f":"IF(L137=$F137,#REF!,\"\")","v":{"$error":"#REF!"}},"",1000,{"$f":"IF(O137=$F137,#REF!,1000)","v":1000},{"$f":"IF(COUNTIF($F$4:$F137,I137)<4,$F137,\" \")","v":" "},133,{"$f":"IF(R137=$F137,#REF!,\"\")","v":{"$error":"#REF!"}},"","","",{"$f":"IF(V137=$F137,#REF!,\"\")","v":""}," ",133]
[134,134,null,{"$f":"IF(C138>0,CONCATENATE((VLOOKUP($C138,Inscription!$A$12:$G$211,3,FALSE)),\"   \",(VLOOKUP($C138,Inscription!$A$12:$G$211,4,FALSE))),\" \")","v":" "},null,{"$f":"IF(C138>0,(VLOOKUP($C138,Inscription!$A$12:$G$211,5,FALSE)),\" \")","v":" "},{"$f":"IF(C138>0,(VLOOKUP($C138,Inscription!$A$12:$G$211,7,FALSE)),\" \")","v":" "},{"$f":"LEFT(IF(C138>0,(VLOOKUP($C138,Inscription!$A$12:$G$211,6,FALSE)),\" \"),8)","v":" "},{"$f":"IF(COUNTIF($F$4:$F138,$F138)<2,$F138,\" \")","v":" "},134,{"$f":"IF(I138=F138,#REF!,\"\")","v":{"$error":"#REF!"}},{"$f":"IF(COUNTIF($F$4:$F138,$F138)<3,$F138,\" \")","v":" "},134,{"$f":"IF(L138=$F138,#REF!,\"\")","v":{"$error":"#REF!"}},"",1000,{"$f":"IF(O138=$F138,#REF!,1000)","v":1000},{"$f":"IF(COUNTIF($F$4:$F138,I138)<4,$F138,\" \")","v":" "},134,{"$f":"IF(R138=$F138,#REF!,\"\")","v":{"$error":"#REF!"}},"","","",{"$f":"IF(V138=$F138,#REF!,\"\")","v":""}," ",134]
[135,135,null,{"$f":"IF(C139>0,CONCATENATE((VLOOKUP($C139,Inscription!$A$12:$G$211,3,FALSE)),\"   \",(VLOOKUP($C139,Inscription!$A$12:$G$211,4,FALSE))),\" \")","v":" "},null,{"$f":"IF(C139>0,(VLOOKUP($C139,Inscription!$A$12:$G$211,5,FALSE)),\" \")","v":" "},{"$f":"IF(C139>0,(VLOOKUP($C139,Inscription!$A$12:$G$211,7,FALSE)),\" \")","v":" "},{"$f":"LEFT(IF(C139>0,(VLOOKUP($C139,Inscription!$A$12:$G$211,6,FALSE)),\" \"),8)","v":" "},{"$f":"IF(COUNTIF($F$4:$F139,$F139)<2,$F139,\" \")","v":" "},135,{"$f":"IF(I139=F139,#REF!,\"\")","v":{"$error":"#REF!"}},{"$f":"IF(COUNTIF($F$4:$F139,$F139)<3,$F139,\" \")","v":" "},135,{"$f":"IF(L139=$F139,#REF!,\"\")","v":{"$error":"#REF!"}},"",1000,{"$f":"IF(O139=$F139,#REF!,1000)","v":1000},{"$f":"IF(COUNTIF($F$4:$F139,I139)<4,$F139,\" \")","v":" "},135,{"$f":"IF(R139=$F139,#REF!,\"\")","v":{"$error":"#REF!"}},"","","",{"$f":"IF(V139=$F139,#REF!,\"\")","v":""}," ",135]
[136,136,null,{"$f":"IF(C140>0,CONCATENATE((VLOOKUP($C140,Inscription!$A$12:$G$211,3,FALSE)),\"   \",(VLOOKUP($C140,Inscription!$A$12:$G$211,4,FALSE))),\" \")","v":" "},null,{"$f":"IF(C140>0,(VLOOKUP($C140,Inscription!$A$12:$G$211,5,FALSE)),\" \")","v":" "},{"$f":"IF(C140>0,(VLOOKUP($C140,Inscription!$A$12:$G$211,7,FALSE)),\" \")","v":" "},{"$f":"LEFT(IF(C140>0,(VLOOKUP($C140,Inscription!$A$12:$G$211,6,FALSE)),\" \"),8)","v":" "},{"$f":"IF(COUNTIF($F$4:$F140,$F140)<2,$F140,\" \")","v":" "},136,{"$f":"IF(I140=F140,#REF!,\"\")","v":{"$error":"#REF!"}},{"$f":"IF(COUNTIF($F$4:$F140,$F140)<3,$F140,\" \")","v":" "},136,{"$f":"IF(L140=$F140,#REF!,\"\")","v":{"$error":"#REF!"}},"",1000,{"$f":"IF(O140=$F140,#REF!,1000)","v":1000},{"$f":"IF(COUNTIF($F$4:$F140,I140)<4,$F140,\" \")","v":" "},136,{"$f":"IF(R140=$F140,#REF!,\"\")","v":{"$error":"#REF!"}},"","","",{"$f":"IF(V140=$F140,#REF!,\"\")","v":""}," ",136]
[137,137,null,{"$f":"IF(C141>0,CONCATENATE((VLOOKUP($C141,Inscription!$A$12:$G$211,3,FALSE)),\"   \",(VLOOKUP($C141,Inscription!$A$12:$G$211,4,FALSE))),\" \")","v":" "},null,{"$f":"IF(C141>0,(VLOOKUP($C141,Inscription!$A$12:$G$211,5,FALSE)),\" \")","v":" "},{"$f":"IF(C141>0,(VLOOKUP($C141,Inscription!$A$12:$G$211,7,FALSE)),\" \")","v":" "},{"$f":"LEFT(IF(C141>0,(VLOOKUP($C141,Inscription!$A$12:$G$211,6,FALSE)),\" \"),8)","v":" "},{"$f":"IF(COUNTIF($F$4:$F141,$F141)<2,$F141,\" \")","v":" "},137,{"$f":"IF(I141=F141,#REF!,\"\")","v":{"$error":"#REF!"}},{"$f":"IF(COUNTIF($F$4:$F141,$F141)<3,$F141,\" \")","v":" "},137,{"$f":"IF(L141=$F141,#REF!,\"\")","v":{"$error":"#REF!"}},"",1000,{"$f":"IF(O141=$F141,#REF!,1000)","v":1000},{"$f":"IF(COUNTIF($F$4:$F141,I141)<4,$F141,\" \")","v":" "},137,{"$f":"IF(R141=$F141,#REF!,\"\")","v":{"$error":"#REF!"}},"","","",{"$f":"IF(V141=$F141,#REF!,\"\")","v":""}," ",137]
[138,138,null,{"$f":"IF(C142>0,CONCATENATE((VLOOKUP($C142,Inscription!$A$12:$G$211,3,FALSE)),\"   \",(VLOOKUP($C142,Inscription!$A$12:$G$211,4,FALSE))),\" \")","v":" "},null,{"$f":"IF(C142>0,(VLOOKUP($C142,Inscription!$A$12:$G$211,5,FALSE)),\" \")","v":" "},{"$f":"IF(C142>0,(VLOOKUP($C142,Inscription!$A$12:$G$211,7,FALSE)),\" \")","v":" "},{"$f":"LEFT(IF(C142>0,(VLOOKUP($C142,Inscription!$A$12:$G$211,6,FALSE)),\" \"),8)","v":" "},{"$f":"IF(COUNTIF($F$4:$F142,$F142)<2,$F142,\" \")","v":" "},138,{"$f":"IF(I142=F142,#REF!,\"\")","v":{"$error":"#REF!"}},{"$f":"IF(COUNTIF($F$4:$F142,$F142)<3,$F142,\" \")","v":" "},138,{"$f":"IF(L142=$F142,#REF!,\"\")","v":{"$error":"#REF!"}},"",1000,{"$f":"IF(O142=$F142,#REF!,1000)","v":1000},{"$f":"IF(COUNTIF($F$4:$F142,I142)<4,$F142,\" \")","v":" "},138,{"$f":"IF(R142=$F142,#REF!,\"\")","v":{"$error":"#REF!"}},"","","",{"$f":"IF(V142=$F142,#REF!,\"\")","v":""}," ",138]
[139,139,null,{"$f":"IF(C143>0,CONCATENATE((VLOOKUP($C143,Inscription!$A$12:$G$211,3,FALSE)),\"   \",(VLOOKUP($C143,Inscription!$A$12:$G$211,4,FALSE))),\" \")","v":" "},null,{"$f":"IF(C143>0,(VLOOKUP($C143,Inscription!$A$12:$G$211,5,FALSE)),\" \")","v":" "},{"$f":"IF(C143>0,(VLOOKUP($C143,Inscription!$A$12:$G$211,7,FALSE)),\" \")","v":" "},{"$f":"LEFT(IF(C143>0,(VLOOKUP($C143,Inscription!$A$12:$G$211,6,FALSE)),\" \"),8)","v":" "},{"$f":"IF(COUNTIF($F$4:$F143,$F143)<2,$F143,\" \")","v":" "},139,{"$f":"IF(I143=F143,#REF!,\"\")","v":{"$error":"#REF!"}},{"$f":"IF(COUNTIF($F$4:$F143,$F143)<3,$F143,\" \")","v":" "},139,{"$f":"IF(L143=$F143,#REF!,\"\")","v":{"$error":"#REF!"}},"",1000,{"$f":"IF(O143=$F143,#REF!,1000)","v":1000},{"$f":"IF(COUNTIF($F$4:$F143,I143)<4,$F143,\" \")","v":" "},139,{"$f":"IF(R143=$F143,#REF!,\"\")","v":{"$error":"#REF!"}},"","","",{"$f":"IF(V143=$F143,#REF!,\"\")","v":""}," ",139]
[140,140,null,{"$f":"IF(C144>0,CONCATENATE((VLOOKUP($C144,Inscription!$A$12:$G$211,3,FALSE)),\"   \",(VLOOKUP($C144,Inscription!$A$12:$G$211,4,FALSE))),\" \")","v":" "},null,{"$f":"IF(C144>0,(VLOOKUP($C144,Inscription!$A$12:$G$211,5,FALSE)),\" \")","v":" "},{"$f":"IF(C144>0,(VLOOKUP($C144,Inscription!$A$12:$G$211,7,FALSE)),\" \")","v":" "},{"$f":"LEFT(IF(C144>0,(VLOOKUP($C144,Inscription!$A$12:$G$211,6,FALSE)),\" \"),8)","v":" "},{"$f":"IF(COUNTIF($F$4:$F144,$F144)<2,$F144,\" \")","v":" "},140,{"$f":"IF(I144=F144,#REF!,\"\")","v":{"$error":"#REF!"}},{"$f":"IF(COUNTIF($F$4:$F144,$F144)<3,$F144,\" \")","v":" "},140,{"$f":"IF(L144=$F144,#REF!,\"\")","v":{"$error":"#REF!"}},"",1000,{"$f":"IF(O144=$F144,#REF!,1000)","v":1000},{"$f":"IF(COUNTIF($F$4:$F144,I144)<4,$F144,\" \")","v":" "},140,{"$f":"IF(R144=$F144,#REF!,\"\")","v":{"$error":"#REF!"}},"","","",{"$f":"IF(V144=$F144,#REF!,\"\")","v":""}," ",140]
[141,141,null,{"$f":"IF(C145>0,CONCATENATE((VLOOKUP($C145,Inscription!$A$12:$G$211,3,FALSE)),\"   \",(VLOOKUP($C145,Inscription!$A$12:$G$211,4,FALSE))),\" \")","v":" "},null,{"$f":"IF(C145>0,(VLOOKUP($C145,Inscription!$A$12:$G$211,5,FALSE)),\" \")","v":" "},{"$f":"IF(C145>0,(VLOOKUP($C145,Inscription!$A$12:$G$211,7,FALSE)),\" \")","v":" "},{"$f":"LEFT(IF(C145>0,(VLOOKUP($C145,Inscription!$A$12:$G$211,6,FALSE)),\" \"),8)","v":" "},{"$f":"IF(COUNTIF($F$4:$F145,$F145)<2,$F145,\" \")","v":" "},141,{"$f":"IF(I145=F145,#REF!,\"\")","v":{"$error":"#REF!"}},{"$f":"IF(COUNTIF($F$4:$F145,$F145)<3,$F145,\" \")","v":" "},141,{"$f":"IF(L145=$F145,#REF!,\"\")","v":{"$error":"#REF!"}},"",1000,{"$f":"IF(O145=$F145,#REF!,1000)","v":1000},{"$f":"IF(COUNTIF($F$4:$F145,I145)<4,$F145,\" \")","v":" "},141,{"$f":"IF(R145=$F145,#REF!,\"\")","v":{"$error":"#REF!"}},"","","",{"$f":"IF(V145=$F145,#REF!,\"\")","v":""}," ",141]
[142,142,null,{"$f":"IF(C146>0,CONCATENATE((VLOOKUP($C146,Inscription!$A$12:$G$211,3,FALSE)),\"   \",(VLOOKUP($C146,Inscription!$A$12:$G$211,4,FALSE))),\" \")","v":" "},null,{"$f":"IF(C146>0,(VLOOKUP($C146,Inscription!$A$12:$G$211,5,FALSE)),\" \")","v":" "},{"$f":"IF(C146>0,(VLOOKUP($C146,Inscription!$A$12:$G$211,7,FALSE)),\" \")","v":" "},{"$f":"LEFT(IF(C146>0,(VLOOKUP($C146,Inscription!$A$12:$G$211,6,FALSE)),\" \"),8)","v":" "},{"$f":"IF(COUNTIF($F$4:$F146,$F146)<2,$F146,\" \")","v":" "},142,{"$f":"IF(I146=F146,#REF!,\"\")","v":{"$error":"#REF!"}},{"$f":"IF(COUNTIF($F$4:$F146,$F146)<3,$F146,\" \")","v":" "},142,{"$f":"IF(L146=$F146,#REF!,\"\")","v":{"$error":"#REF!"}},"",1000,{"$f":"IF(O146=$F146,#REF!,1000)","v":1000},{"$f":"IF(COUNTIF($F$4:$F146,I146)<4,$F146,\" \")","v":" "},142,{"$f":"IF(R146=$F146,#REF!,\"\")","v":{"$error":"#REF!"}},"","","",{"$f":"IF(V146=$F146,#REF!,\"\")","v":""}," ",142]
[143,143,null,{"$f":"IF(C147>0,CONCATENATE((VLOOKUP($C147,Inscription!$A$12:$G$211,3,FALSE)),\"   \",(VLOOKUP($C147,Inscription!$A$12:$G$211,4,FALSE))),\" \")","v":" "},null,{"$f":"IF(C147>0,(VLOOKUP($C147,Inscription!$A$12:$G$211,5,FALSE)),\" \")","v":" "},{"$f":"IF(C147>0,(VLOOKUP($C147,Inscription!$A$12:$G$211,7,FALSE)),\" \")","v":" "},{"$f":"LEFT(IF(C147>0,(VLOOKUP($C147,Inscription!$A$12:$G$211,6,FALSE)),\" \"),8)","v":" "},{"$f":"IF(COUNTIF($F$4:$F147,$F147)<2,$F147,\" \")","v":" "},143,{"$f":"IF(I147=F147,#REF!,\"\")","v":{"$error":"#REF!"}},{"$f":"IF(COUNTIF($F$4:$F147,$F147)<3,$F147,\" \")","v":" "},143,{"$f":"IF(L147=$F147,#REF!,\"\")","v":{"$error":"#REF!"}},"",1000,{"$f":"IF(O147=$F147,#REF!,1000)","v":1000},{"$f":"IF(COUNTIF($F$4:$F147,I147)<4,$F147,\" \")","v":" "},143,{"$f":"IF(R147=$F147,#REF!,\"\")","v":{"$error":"#REF!"}},"","","",{"$f":"IF(V147=$F147,#REF!,\"\")","v":""}," ",143]
[144,144,null,{"$f":"IF(C148>0,CONCATENATE((VLOOKUP($C148,Inscription!$A$12:$G$211,3,FALSE)),\"   \",(VLOOKUP($C148,Inscription!$A$12:$G$211,4,FALSE))),\" \")","v":" "},null,{"$f":"IF(C148>0,(VLOOKUP($C148,Inscription!$A$12:$G$211,5,FALSE)),\" \")","v":" "},{"$f":"IF(C148>0,(VLOOKUP($C148,Inscription!$A$12:$G$211,7,FALSE)),\" \")","v":" "},{"$f":"LEFT(IF(C148>0,(VLOOKUP($C148,Inscription!$A$12:$G$211,6,FALSE)),\" \"),8)","v":" "},{"$f":"IF(COUNTIF($F$4:$F148,$F148)<2,$F148,\" \")","v":" "},{"$f":"IF(I148=F148,A148,\"\")","v":144},{"$f":"IF(I148=F148,#REF!,\"\")","v":{"$error":"#REF!"}},{"$f":"IF(COUNTIF($F$4:$F148,$F148)<3,$F148,\" \")","v":" "},144,{"$f":"IF(L148=$F148,#REF!,\"\")","v":{"$error":"#REF!"}},"",1000,{"$f":"IF(O148=$F148,#REF!,1000)","v":1000},{"$f":"IF(COUNTIF($F$4:$F148,I148)<4,$F148,\" \")","v":" "},144,{"$f":"IF(R148=$F148,#REF!,\"\")","v":{"$error":"#REF!"}},"","","",{"$f":"IF(V148=$F148,#REF!,\"\")","v":""}," ",144]
[145,145,null,{"$f":"IF(C149>0,CONCATENATE((VLOOKUP($C149,Inscription!$A$12:$G$211,3,FALSE)),\"   \",(VLOOKUP($C149,Inscription!$A$12:$G$211,4,FALSE))),\" \")","v":" "},null,{"$f":"IF(C149>0,(VLOOKUP($C149,Inscription!$A$12:$G$211,5,FALSE)),\" \")","v":" "},{"$f":"IF(C149>0,(VLOOKUP($C149,Inscription!$A$12:$G$211,7,FALSE)),\" \")","v":" "},{"$f":"LEFT(IF(C149>0,(VLOOKUP($C149,Inscription!$A$12:$G$211,6,FALSE)),\" \"),8)","v":" "},{"$f":"IF(COUNTIF($F$4:$F149,$F149)<2,$F149,\" \")","v":" "},145,{"$f":"IF(I149=F149,#REF!,\"\")","v":{"$error":"#REF!"}},{"$f":"IF(COUNTIF($F$4:$F149,$F149)<3,$F149,\" \")","v":" "},145,{"$f":"IF(L149=$F149,#REF!,\"\")","v":{"$error":"#REF!"}},"",1000,{"$f":"IF(O149=$F149,#REF!,1000)","v":1000},{"$f":"IF(COUNTIF($F$4:$F149,I149)<4,$F149,\" \")","v":" "},145,{"$f":"IF(R149=$F149,#REF!,\"\")","v":{"$error":"#REF!"}},"","","",{"$f":"IF(V149=$F149,#REF!,\"\")","v":""}," ",145]
[146,146,null,{"$f":"IF(C150>0,CONCATENATE((VLOOKUP($C150,Inscription!$A$12:$G$211,3,FALSE)),\"   \",(VLOOKUP($C150,Inscription!$A$12:$G$211,4,FALSE))),\" \")","v":" "},null,{"$f":"IF(C150>0,(VLOOKUP($C150,Inscription!$A$12:$G$211,5,FALSE)),\" \")","v":" "},{"$f":"IF(C150>0,(VLOOKUP($C150,Inscription!$A$12:$G$211,7,FALSE)),\" \")","v":" "},{"$f":"LEFT(IF(C150>0,(VLOOKUP($C150,Inscription!$A$12:$G$211,6,FALSE)),\" \"),8)","v":" "},{"$f":"IF(COUNTIF($F$4:$F150,$F150)<2,$F150,\" \")","v":" "},146,{"$f":"IF(I150=F150,#REF!,\"\")","v":{"$error":"#REF!"}},{"$f":"IF(COUNTIF($F$4:$F150,$F150)<3,$F150,\" \")","v":" "},146,{"$f":"IF(L150=$F150,#REF!,\"\")","v":{"$error":"#REF!"}},"",1000,{"$f":"IF(O150=$F150,#REF!,1000)","v":1000},{"$f":"IF(COUNTIF($F$4:$F150,I150)<4,$F150,\" \")","v":" "},146,{"$f":"IF(R150=$F150,#REF!,\"\")","v":{"$error":"#REF!"}},"","","",{"$f":"IF(V150=$F150,#REF!,\"\")","v":""}," ",146]
[147,147,null,{"$f":"IF(C151>0,CONCATENATE((VLOOKUP($C151,Inscription!$A$12:$G$211,3,FALSE)),\"   \",(VLOOKUP($C151,Inscription!$A$12:$G$211,4,FALSE))),\" \")","v":" "},null,{"$f":"IF(C151>0,(VLOOKUP($C151,Inscription!$A$12:$G$211,5,FALSE)),\" \")","v":" "},{"$f":"IF(C151>0,(VLOOKUP($C151,Inscription!$A$12:$G$211,7,FALSE)),\" \")","v":" "},{"$f":"LEFT(IF(C151>0,(VLOOKUP($C151,Inscription!$A$12:$G$211,6,FALSE)),\" \"),8)","v":" "},{"$f":"IF(COUNTIF($F$4:$F151,$F151)<2,$F151,\" \")","v":" "},147,{"$f":"IF(I151=F151,#REF!,\"\")","v":{"$error":"#REF!"}},{"$f":"IF(COUNTIF($F$4:$F151,$F151)<3,$F151,\" \")","v":" "},147,{"$f":"IF(L151=$F151,#REF!,\"\")","v":{"$error":"#REF!"}},"",1000,{"$f":"IF(O151=$F151,#REF!,1000)","v":1000},{"$f":"IF(COUNTIF($F$4:$F151,I151)<4,$F151,\" \")","v":" "},147,{"$f":"IF(R151=$F151,#REF!,\"\")","v":{"$error":"#REF!"}},"","","",{"$f":"IF(V151=$F151,#REF!,\"\")","v":""}," ",147]
[148,148,null,{"$f":"IF(C152>0,CONCATENATE((VLOOKUP($C152,Inscription!$A$12:$G$211,3,FALSE)),\"   \",(VLOOKUP($C152,Inscription!$A$12:$G$211,4,FALSE))),\" \")","v":" "},null,{"$f":"IF(C152>0,(VLOOKUP($C152,Inscription!$A$12:$G$211,5,FALSE)),\" \")","v":" "},{"$f":"IF(C152>0,(VLOOKUP($C152,Inscription!$A$12:$G$211,7,FALSE)),\" \")","v":" "},{"$f":"LEFT(IF(C152>0,(VLOOKUP($C152,Inscription!$A$12:$G$211,6,FALSE)),\" \"),8)","v":" "},{"$f":"IF(COUNTIF($F$4:$F152,$F152)<2,$F152,\" \")","v":" "},148,{"$f":"IF(I152=F152,#REF!,\"\")","v":{"$error":"#REF!"}},{"$f":"IF(COUNTIF($F$4:$F152,$F152)<3,$F152,\" \")","v":" "},148,{"$f":"IF(L152=$F152,#REF!,\"\")","v":{"$error":"#REF!"}},"",1000,{"$f":"IF(O152=$F152,#REF!,1000)","v":1000},{"$f":"IF(COUNTIF($F$4:$F152,I152)<4,$F152,\" \")","v":" "},148,{"$f":"IF(R152=$F152,#REF!,\"\")","v":{"$error":"#REF!"}},"","","",{"$f":"IF(V152=$F152,#REF!,\"\")","v":""}," ",148]
[{"$f":"IF(B153<1,1000,(IF(Z153=B153,B153,(20100-SUM($Z$4:$Z$204))/(COUNTIF($Z$4:$Z$204,\"T\")))))","v":149},149,null,{"$f":"IF(C153>0,CONCATENATE((VLOOKUP($C153,Inscription!$A$12:$G$211,3,FALSE)),\"   \",(VLOOKUP($C153,Inscription!$A$12:$G$211,4,FALSE))),\" \")","v":" "},null,{"$f":"IF(C153>0,(VLOOKUP($C153,Inscription!$A$12:$G$211,5,FALSE)),\" \")","v":" "},{"$f":"IF(C153>0,(VLOOKUP($C153,Inscription!$A$12:$G$211,7,FALSE)),\" \")","v":" "},{"$f":"LEFT(IF(C153>0,(VLOOKUP($C153,Inscription!$A$12:$G$211,6,FALSE)),\" \"),8)","v":" "},{"$f":"IF(COUNTIF($F$4:$F153,$F153)<2,$F153,\" \")","v":" "},149,{"$f":"IF(I153=F153,#REF!,\"\")","v":{"$error":"#REF!"}},{"$f":"IF(COUNTIF($F$4:$F153,$F153)<3,$F153,\" \")","v":" "},149,{"$f":"IF(L153=$F153,#REF!,\"\")","v":{"$error":"#REF!"}},"",1000,{"$f":"IF(O153=$F153,#REF!,1000)","v":1000},{"$f":"IF(COUNTIF($F$4:$F153,I153)<4,$F153,\" \")","v":" "},149,{"$f":"IF(R153=$F153,#REF!,\"\")","v":{"$error":"#REF!"}},"","","",{"$f":"IF(V153=$F153,#REF!,\"\")","v":""},{"$f":"IF(COUNTIF($C$4:$C$204,C153)>1,\"X\",\" \")","v":" "},{"$f":"IF(COUNTIF($B$4:$B$204,B153)>1,\"T\",B153)","v":149}]
[150,150,null,{"$f":"IF(C154>0,CONCATENATE((VLOOKUP($C154,Inscription!$A$12:$G$211,3,FALSE)),\"   \",(VLOOKUP($C154,Inscription!$A$12:$G$211,4,FALSE))),\" \")","v":" "},null,{"$f":"IF(C154>0,(VLOOKUP($C154,Inscription!$A$12:$G$211,5,FALSE)),\" \")","v":" "},{"$f":"IF(C154>0,(VLOOKUP($C154,Inscription!$A$12:$G$211,7,FALSE)),\" \")","v":" "},{"$f":"LEFT(IF(C154>0,(VLOOKUP($C154,Inscription!$A$12:$G$211,6,FALSE)),\" \"),8)","v":" "},{"$f":"IF(COUNTIF($F$4:$F154,$F154)<2,$F154,\" \")","v":" "},150,{"$f":"IF(I154=F154,#REF!,\"\")","v":{"$error":"#REF!"}},{"$f":"IF(COUNTIF($F$4:$F154,$F154)<3,$F154,\" \")","v":" "},150,{"$f":"IF(L154=$F154,#REF!,\"\")","v":{"$error":"#REF!"}},"",1000,{"$f":"IF(O154=$F154,#REF!,1000)","v":1000},{"$f":"IF(COUNTIF($F$4:$F154,I154)<4,$F154,\" \")","v":" "},150,{"$f":"IF(R154=$F154,#REF!,\"\")","v":{"$error":"#REF!"}},"","","",{"$f":"IF(V154=$F154,#REF!,\"\")","v":""}," ",150]
[151,151,null,{"$f":"IF(C155>0,CONCATENATE((VLOOKUP($C155,Inscription!$A$12:$G$211,3,FALSE)),\"   \",(VLOOKUP($C155,Inscription!$A$12:$G$211,4,FALSE))),\" \")","v":" "},null,{"$f":"IF(C155>0,(VLOOKUP($C155,Inscription!$A$12:$G$211,5,FALSE)),\" \")","v":" "},{"$f":"IF(C155>0,(VLOOKUP($C155,Inscription!$A$12:$G$211,7,FALSE)),\" \")","v":" "},{"$f":"LEFT(IF(C155>0,(VLOOKUP($C155,Inscription!$A$12:$G$211,6,FALSE)),\" \"),8)","v":" "},{"$f":"IF(COUNTIF($F$4:$F155,$F155)<2,$F155,\" \")","v":" "},151,{"$f":"IF(I155=F155,#REF!,\"\")","v":{"$error":"#REF!"}},{"$f":"IF(COUNTIF($F$4:$F155,$F155)<3,$F155,\" \")","v":" "},151,{"$f":"IF(L155=$F155,#REF!,\"\")","v":{"$error":"#REF!"}},"",1000,{"$f":"IF(O155=$F155,#REF!,1000)","v":1000},{"$f":"IF(COUNTIF($F$4:$F155,I155)<4,$F155,\" \")","v":" "},151,{"$f":"IF(R155=$F155,#REF!,\"\")","v":{"$error":"#REF!"}},"","","",{"$f":"IF(V155=$F155,#REF!,\"\")","v":""}," ",151]
[152,152,null,{"$f":"IF(C156>0,CONCATENATE((VLOOKUP($C156,Inscription!$A$12:$G$211,3,FALSE)),\"   \",(VLOOKUP($C156,Inscription!$A$12:$G$211,4,FALSE))),\" \")","v":" "},null,{"$f":"IF(C156>0,(VLOOKUP($C156,Inscription!$A$12:$G$211,5,FALSE)),\" \")","v":" "},{"$f":"IF(C156>0,(VLOOKUP($C156,Inscription!$A$12:$G$211,7,FALSE)),\" \")","v":" "},{"$f":"LEFT(IF(C156>0,(VLOOKUP($C156,Inscription!$A$12:$G$211,6,FALSE)),\" \"),8)","v":" "},{"$f":"IF(COUNTIF($F$4:$F156,$F156)<2,$F156,\" \")","v":" "},152,{"$f":"IF(I156=F156,#REF!,\"\")","v":{"$error":"#REF!"}},{"$f":"IF(COUNTIF($F$4:$F156,$F156)<3,$F156,\" \")","v":" "},152,{"$f":"IF(L156=$F156,#REF!,\"\")","v":{"$error":"#REF!"}},"",1000,{"$f":"IF(O156=$F156,#REF!,1000)","v":1000},{"$f":"IF(COUNTIF($F$4:$F156,I156)<4,$F156,\" \")","v":" "},152,{"$f":"IF(R156=$F156,#REF!,\"\")","v":{"$error":"#REF!"}},"","","",{"$f":"IF(V156=$F156,#REF!,\"\")","v":""}," ",152]
[153,153,null,{"$f":"IF(C157>0,CONCATENATE((VLOOKUP($C157,Inscription!$A$12:$G$211,3,FALSE)),\"   \",(VLOOKUP($C157,Inscription!$A$12:$G$211,4,FALSE))),\" \")","v":" "},null,{"$f":"IF(C157>0,(VLOOKUP($C157,Inscription!$A$12:$G$211,5,FALSE)),\" \")","v":" "},{"$f":"IF(C157>0,(VLOOKUP($C157,Inscription!$A$12:$G$211,7,FALSE)),\" \")","v":" "},{"$f":"LEFT(IF(C157>0,(VLOOKUP($C157,Inscription!$A$12:$G$211,6,FALSE)),\" \"),8)","v":" "},{"$f":"IF(COUNTIF($F$4:$F157,$F157)<2,$F157,\" \")","v":" "},153,{"$f":"IF(I157=F157,#REF!,\"\")","v":{"$error":"#REF!"}},{"$f":"IF(COUNTIF($F$4:$F157,$F157)<3,$F157,\" \")","v":" "},153,{"$f":"IF(L157=$F157,#REF!,\"\")","v":{"$error":"#REF!"}},"",1000,{"$f":"IF(O157=$F157,#REF!,1000)","v":1000},{"$f":"IF(COUNTIF($F$4:$F157,I157)<4,$F157,\" \")","v":" "},153,{"$f":"IF(R157=$F157,#REF!,\"\")","v":{"$error":"#REF!"}},"","","",{"$f":"IF(V157=$F157,#REF!,\"\")","v":""}," ",153]
[154,154,null,{"$f":"IF(C158>0,CONCATENATE((VLOOKUP($C158,Inscription!$A$12:$G$211,3,FALSE)),\"   \",(VLOOKUP($C158,Inscription!$A$12:$G$211,4,FALSE))),\" \")","v":" "},null,{"$f":"IF(C158>0,(VLOOKUP($C158,Inscription!$A$12:$G$211,5,FALSE)),\" \")","v":" "},{"$f":"IF(C158>0,(VLOOKUP($C158,Inscription!$A$12:$G$211,7,FALSE)),\" \")","v":" "},{"$f":"LEFT(IF(C158>0,(VLOOKUP($C158,Inscription!$A$12:$G$211,6,FALSE)),\" \"),8)","v":" "},{"$f":"IF(COUNTIF($F$4:$F158,$F158)<2,$F158,\" \")","v":" "},154,{"$f":"IF(I158=F158,#REF!,\"\")","v":{"$error":"#REF!"}},{"$f":"IF(COUNTIF($F$4:$F158,$F158)<3,$F158,\" \")","v":" "},154,{"$f":"IF(L158=$F158,#REF!,\"\")","v":{"$error":"#REF!"}},"",1000,{"$f":"IF(O158=$F158,#REF!,1000)","v":1000},{"$f":"IF(COUNTIF($F$4:$F158,I158)<4,$F158,\" \")","v":" "},154,{"$f":"IF(R158=$F158,#REF!,\"\")","v":{"$error":"#REF!"}},"","","",{"$f":"IF(V158=$F158,#REF!,\"\")","v":""}," ",154]
[155,155,null,{"$f":"IF(C159>0,CONCATENATE((VLOOKUP($C159,Inscription!$A$12:$G$211,3,FALSE)),\"   \",(VLOOKUP($C159,Inscription!$A$12:$G$211,4,FALSE))),\" \")","v":" "},null,{"$f":"IF(C159>0,(VLOOKUP($C159,Inscription!$A$12:$G$211,5,FALSE)),\" \")","v":" "},{"$f":"IF(C159>0,(VLOOKUP($C159,Inscription!$A$12:$G$211,7,FALSE)),\" \")","v":" "},{"$f":"LEFT(IF(C159>0,(VLOOKUP($C159,Inscription!$A$12:$G$211,6,FALSE)),\" \"),8)","v":" "},{"$f":"IF(COUNTIF($F$4:$F159,$F159)<2,$F159,\" \")","v":" "},155,{"$f":"IF(I159=F159,#REF!,\"\")","v":{"$error":"#REF!"}},{"$f":"IF(COUNTIF($F$4:$F159,$F159)<3,$F159,\" \")","v":" "},155,{"$f":"IF(L159=$F159,#REF!,\"\")","v":{"$error":"#REF!"}},"",1000,{"$f":"IF(O159=$F159,#REF!,1000)","v":1000},{"$f":"IF(COUNTIF($F$4:$F159,I159)<4,$F159,\" \")","v":" "},155,{"$f":"IF(R159=$F159,#REF!,\"\")","v":{"$error":"#REF!"}},"","","",{"$f":"IF(V159=$F159,#REF!,\"\")","v":""}," ",155]
[156,156,null,{"$f":"IF(C160>0,CONCATENATE((VLOOKUP($C160,Inscription!$A$12:$G$211,3,FALSE)),\"   \",(VLOOKUP($C160,Inscription!$A$12:$G$211,4,FALSE))),\" \")","v":" "},null,{"$f":"IF(C160>0,(VLOOKUP($C160,Inscription!$A$12:$G$211,5,FALSE)),\" \")","v":" "},{"$f":"IF(C160>0,(VLOOKUP($C160,Inscription!$A$12:$G$211,7,FALSE)),\" \")","v":" "},{"$f":"LEFT(IF(C160>0,(VLOOKUP($C160,Inscription!$A$12:$G$211,6,FALSE)),\" \"),8)","v":" "},{"$f":"IF(COUNTIF($F$4:$F160,$F160)<2,$F160,\" \")","v":" "},156,{"$f":"IF(I160=F160,#REF!,\"\")","v":{"$error":"#REF!"}},{"$f":"IF(COUNTIF($F$4:$F160,$F160)<3,$F160,\" \")","v":" "},156,{"$f":"IF(L160=$F160,#REF!,\"\")","v":{"$error":"#REF!"}},"",1000,{"$f":"IF(O160=$F160,#REF!,1000)","v":1000},{"$f":"IF(COUNTIF($F$4:$F160,I160)<4,$F160,\" \")","v":" "},156,{"$f":"IF(R160=$F160,#REF!,\"\")","v":{"$error":"#REF!"}},"","","",{"$f":"IF(V160=$F160,#REF!,\"\")","v":""}," ",156]
[157,157,null,{"$f":"IF(C161>0,CONCATENATE((VLOOKUP($C161,Inscription!$A$12:$G$211,3,FALSE)),\"   \",(VLOOKUP($C161,Inscription!$A$12:$G$211,4,FALSE))),\" \")","v":" "},null,{"$f":"IF(C161>0,(VLOOKUP($C161,Inscription!$A$12:$G$211,5,FALSE)),\" \")","v":" "},{"$f":"IF(C161>0,(VLOOKUP($C161,Inscription!$A$12:$G$211,7,FALSE)),\" \")","v":" "},{"$f":"LEFT(IF(C161>0,(VLOOKUP($C161,Inscription!$A$12:$G$211,6,FALSE)),\" \"),8)","v":" "},{"$f":"IF(COUNTIF($F$4:$F161,$F161)<2,$F161,\" \")","v":" "},157,{"$f":"IF(I161=F161,#REF!,\"\")","v":{"$error":"#REF!"}},{"$f":"IF(COUNTIF($F$4:$F161,$F161)<3,$F161,\" \")","v":" "},157,{"$f":"IF(L161=$F161,#REF!,\"\")","v":{"$error":"#REF!"}},"",1000,{"$f":"IF(O161=$F161,#REF!,1000)","v":1000},{"$f":"IF(COUNTIF($F$4:$F161,I161)<4,$F161,\" \")","v":" "},157,{"$f":"IF(R161=$F161,#REF!,\"\")","v":{"$error":"#REF!"}},"","","",{"$f":"IF(V161=$F161,#REF!,\"\")","v":""}," ",157]
[158,158,null,{"$f":"IF(C162>0,CONCATENATE((VLOOKUP($C162,Inscription!$A$12:$G$211,3,FALSE)),\"   \",(VLOOKUP($C162,Inscription!$A$12:$G$211,4,FALSE))),\" \")","v":" "},null,{"$f":"IF(C162>0,(VLOOKUP($C162,Inscription!$A$12:$G$211,5,FALSE)),\" \")","v":" "},{"$f":"IF(C162>0,(VLOOKUP($C162,Inscription!$A$12:$G$211,7,FALSE)),\" \")","v":" "},{"$f":"LEFT(IF(C162>0,(VLOOKUP($C162,Inscription!$A$12:$G$211,6,FALSE)),\" \"),8)","v":" "},{"$f":"IF(COUNTIF($F$4:$F162,$F162)<2,$F162,\" \")","v":" "},158,{"$f":"IF(I162=F162,#REF!,\"\")","v":{"$error":"#REF!"}},{"$f":"IF(COUNTIF($F$4:$F162,$F162)<3,$F162,\" \")","v":" "},158,{"$f":"IF(L162=$F162,#REF!,\"\")","v":{"$error":"#REF!"}},"",1000,{"$f":"IF(O162=$F162,#REF!,1000)","v":1000},{"$f":"IF(COUNTIF($F$4:$F162,I162)<4,$F162,\" \")","v":" "},158,{"$f":"IF(R162=$F162,#REF!,\"\")","v":{"$error":"#REF!"}},"","","",{"$f":"IF(V162=$F162,#REF!,\"\")","v":""}," ",158]
[159,159,null,{"$f":"IF(C163>0,CONCATENATE((VLOOKUP($C163,Inscription!$A$12:$G$211,3,FALSE)),\"   \",(VLOOKUP($C163,Inscription!$A$12:$G$211,4,FALSE))),\" \")","v":" "},null,{"$f":"IF(C163>0,(VLOOKUP($C163,Inscription!$A$12:$G$211,5,FALSE)),\" \")","v":" "},{"$f":"IF(C163>0,(VLOOKUP($C163,Inscription!$A$12:$G$211,7,FALSE)),\" \")","v":" "},{"$f":"LEFT(IF(C163>0,(VLOOKUP($C163,Inscription!$A$12:$G$211,6,FALSE)),\" \"),8)","v":" "},{"$f":"IF(COUNTIF($F$4:$F163,$F163)<2,$F163,\" \")","v":" "},159,{"$f":"IF(I163=F163,#REF!,\"\")","v":{"$error":"#REF!"}},{"$f":"IF(COUNTIF($F$4:$F163,$F163)<3,$F163,\" \")","v":" "},159,{"$f":"IF(L163=$F163,#REF!,\"\")","v":{"$error":"#REF!"}},"",1000,{"$f":"IF(O163=$F163,#REF!,1000)","v":1000},{"$f":"IF(COUNTIF($F$4:$F163,I163)<4,$F163,\" \")","v":" "},159,{"$f":"IF(R163=$F163,#REF!,\"\")","v":{"$error":"#REF!"}},"","","",{"$f":"IF(V163=$F163,#REF!,\"\")","v":""}," ",159]
[160,160,null,{"$f":"IF(C164>0,CONCATENATE((VLOOKUP($C164,Inscription!$A$12:$G$211,3,FALSE)),\"   \",(VLOOKUP($C164,Inscription!$A$12:$G$211,4,FALSE))),\" \")","v":" "},null,{"$f":"IF(C164>0,(VLOOKUP($C164,Inscription!$A$12:$G$211,5,FALSE)),\" \")","v":" "},{"$f":"IF(C164>0,(VLOOKUP($C164,Inscription!$A$12:$G$211,7,FALSE)),\" \")","v":" "},{"$f":"LEFT(IF(C164>0,(VLOOKUP($C164,Inscription!$A$12:$G$211,6,FALSE)),\" \"),8)","v":" "},{"$f":"IF(COUNTIF($F$4:$F164,$F164)<2,$F164,\" \")","v":" "},160,{"$f":"IF(I164=F164,#REF!,\"\")","v":{"$error":"#REF!"}},{"$f":"IF(COUNTIF($F$4:$F164,$F164)<3,$F164,\" \")","v":" "},160,{"$f":"IF(L164=$F164,#REF!,\"\")","v":{"$error":"#REF!"}},"",1000,{"$f":"IF(O164=$F164,#REF!,1000)","v":1000},{"$f":"IF(COUNTIF($F$4:$F164,I164)<4,$F164,\" \")","v":" "},160,{"$f":"IF(R164=$F164,#REF!,\"\")","v":{"$error":"#REF!"}},"","","",{"$f":"IF(V164=$F164,#REF!,\"\")","v":""}," ",160]
[161,161,null,{"$f":"IF(C165>0,CONCATENATE((VLOOKUP($C165,Inscription!$A$12:$G$211,3,FALSE)),\"   \",(VLOOKUP($C165,Inscription!$A$12:$G$211,4,FALSE))),\" \")","v":" "},null,{"$f":"IF(C165>0,(VLOOKUP($C165,Inscription!$A$12:$G$211,5,FALSE)),\" \")","v":" "},{"$f":"IF(C165>0,(VLOOKUP($C165,Inscription!$A$12:$G$211,7,FALSE)),\" \")","v":" "},{"$f":"LEFT(IF(C165>0,(VLOOKUP($C165,Inscription!$A$12:$G$211,6,FALSE)),\" \"),8)","v":" "},{"$f":"IF(COUNTIF($F$4:$F165,$F165)<2,$F165,\" \")","v":" "},161,{"$f":"IF(I165=F165,#REF!,\"\")","v":{"$error":"#REF!"}},{"$f":"IF(COUNTIF($F$4:$F165,$F165)<3,$F165,\" \")","v":" "},161,{"$f":"IF(L165=$F165,#REF!,\"\")","v":{"$error":"#REF!"}},"",1000,{"$f":"IF(O165=$F165,#REF!,1000)","v":1000},{"$f":"IF(COUNTIF($F$4:$F165,I165)<4,$F165,\" \")","v":" "},161,{"$f":"IF(R165=$F165,#REF!,\"\")","v":{"$error":"#REF!"}},"","","",{"$f":"IF(V165=$F165,#REF!,\"\")","v":""}," ",161]
[162,162,null,{"$f":"IF(C166>0,CONCATENATE((VLOOKUP($C166,Inscription!$A$12:$G$211,3,FALSE)),\"   \",(VLOOKUP($C166,Inscription!$A$12:$G$211,4,FALSE))),\" \")","v":" "},null,{"$f":"IF(C166>0,(VLOOKUP($C166,Inscription!$A$12:$G$211,5,FALSE)),\" \")","v":" "},{"$f":"IF(C166>0,(VLOOKUP($C166,Inscription!$A$12:$G$211,7,FALSE)),\" \")","v":" "},{"$f":"LEFT(IF(C166>0,(VLOOKUP($C166,Inscription!$A$12:$G$211,6,FALSE)),\" \"),8)","v":" "},{"$f":"IF(COUNTIF($F$4:$F166,$F166)<2,$F166,\" \")","v":" "},162,{"$f":"IF(I166=F166,#REF!,\"\")","v":{"$error":"#REF!"}},{"$f":"IF(COUNTIF($F$4:$F166,$F166)<3,$F166,\" \")","v":" "},162,{"$f":"IF(L166=$F166,#REF!,\"\")","v":{"$error":"#REF!"}},"",1000,{"$f":"IF(O166=$F166,#REF!,1000)","v":1000},{"$f":"IF(COUNTIF($F$4:$F166,I166)<4,$F166,\" \")","v":" "},162,{"$f":"IF(R166=$F166,#REF!,\"\")","v":{"$error":"#REF!"}},"","","",{"$f":"IF(V166=$F166,#REF!,\"\")","v":""}," ",162]
[163,163,null,{"$f":"IF(C167>0,CONCATENATE((VLOOKUP($C167,Inscription!$A$12:$G$211,3,FALSE)),\"   \",(VLOOKUP($C167,Inscription!$A$12:$G$211,4,FALSE))),\" \")","v":" "},null,{"$f":"IF(C167>0,(VLOOKUP($C167,Inscription!$A$12:$G$211,5,FALSE)),\" \")","v":" "},{"$f":"IF(C167>0,(VLOOKUP($C167,Inscription!$A$12:$G$211,7,FALSE)),\" \")","v":" "},{"$f":"LEFT(IF(C167>0,(VLOOKUP($C167,Inscription!$A$12:$G$211,6,FALSE)),\" \"),8)","v":" "},{"$f":"IF(COUNTIF($F$4:$F167,$F167)<2,$F167,\" \")","v":" "},163,{"$f":"IF(I167=F167,#REF!,\"\")","v":{"$error":"#REF!"}},{"$f":"IF(COUNTIF($F$4:$F167,$F167)<3,$F167,\" \")","v":" "},163,{"$f":"IF(L167=$F167,#REF!,\"\")","v":{"$error":"#REF!"}},"",1000,{"$f":"IF(O167=$F167,#REF!,1000)","v":1000},{"$f":"IF(COUNTIF($F$4:$F167,I167)<4,$F167,\" \")","v":" "},163,{"$f":"IF(R167=$F167,#REF!,\"\")","v":{"$error":"#REF!"}},"","","",{"$f":"IF(V167=$F167,#REF!,\"\")","v":""}," ",163]
[164,164,null,{"$f":"IF(C168>0,CONCATENATE((VLOOKUP($C168,Inscription!$A$12:$G$211,3,FALSE)),\"   \",(VLOOKUP($C168,Inscription!$A$12:$G$211,4,FALSE))),\" \")","v":" "},null,{"$f":"IF(C168>0,(VLOOKUP($C168,Inscription!$A$12:$G$211,5,FALSE)),\" \")","v":" "},{"$f":"IF(C168>0,(VLOOKUP($C168,Inscription!$A$12:$G$211,7,FALSE)),\" \")","v":" "},{"$f":"LEFT(IF(C168>0,(VLOOKUP($C168,Inscription!$A$12:$G$211,6,FALSE)),\" \"),8)","v":" "},{"$f":"IF(COUNTIF($F$4:$F168,$F168)<2,$F168,\" \")","v":" "},164,{"$f":"IF(I168=F168,#REF!,\"\")","v":{"$error":"#REF!"}},{"$f":"IF(COUNTIF($F$4:$F168,$F168)<3,$F168,\" \")","v":" "},164,{"$f":"IF(L168=$F168,#REF!,\"\")","v":{"$error":"#REF!"}},"",1000,{"$f":"IF(O168=$F168,#REF!,1000)","v":1000},{"$f":"IF(COUNTIF($F$4:$F168,I168)<4,$F168,\" \")","v":" "},164,{"$f":"IF(R168=$F168,#REF!,\"\")","v":{"$error":"#REF!"}},"","","",{"$f":"IF(V168=$F168,#REF!,\"\")","v":""}," ",164]
[165,165,null,{"$f":"IF(C169>0,CONCATENATE((VLOOKUP($C169,Inscription!$A$12:$G$211,3,FALSE)),\"   \",(VLOOKUP($C169,Inscription!$A$12:$G$211,4,FALSE))),\" \")","v":" "},null,{"$f":"IF(C169>0,(VLOOKUP($C169,Inscription!$A$12:$G$211,5,FALSE)),\" \")","v":" "},{"$f":"IF(C169>0,(VLOOKUP($C169,Inscription!$A$12:$G$211,7,FALSE)),\" \")","v":" "},{"$f":"LEFT(IF(C169>0,(VLOOKUP($C169,Inscription!$A$12:$G$211,6,FALSE)),\" \"),8)","v":" "},{"$f":"IF(COUNTIF($F$4:$F169,$F169)<2,$F169,\" \")","v":" "},165,{"$f":"IF(I169=F169,#REF!,\"\")","v":{"$error":"#REF!"}},{"$f":"IF(COUNTIF($F$4:$F169,$F169)<3,$F169,\" \")","v":" "},165,{"$f":"IF(L169=$F169,#REF!,\"\")","v":{"$error":"#REF!"}},"",1000,{"$f":"IF(O169=$F169,#REF!,1000)","v":1000},{"$f":"IF(COUNTIF($F$4:$F169,I169)<4,$F169,\" \")","v":" "},165,{"$f":"IF(R169=$F169,#REF!,\"\")","v":{"$error":"#REF!"}},"","","",{"$f":"IF(V169=$F169,#REF!,\"\")","v":""}," ",165]
[166,166,null,{"$f":"IF(C170>0,CONCATENATE((VLOOKUP($C170,Inscription!$A$12:$G$211,3,FALSE)),\"   \",(VLOOKUP($C170,Inscription!$A$12:$G$211,4,FALSE))),\" \")","v":" "},null,{"$f":"IF(C170>0,(VLOOKUP($C170,Inscription!$A$12:$G$211,5,FALSE)),\" \")","v":" "},{"$f":"IF(C170>0,(VLOOKUP($C170,Inscription!$A$12:$G$211,7,FALSE)),\" \")","v":" "},{"$f":"LEFT(IF(C170>0,(VLOOKUP($C170,Inscription!$A$12:$G$211,6,FALSE)),\" \"),8)","v":" "},{"$f":"IF(COUNTIF($F$4:$F170,$F170)<2,$F170,\" \")","v":" "},166,{"$f":"IF(I170=F170,#REF!,\"\")","v":{"$error":"#REF!"}},{"$f":"IF(COUNTIF($F$4:$F170,$F170)<3,$F170,\" \")","v":" "},166,{"$f":"IF(L170=$F170,#REF!,\"\")","v":{"$error":"#REF!"}},"",1000,{"$f":"IF(O170=$F170,#REF!,1000)","v":1000},{"$f":"IF(COUNTIF($F$4:$F170,I170)<4,$F170,\" \")","v":" "},166,{"$f":"IF(R170=$F170,#REF!,\"\")","v":{"$error":"#REF!"}},"","","",{"$f":"IF(V170=$F170,#REF!,\"\")","v":""}," ",166]
[167,167,null,{"$f":"IF(C171>0,CONCATENATE((VLOOKUP($C171,Inscription!$A$12:$G$211,3,FALSE)),\"   \",(VLOOKUP($C171,Inscription!$A$12:$G$211,4,FALSE))),\" \")","v":" "},null,{"$f":"IF(C171>0,(VLOOKUP($C171,Inscription!$A$12:$G$211,5,FALSE)),\" \")","v":" "},{"$f":"IF(C171>0,(VLOOKUP($C171,Inscription!$A$12:$G$211,7,FALSE)),\" \")","v":" "},{"$f":"LEFT(IF(C171>0,(VLOOKUP($C171,Inscription!$A$12:$G$211,6,FALSE)),\" \"),8)","v":" "},{"$f":"IF(COUNTIF($F$4:$F171,$F171)<2,$F171,\" \")","v":" "},167,{"$f":"IF(I171=F171,#REF!,\"\")","v":{"$error":"#REF!"}},{"$f":"IF(COUNTIF($F$4:$F171,$F171)<3,$F171,\" \")","v":" "},167,{"$f":"IF(L171=$F171,#REF!,\"\")","v":{"$error":"#REF!"}},"",1000,{"$f":"IF(O171=$F171,#REF!,1000)","v":1000},{"$f":"IF(COUNTIF($F$4:$F171,I171)<4,$F171,\" \")","v":" "},167,{"$f":"IF(R171=$F171,#REF!,\"\")","v":{"$error":"#REF!"}},"","","",{"$f":"IF(V171=$F171,#REF!,\"\")","v":""}," ",167]
[168,168,null,{"$f":"IF(C172>0,CONCATENATE((VLOOKUP($C172,Inscription!$A$12:$G$211,3,FALSE)),\"   \",(VLOOKUP($C172,Inscription!$A$12:$G$211,4,FALSE))),\" \")","v":" "},null,{"$f":"IF(C172>0,(VLOOKUP($C172,Inscription!$A$12:$G$211,5,FALSE)),\" \")","v":" "},{"$f":"IF(C172>0,(VLOOKUP($C172,Inscription!$A$12:$G$211,7,FALSE)),\" \")","v":" "},{"$f":"LEFT(IF(C172>0,(VLOOKUP($C172,Inscription!$A$12:$G$211,6,FALSE)),\" \"),8)","v":" "},{"$f":"IF(COUNTIF($F$4:$F172,$F172)<2,$F172,\" \")","v":" "},168,{"$f":"IF(I172=F172,#REF!,\"\")","v":{"$error":"#REF!"}},{"$f":"IF(COUNTIF($F$4:$F172,$F172)<3,$F172,\" \")","v":" "},168,{"$f":"IF(L172=$F172,#REF!,\"\")","v":{"$error":"#REF!"}},"",1000,{"$f":"IF(O172=$F172,#REF!,1000)","v":1000},{"$f":"IF(COUNTIF($F$4:$F172,I172)<4,$F172,\" \")","v":" "},168,{"$f":"IF(R172=$F172,#REF!,\"\")","v":{"$error":"#REF!"}},"","","",{"$f":"IF(V172=$F172,#REF!,\"\")","v":""}," ",168]
[169,169,null,{"$f":"IF(C173>0,CONCATENATE((VLOOKUP($C173,Inscription!$A$12:$G$211,3,FALSE)),\"   \",(VLOOKUP($C173,Inscription!$A$12:$G$211,4,FALSE))),\" \")","v":" "},null,{"$f":"IF(C173>0,(VLOOKUP($C173,Inscription!$A$12:$G$211,5,FALSE)),\" \")","v":" "},{"$f":"IF(C173>0,(VLOOKUP($C173,Inscription!$A$12:$G$211,7,FALSE)),\" \")","v":" "},{"$f":"LEFT(IF(C173>0,(VLOOKUP($C173,Inscription!$A$12:$G$211,6,FALSE)),\" \"),8)","v":" "},{"$f":"IF(COUNTIF($F$4:$F173,$F173)<2,$F173,\" \")","v":" "},169,{"$f":"IF(I173=F173,#REF!,\"\")","v":{"$error":"#REF!"}},{"$f":"IF(COUNTIF($F$4:$F173,$F173)<3,$F173,\" \")","v":" "},169,{"$f":"IF(L173=$F173,#REF!,\"\")","v":{"$error":"#REF!"}},"",1000,{"$f":"IF(O173=$F173,#REF!,1000)","v":1000},{"$f":"IF(COUNTIF($F$4:$F173,I173)<4,$F173,\" \")","v":" "},169,{"$f":"IF(R173=$F173,#REF!,\"\")","v":{"$error":"#REF!"}},"","","",{"$f":"IF(V173=$F173,#REF!,\"\")","v":""}," ",169]
[170,170,null,{"$f":"IF(C174>0,CONCATENATE((VLOOKUP($C174,Inscription!$A$12:$G$211,3,FALSE)),\"   \",(VLOOKUP($C174,Inscription!$A$12:$G$211,4,FALSE))),\" \")","v":" "},null,{"$f":"IF(C174>0,(VLOOKUP($C174,Inscription!$A$12:$G$211,5,FALSE)),\" \")","v":" "},{"$f":"IF(C174>0,(VLOOKUP($C174,Inscription!$A$12:$G$211,7,FALSE)),\" \")","v":" "},{"$f":"LEFT(IF(C174>0,(VLOOKUP($C174,Inscription!$A$12:$G$211,6,FALSE)),\" \"),8)","v":" "},{"$f":"IF(COUNTIF($F$4:$F174,$F174)<2,$F174,\" \")","v":" "},170,{"$f":"IF(I174=F174,#REF!,\"\")","v":{"$error":"#REF!"}},{"$f":"IF(COUNTIF($F$4:$F174,$F174)<3,$F174,\" \")","v":" "},170,{"$f":"IF(L174=$F174,#REF!,\"\")","v":{"$error":"#REF!"}},"",1000,{"$f":"IF(O174=$F174,#REF!,1000)","v":1000},{"$f":"IF(COUNTIF($F$4:$F174,I174)<4,$F174,\" \")","v":" "},170,{"$f":"IF(R174=$F174,#REF!,\"\")","v":{"$error":"#REF!"}},"","","",{"$f":"IF(V174=$F174,#REF!,\"\")","v":""}," ",170]
[171,171,null,{"$f":"IF(C175>0,CONCATENATE((VLOOKUP($C175,Inscription!$A$12:$G$211,3,FALSE)),\"   \",(VLOOKUP($C175,Inscription!$A$12:$G$211,4,FALSE))),\" \")","v":" "},null,{"$f":"IF(C175>0,(VLOOKUP($C175,Inscription!$A$12:$G$211,5,FALSE)),\" \")","v":" "},{"$f":"IF(C175>0,(VLOOKUP($C175,Inscription!$A$12:$G$211,7,FALSE)),\" \")","v":" "},{"$f":"LEFT(IF(C175>0,(VLOOKUP($C175,Inscription!$A$12:$G$211,6,FALSE)),\" \"),8)","v":" "},{"$f":"IF(COUNTIF($F$4:$F175,$F175)<2,$F175,\" \")","v":" "},171,{"$f":"IF(I175=F175,#REF!,\"\")","v":{"$error":"#REF!"}},{"$f":"IF(COUNTIF($F$4:$F175,$F175)<3,$F175,\" \")","v":" "},171,{"$f":"IF(L175=$F175,#REF!,\"\")","v":{"$error":"#REF!"}},"",1000,{"$f":"IF(O175=$F175,#REF!,1000)","v":1000},{"$f":"IF(COUNTIF($F$4:$F175,I175)<4,$F175,\" \")","v":" "},171,{"$f":"IF(R175=$F175,#REF!,\"\")","v":{"$error":"#REF!"}},"","","",{"$f":"IF(V175=$F175,#REF!,\"\")","v":""}," ",171]
[172,172,null,{"$f":"IF(C176>0,CONCATENATE((VLOOKUP($C176,Inscription!$A$12:$G$211,3,FALSE)),\"   \",(VLOOKUP($C176,Inscription!$A$12:$G$211,4,FALSE))),\" \")","v":" "},null,{"$f":"IF(C176>0,(VLOOKUP($C176,Inscription!$A$12:$G$211,5,FALSE)),\" \")","v":" "},{"$f":"IF(C176>0,(VLOOKUP($C176,Inscription!$A$12:$G$211,7,FALSE)),\" \")","v":" "},{"$f":"LEFT(IF(C176>0,(VLOOKUP($C176,Inscription!$A$12:$G$211,6,FALSE)),\" \"),8)","v":" "},{"$f":"IF(COUNTIF($F$4:$F176,$F176)<2,$F176,\" \")","v":" "},172,{"$f":"IF(I176=F176,#REF!,\"\")","v":{"$error":"#REF!"}},{"$f":"IF(COUNTIF($F$4:$F176,$F176)<3,$F176,\" \")","v":" "},172,{"$f":"IF(L176=$F176,#REF!,\"\")","v":{"$error":"#REF!"}},"",1000,{"$f":"IF(O176=$F176,#REF!,1000)","v":1000},{"$f":"IF(COUNTIF($F$4:$F176,I176)<4,$F176,\" \")","v":" "},172,{"$f":"IF(R176=$F176,#REF!,\"\")","v":{"$error":"#REF!"}},"","","",{"$f":"IF(V176=$F176,#REF!,\"\")","v":""}," ",172]
[173,173,null,{"$f":"IF(C177>0,CONCATENATE((VLOOKUP($C177,Inscription!$A$12:$G$211,3,FALSE)),\"   \",(VLOOKUP($C177,Inscription!$A$12:$G$211,4,FALSE))),\" \")","v":" "},null,{"$f":"IF(C177>0,(VLOOKUP($C177,Inscription!$A$12:$G$211,5,FALSE)),\" \")","v":" "},{"$f":"IF(C177>0,(VLOOKUP($C177,Inscription!$A$12:$G$211,7,FALSE)),\" \")","v":" "},{"$f":"LEFT(IF(C177>0,(VLOOKUP($C177,Inscription!$A$12:$G$211,6,FALSE)),\" \"),8)","v":" "},{"$f":"IF(COUNTIF($F$4:$F177,$F177)<2,$F177,\" \")","v":" "},173,{"$f":"IF(I177=F177,#REF!,\"\")","v":{"$error":"#REF!"}},{"$f":"IF(COUNTIF($F$4:$F177,$F177)<3,$F177,\" \")","v":" "},173,{"$f":"IF(L177=$F177,#REF!,\"\")","v":{"$error":"#REF!"}},"",1000,{"$f":"IF(O177=$F177,#REF!,1000)","v":1000},{"$f":"IF(COUNTIF($F$4:$F177,I177)<4,$F177,\" \")","v":" "},173,{"$f":"IF(R177=$F177,#REF!,\"\")","v":{"$error":"#REF!"}},"","","",{"$f":"IF(V177=$F177,#REF!,\"\")","v":""}," ",173]
[174,174,null,{"$f":"IF(C178>0,CONCATENATE((VLOOKUP($C178,Inscription!$A$12:$G$211,3,FALSE)),\"   \",(VLOOKUP($C178,Inscription!$A$12:$G$211,4,FALSE))),\" \")","v":" "},null,{"$f":"IF(C178>0,(VLOOKUP($C178,Inscription!$A$12:$G$211,5,FALSE)),\" \")","v":" "},{"$f":"IF(C178>0,(VLOOKUP($C178,Inscription!$A$12:$G$211,7,FALSE)),\" \")","v":" "},{"$f":"LEFT(IF(C178>0,(VLOOKUP($C178,Inscription!$A$12:$G$211,6,FALSE)),\" \"),8)","v":" "},{"$f":"IF(COUNTIF($F$4:$F178,$F178)<2,$F178,\" \")","v":" "},174,{"$f":"IF(I178=F178,#REF!,\"\")","v":{"$error":"#REF!"}},{"$f":"IF(COUNTIF($F$4:$F178,$F178)<3,$F178,\" \")","v":" "},174,{"$f":"IF(L178=$F178,#REF!,\"\")","v":{"$error":"#REF!"}},"",1000,{"$f":"IF(O178=$F178,#REF!,1000)","v":1000},{"$f":"IF(COUNTIF($F$4:$F178,I178)<4,$F178,\" \")","v":" "},174,{"$f":"IF(R178=$F178,#REF!,\"\")","v":{"$error":"#REF!"}},"","","",{"$f":"IF(V178=$F178,#REF!,\"\")","v":""}," ",174]
[175,175,null,{"$f":"IF(C179>0,CONCATENATE((VLOOKUP($C179,Inscription!$A$12:$G$211,3,FALSE)),\"   \",(VLOOKUP($C179,Inscription!$A$12:$G$211,4,FALSE))),\" \")","v":" "},null,{"$f":"IF(C179>0,(VLOOKUP($C179,Inscription!$A$12:$G$211,5,FALSE)),\" \")","v":" "},{"$f":"IF(C179>0,(VLOOKUP($C179,Inscription!$A$12:$G$211,7,FALSE)),\" \")","v":" "},{"$f":"LEFT(IF(C179>0,(VLOOKUP($C179,Inscription!$A$12:$G$211,6,FALSE)),\" \"),8)","v":" "},{"$f":"IF(COUNTIF($F$4:$F179,$F179)<2,$F179,\" \")","v":" "},175,{"$f":"IF(I179=F179,#REF!,\"\")","v":{"$error":"#REF!"}},{"$f":"IF(COUNTIF($F$4:$F179,$F179)<3,$F179,\" \")","v":" "},175,{"$f":"IF(L179=$F179,#REF!,\"\")","v":{"$error":"#REF!"}},"",1000,{"$f":"IF(O179=$F179,#REF!,1000)","v":1000},{"$f":"IF(COUNTIF($F$4:$F179,I179)<4,$F179,\" \")","v":" "},175,{"$f":"IF(R179=$F179,#REF!,\"\")","v":{"$error":"#REF!"}},"","","",{"$f":"IF(V179=$F179,#REF!,\"\")","v":""}," ",175]
[176,176,null,{"$f":"IF(C180>0,CONCATENATE((VLOOKUP($C180,Inscription!$A$12:$G$211,3,FALSE)),\"   \",(VLOOKUP($C180,Inscription!$A$12:$G$211,4,FALSE))),\" \")","v":" "},null,{"$f":"IF(C180>0,(VLOOKUP($C180,Inscription!$A$12:$G$211,5,FALSE)),\" \")","v":" "},{"$f":"IF(C180>0,(VLOOKUP($C180,Inscription!$A$12:$G$211,7,FALSE)),\" \")","v":" "},{"$f":"LEFT(IF(C180>0,(VLOOKUP($C180,Inscription!$A$12:$G$211,6,FALSE)),\" \"),8)","v":" "},{"$f":"IF(COUNTIF($F$4:$F180,$F180)<2,$F180,\" \")","v":" "},{"$f":"IF(I180=F180,A180,\"\")","v":176},{"$f":"IF(I180=F180,#REF!,\"\")","v":{"$error":"#REF!"}},{"$f":"IF(COUNTIF($F$4:$F180,$F180)<3,$F180,\" \")","v":" "},176,{"$f":"IF(L180=$F180,#REF!,\"\")","v":{"$error":"#REF!"}},"",1000,{"$f":"IF(O180=$F180,#REF!,1000)","v":1000},{"$f":"IF(COUNTIF($F$4:$F180,I180)<4,$F180,\" \")","v":" "},176,{"$f":"IF(R180=$F180,#REF!,\"\")","v":{"$error":"#REF!"}},"","","",{"$f":"IF(V180=$F180,#REF!,\"\")","v":""}," ",176]
[177,177,null,{"$f":"IF(C181>0,CONCATENATE((VLOOKUP($C181,Inscription!$A$12:$G$211,3,FALSE)),\"   \",(VLOOKUP($C181,Inscription!$A$12:$G$211,4,FALSE))),\" \")","v":" "},null,{"$f":"IF(C181>0,(VLOOKUP($C181,Inscription!$A$12:$G$211,5,FALSE)),\" \")","v":" "},{"$f":"IF(C181>0,(VLOOKUP($C181,Inscription!$A$12:$G$211,7,FALSE)),\" \")","v":" "},{"$f":"LEFT(IF(C181>0,(VLOOKUP($C181,Inscription!$A$12:$G$211,6,FALSE)),\" \"),8)","v":" "},{"$f":"IF(COUNTIF($F$4:$F181,$F181)<2,$F181,\" \")","v":" "},177,{"$f":"IF(I181=F181,#REF!,\"\")","v":{"$error":"#REF!"}},{"$f":"IF(COUNTIF($F$4:$F181,$F181)<3,$F181,\" \")","v":" "},177,{"$f":"IF(L181=$F181,#REF!,\"\")","v":{"$error":"#REF!"}},"",1000,{"$f":"IF(O181=$F181,#REF!,1000)","v":1000},{"$f":"IF(COUNTIF($F$4:$F181,I181)<4,$F181,\" \")","v":" "},177,{"$f":"IF(R181=$F181,#REF!,\"\")","v":{"$error":"#REF!"}},"","","",{"$f":"IF(V181=$F181,#REF!,\"\")","v":""}," ",177]
[178,178,null,{"$f":"IF(C182>0,CONCATENATE((VLOOKUP($C182,Inscription!$A$12:$G$211,3,FALSE)),\"   \",(VLOOKUP($C182,Inscription!$A$12:$G$211,4,FALSE))),\" \")","v":" "},null,{"$f":"IF(C182>0,(VLOOKUP($C182,Inscription!$A$12:$G$211,5,FALSE)),\" \")","v":" "},{"$f":"IF(C182>0,(VLOOKUP($C182,Inscription!$A$12:$G$211,7,FALSE)),\" \")","v":" "},{"$f":"LEFT(IF(C182>0,(VLOOKUP($C182,Inscription!$A$12:$G$211,6,FALSE)),\" \"),8)","v":" "},{"$f":"IF(COUNTIF($F$4:$F182,$F182)<2,$F182,\" \")","v":" "},178,{"$f":"IF(I182=F182,#REF!,\"\")","v":{"$error":"#REF!"}},{"$f":"IF(COUNTIF($F$4:$F182,$F182)<3,$F182,\" \")","v":" "},178,{"$f":"IF(L182=$F182,#REF!,\"\")","v":{"$error":"#REF!"}},"",1000,{"$f":"IF(O182=$F182,#REF!,1000)","v":1000},{"$f":"IF(COUNTIF($F$4:$F182,I182)<4,$F182,\" \")","v":" "},178,{"$f":"IF(R182=$F182,#REF!,\"\")","v":{"$error":"#REF!"}},"","","",{"$f":"IF(V182=$F182,#REF!,\"\")","v":""}," ",178]
[179,179,null,{"$f":"IF(C183>0,CONCATENATE((VLOOKUP($C183,Inscription!$A$12:$G$211,3,FALSE)),\"   \",(VLOOKUP($C183,Inscription!$A$12:$G$211,4,FALSE))),\" \")","v":" "},null,{"$f":"IF(C183>0,(VLOOKUP($C183,Inscription!$A$12:$G$211,5,FALSE)),\" \")","v":" "},{"$f":"IF(C183>0,(VLOOKUP($C183,Inscription!$A$12:$G$211,7,FALSE)),\" \")","v":" "},{"$f":"LEFT(IF(C183>0,(VLOOKUP($C183,Inscription!$A$12:$G$211,6,FALSE)),\" \"),8)","v":" "},{"$f":"IF(COUNTIF($F$4:$F183,$F183)<2,$F183,\" \")","v":" "},179,{"$f":"IF(I183=F183,#REF!,\"\")","v":{"$error":"#REF!"}},{"$f":"IF(COUNTIF($F$4:$F183,$F183)<3,$F183,\" \")","v":" "},179,{"$f":"IF(L183=$F183,#REF!,\"\")","v":{"$error":"#REF!"}},"",1000,{"$f":"IF(O183=$F183,#REF!,1000)","v":1000},{"$f":"IF(COUNTIF($F$4:$F183,I183)<4,$F183,\" \")","v":" "},179,{"$f":"IF(R183=$F183,#REF!,\"\")","v":{"$error":"#REF!"}},"","","",{"$f":"IF(V183=$F183,#REF!,\"\")","v":""}," ",179]
[180,180,null,{"$f":"IF(C184>0,CONCATENATE((VLOOKUP($C184,Inscription!$A$12:$G$211,3,FALSE)),\"   \",(VLOOKUP($C184,Inscription!$A$12:$G$211,4,FALSE))),\" \")","v":" "},null,{"$f":"IF(C184>0,(VLOOKUP($C184,Inscription!$A$12:$G$211,5,FALSE)),\" \")","v":" "},{"$f":"IF(C184>0,(VLOOKUP($C184,Inscription!$A$12:$G$211,7,FALSE)),\" \")","v":" "},{"$f":"LEFT(IF(C184>0,(VLOOKUP($C184,Inscription!$A$12:$G$211,6,FALSE)),\" \"),8)","v":" "},{"$f":"IF(COUNTIF($F$4:$F184,$F184)<2,$F184,\" \")","v":" "},180,{"$f":"IF(I184=F184,#REF!,\"\")","v":{"$error":"#REF!"}},{"$f":"IF(COUNTIF($F$4:$F184,$F184)<3,$F184,\" \")","v":" "},180,{"$f":"IF(L184=$F184,#REF!,\"\")","v":{"$error":"#REF!"}},"",1000,{"$f":"IF(O184=$F184,#REF!,1000)","v":1000},{"$f":"IF(COUNTIF($F$4:$F184,I184)<4,$F184,\" \")","v":" "},180,{"$f":"IF(R184=$F184,#REF!,\"\")","v":{"$error":"#REF!"}},"","","",{"$f":"IF(V184=$F184,#REF!,\"\")","v":""}," ",180]
[{"$f":"IF(B185<1,1000,(IF(Z185=B185,B185,(20100-SUM($Z$4:$Z$204))/(COUNTIF($Z$4:$Z$204,\"T\")))))","v":181},181,null,{"$f":"IF(C185>0,CONCATENATE((VLOOKUP($C185,Inscription!$A$12:$G$211,3,FALSE)),\"   \",(VLOOKUP($C185,Inscription!$A$12:$G$211,4,FALSE))),\" \")","v":" "},null,{"$f":"IF(C185>0,(VLOOKUP($C185,Inscription!$A$12:$G$211,5,FALSE)),\" \")","v":" "},{"$f":"IF(C185>0,(VLOOKUP($C185,Inscription!$A$12:$G$211,7,FALSE)),\" \")","v":" "},{"$f":"LEFT(IF(C185>0,(VLOOKUP($C185,Inscription!$A$12:$G$211,6,FALSE)),\" \"),8)","v":" "},{"$f":"IF(COUNTIF($F$4:$F185,$F185)<2,$F185,\" \")","v":" "},181,{"$f":"IF(I185=F185,#REF!,\"\")","v":{"$error":"#REF!"}},{"$f":"IF(COUNTIF($F$4:$F185,$F185)<3,$F185,\" \")","v":" "},181,{"$f":"IF(L185=$F185,#REF!,\"\")","v":{"$error":"#REF!"}},"",1000,{"$f":"IF(O185=$F185,#REF!,1000)","v":1000},{"$f":"IF(COUNTIF($F$4:$F185,I185)<4,$F185,\" \")","v":" "},181,{"$f":"IF(R185=$F185,#REF!,\"\")","v":{"$error":"#REF!"}},"","","",{"$f":"IF(V185=$F185,#REF!,\"\")","v":""},{"$f":"IF(COUNTIF($C$4:$C$204,C185)>1,\"X\",\" \")","v":" "},{"$f":"IF(COUNTIF($B$4:$B$204,B185)>1,\"T\",B185)","v":181}]
[182,182,null,{"$f":"IF(C186>0,CONCATENATE((VLOOKUP($C186,Inscription!$A$12:$G$211,3,FALSE)),\"   \",(VLOOKUP($C186,Inscription!$A$12:$G$211,4,FALSE))),\" \")","v":" "},null,{"$f":"IF(C186>0,(VLOOKUP($C186,Inscription!$A$12:$G$211,5,FALSE)),\" \")","v":" "},{"$f":"IF(C186>0,(VLOOKUP($C186,Inscription!$A$12:$G$211,7,FALSE)),\" \")","v":" "},{"$f":"LEFT(IF(C186>0,(VLOOKUP($C186,Inscription!$A$12:$G$211,6,FALSE)),\" \"),8)","v":" "},{"$f":"IF(COUNTIF($F$4:$F186,$F186)<2,$F186,\" \")","v":" "},182,{"$f":"IF(I186=F186,#REF!,\"\")","v":{"$error":"#REF!"}},{"$f":"IF(COUNTIF($F$4:$F186,$F186)<3,$F186,\" \")","v":" "},182,{"$f":"IF(L186=$F186,#REF!,\"\")","v":{"$error":"#REF!"}},"",1000,{"$f":"IF(O186=$F186,#REF!,1000)","v":1000},{"$f":"IF(COUNTIF($F$4:$F186,I186)<4,$F186,\" \")","v":" "},182,{"$f":"IF(R186=$F186,#REF!,\"\")","v":{"$error":"#REF!"}},"","","",{"$f":"IF(V186=$F186,#REF!,\"\")","v":""}," ",182]
[183,183,null,{"$f":"IF(C187>0,CONCATENATE((VLOOKUP($C187,Inscription!$A$12:$G$211,3,FALSE)),\"   \",(VLOOKUP($C187,Inscription!$A$12:$G$211,4,FALSE))),\" \")","v":" "},null,{"$f":"IF(C187>0,(VLOOKUP($C187,Inscription!$A$12:$G$211,5,FALSE)),\" \")","v":" "},{"$f":"IF(C187>0,(VLOOKUP($C187,Inscription!$A$12:$G$211,7,FALSE)),\" \")","v":" "},{"$f":"LEFT(IF(C187>0,(VLOOKUP($C187,Inscription!$A$12:$G$211,6,FALSE)),\" \"),8)","v":" "},{"$f":"IF(COUNTIF($F$4:$F187,$F187)<2,$F187,\" \")","v":" "},183,{"$f":"IF(I187=F187,#REF!,\"\")","v":{"$error":"#REF!"}},{"$f":"IF(COUNTIF($F$4:$F187,$F187)<3,$F187,\" \")","v":" "},183,{"$f":"IF(L187=$F187,#REF!,\"\")","v":{"$error":"#REF!"}},"",1000,{"$f":"IF(O187=$F187,#REF!,1000)","v":1000},{"$f":"IF(COUNTIF($F$4:$F187,I187)<4,$F187,\" \")","v":" "},183,{"$f":"IF(R187=$F187,#REF!,\"\")","v":{"$error":"#REF!"}},"","","",{"$f":"IF(V187=$F187,#REF!,\"\")","v":""}," ",183]
[184,184,null,{"$f":"IF(C188>0,CONCATENATE((VLOOKUP($C188,Inscription!$A$12:$G$211,3,FALSE)),\"   \",(VLOOKUP($C188,Inscription!$A$12:$G$211,4,FALSE))),\" \")","v":" "},null,{"$f":"IF(C188>0,(VLOOKUP($C188,Inscription!$A$12:$G$211,5,FALSE)),\" \")","v":" "},{"$f":"IF(C188>0,(VLOOKUP($C188,Inscription!$A$12:$G$211,7,FALSE)),\" \")","v":" "},{"$f":"LEFT(IF(C188>0,(VLOOKUP($C188,Inscription!$A$12:$G$211,6,FALSE)),\" \"),8)","v":" "},{"$f":"IF(COUNTIF($F$4:$F188,$F188)<2,$F188,\" \")","v":" "},184,{"$f":"IF(I188=F188,#REF!,\"\")","v":{"$error":"#REF!"}},{"$f":"IF(COUNTIF($F$4:$F188,$F188)<3,$F188,\" \")","v":" "},184,{"$f":"IF(L188=$F188,#REF!,\"\")","v":{"$error":"#REF!"}},"",1000,{"$f":"IF(O188=$F188,#REF!,1000)","v":1000},{"$f":"IF(COUNTIF($F$4:$F188,I188)<4,$F188,\" \")","v":" "},184,{"$f":"IF(R188=$F188,#REF!,\"\")","v":{"$error":"#REF!"}},"","","",{"$f":"IF(V188=$F188,#REF!,\"\")","v":""}," ",184]
[185,185,null,{"$f":"IF(C189>0,CONCATENATE((VLOOKUP($C189,Inscription!$A$12:$G$211,3,FALSE)),\"   \",(VLOOKUP($C189,Inscription!$A$12:$G$211,4,FALSE))),\" \")","v":" "},null,{"$f":"IF(C189>0,(VLOOKUP($C189,Inscription!$A$12:$G$211,5,FALSE)),\" \")","v":" "},{"$f":"IF(C189>0,(VLOOKUP($C189,Inscription!$A$12:$G$211,7,FALSE)),\" \")","v":" "},{"$f":"LEFT(IF(C189>0,(VLOOKUP($C189,Inscription!$A$12:$G$211,6,FALSE)),\" \"),8)","v":" "},{"$f":"IF(COUNTIF($F$4:$F189,$F189)<2,$F189,\" \")","v":" "},185,{"$f":"IF(I189=F189,#REF!,\"\")","v":{"$error":"#REF!"}},{"$f":"IF(COUNTIF($F$4:$F189,$F189)<3,$F189,\" \")","v":" "},185,{"$f":"IF(L189=$F189,#REF!,\"\")","v":{"$error":"#REF!"}},"",1000,{"$f":"IF(O189=$F189,#REF!,1000)","v":1000},{"$f":"IF(COUNTIF($F$4:$F189,I189)<4,$F189,\" \")","v":" "},185,{"$f":"IF(R189=$F189,#REF!,\"\")","v":{"$error":"#REF!"}},"","","",{"$f":"IF(V189=$F189,#REF!,\"\")","v":""}," ",185]
[186,186,null,{"$f":"IF(C190>0,CONCATENATE((VLOOKUP($C190,Inscription!$A$12:$G$211,3,FALSE)),\"   \",(VLOOKUP($C190,Inscription!$A$12:$G$211,4,FALSE))),\" \")","v":" "},null,{"$f":"IF(C190>0,(VLOOKUP($C190,Inscription!$A$12:$G$211,5,FALSE)),\" \")","v":" "},{"$f":"IF(C190>0,(VLOOKUP($C190,Inscription!$A$12:$G$211,7,FALSE)),\" \")","v":" "},{"$f":"LEFT(IF(C190>0,(VLOOKUP($C190,Inscription!$A$12:$G$211,6,FALSE)),\" \"),8)","v":" "},{"$f":"IF(COUNTIF($F$4:$F190,$F190)<2,$F190,\" \")","v":" "},186,{"$f":"IF(I190=F190,#REF!,\"\")","v":{"$error":"#REF!"}},{"$f":"IF(COUNTIF($F$4:$F190,$F190)<3,$F190,\" \")","v":" "},186,{"$f":"IF(L190=$F190,#REF!,\"\")","v":{"$error":"#REF!"}},"",1000,{"$f":"IF(O190=$F190,#REF!,1000)","v":1000},{"$f":"IF(COUNTIF($F$4:$F190,I190)<4,$F190,\" \")","v":" "},186,{"$f":"IF(R190=$F190,#REF!,\"\")","v":{"$error":"#REF!"}},"","","",{"$f":"IF(V190=$F190,#REF!,\"\")","v":""}," ",186]
[187,187,null,{"$f":"IF(C191>0,CONCATENATE((VLOOKUP($C191,Inscription!$A$12:$G$211,3,FALSE)),\"   \",(VLOOKUP($C191,Inscription!$A$12:$G$211,4,FALSE))),\" \")","v":" "},null,{"$f":"IF(C191>0,(VLOOKUP($C191,Inscription!$A$12:$G$211,5,FALSE)),\" \")","v":" "},{"$f":"IF(C191>0,(VLOOKUP($C191,Inscription!$A$12:$G$211,7,FALSE)),\" \")","v":" "},{"$f":"LEFT(IF(C191>0,(VLOOKUP($C191,Inscription!$A$12:$G$211,6,FALSE)),\" \"),8)","v":" "},{"$f":"IF(COUNTIF($F$4:$F191,$F191)<2,$F191,\" \")","v":" "},187,{"$f":"IF(I191=F191,#REF!,\"\")","v":{"$error":"#REF!"}},{"$f":"IF(COUNTIF($F$4:$F191,$F191)<3,$F191,\" \")","v":" "},187,{"$f":"IF(L191=$F191,#REF!,\"\")","v":{"$error":"#REF!"}},"",1000,{"$f":"IF(O191=$F191,#REF!,1000)","v":1000},{"$f":"IF(COUNTIF($F$4:$F191,I191)<4,$F191,\" \")","v":" "},187,{"$f":"IF(R191=$F191,#REF!,\"\")","v":{"$error":"#REF!"}},"","","",{"$f":"IF(V191=$F191,#REF!,\"\")","v":""}," ",187]
[188,188,null,{"$f":"IF(C192>0,CONCATENATE((VLOOKUP($C192,Inscription!$A$12:$G$211,3,FALSE)),\"   \",(VLOOKUP($C192,Inscription!$A$12:$G$211,4,FALSE))),\" \")","v":" "},null,{"$f":"IF(C192>0,(VLOOKUP($C192,Inscription!$A$12:$G$211,5,FALSE)),\" \")","v":" "},{"$f":"IF(C192>0,(VLOOKUP($C192,Inscription!$A$12:$G$211,7,FALSE)),\" \")","v":" "},{"$f":"LEFT(IF(C192>0,(VLOOKUP($C192,Inscription!$A$12:$G$211,6,FALSE)),\" \"),8)","v":" "},{"$f":"IF(COUNTIF($F$4:$F192,$F192)<2,$F192,\" \")","v":" "},188,{"$f":"IF(I192=F192,#REF!,\"\")","v":{"$error":"#REF!"}},{"$f":"IF(COUNTIF($F$4:$F192,$F192)<3,$F192,\" \")","v":" "},188,{"$f":"IF(L192=$F192,#REF!,\"\")","v":{"$error":"#REF!"}},"",1000,{"$f":"IF(O192=$F192,#REF!,1000)","v":1000},{"$f":"IF(COUNTIF($F$4:$F192,I192)<4,$F192,\" \")","v":" "},188,{"$f":"IF(R192=$F192,#REF!,\"\")","v":{"$error":"#REF!"}},"","","",{"$f":"IF(V192=$F192,#REF!,\"\")","v":""}," ",188]
[189,189,null,{"$f":"IF(C193>0,CONCATENATE((VLOOKUP($C193,Inscription!$A$12:$G$211,3,FALSE)),\"   \",(VLOOKUP($C193,Inscription!$A$12:$G$211,4,FALSE))),\" \")","v":" "},null,{"$f":"IF(C193>0,(VLOOKUP($C193,Inscription!$A$12:$G$211,5,FALSE)),\" \")","v":" "},{"$f":"IF(C193>0,(VLOOKUP($C193,Inscription!$A$12:$G$211,7,FALSE)),\" \")","v":" "},{"$f":"LEFT(IF(C193>0,(VLOOKUP($C193,Inscription!$A$12:$G$211,6,FALSE)),\" \"),8)","v":" "},{"$f":"IF(COUNTIF($F$4:$F193,$F193)<2,$F193,\" \")","v":" "},189,{"$f":"IF(I193=F193,#REF!,\"\")","v":{"$error":"#REF!"}},{"$f":"IF(COUNTIF($F$4:$F193,$F193)<3,$F193,\" \")","v":" "},189,{"$f":"IF(L193=$F193,#REF!,\"\")","v":{"$error":"#REF!"}},"",1000,{"$f":"IF(O193=$F193,#REF!,1000)","v":1000},{"$f":"IF(COUNTIF($F$4:$F193,I193)<4,$F193,\" \")","v":" "},189,{"$f":"IF(R193=$F193,#REF!,\"\")","v":{"$error":"#REF!"}},"","","",{"$f":"IF(V193=$F193,#REF!,\"\")","v":""}," ",189]
[190,190,null,{"$f":"IF(C194>0,CONCATENATE((VLOOKUP($C194,Inscription!$A$12:$G$211,3,FALSE)),\"   \",(VLOOKUP($C194,Inscription!$A$12:$G$211,4,FALSE))),\" \")","v":" "},null,{"$f":"IF(C194>0,(VLOOKUP($C194,Inscription!$A$12:$G$211,5,FALSE)),\" \")","v":" "},{"$f":"IF(C194>0,(VLOOKUP($C194,Inscription!$A$12:$G$211,7,FALSE)),\" \")","v":" "},{"$f":"LEFT(IF(C194>0,(VLOOKUP($C194,Inscription!$A$12:$G$211,6,FALSE)),\" \"),8)","v":" "},{"$f":"IF(COUNTIF($F$4:$F194,$F194)<2,$F194,\" \")","v":" "},190,{"$f":"IF(I194=F194,#REF!,\"\")","v":{"$error":"#REF!"}},{"$f":"IF(COUNTIF($F$4:$F194,$F194)<3,$F194,\" \")","v":" "},190,{"$f":"IF(L194=$F194,#REF!,\"\")","v":{"$error":"#REF!"}},"",1000,{"$f":"IF(O194=$F194,#REF!,1000)","v":1000},{"$f":"IF(COUNTIF($F$4:$F194,I194)<4,$F194,\" \")","v":" "},190,{"$f":"IF(R194=$F194,#REF!,\"\")","v":{"$error":"#REF!"}},"","","",{"$f":"IF(V194=$F194,#REF!,\"\")","v":""}," ",190]
[191,191,null,{"$f":"IF(C195>0,CONCATENATE((VLOOKUP($C195,Inscription!$A$12:$G$211,3,FALSE)),\"   \",(VLOOKUP($C195,Inscription!$A$12:$G$211,4,FALSE))),\" \")","v":" "},null,{"$f":"IF(C195>0,(VLOOKUP($C195,Inscription!$A$12:$G$211,5,FALSE)),\" \")","v":" "},{"$f":"IF(C195>0,(VLOOKUP($C195,Inscription!$A$12:$G$211,7,FALSE)),\" \")","v":" "},{"$f":"LEFT(IF(C195>0,(VLOOKUP($C195,Inscription!$A$12:$G$211,6,FALSE)),\" \"),8)","v":" "},{"$f":"IF(COUNTIF($F$4:$F195,$F195)<2,$F195,\" \")","v":" "},191,{"$f":"IF(I195=F195,#REF!,\"\")","v":{"$error":"#REF!"}},{"$f":"IF(COUNTIF($F$4:$F195,$F195)<3,$F195,\" \")","v":" "},191,{"$f":"IF(L195=$F195,#REF!,\"\")","v":{"$error":"#REF!"}},"",1000,{"$f":"IF(O195=$F195,#REF!,1000)","v":1000},{"$f":"IF(COUNTIF($F$4:$F195,I195)<4,$F195,\" \")","v":" "},191,{"$f":"IF(R195=$F195,#REF!,\"\")","v":{"$error":"#REF!"}},"","","",{"$f":"IF(V195=$F195,#REF!,\"\")","v":""}," ",191]
[192,192,null,{"$f":"IF(C196>0,CONCATENATE((VLOOKUP($C196,Inscription!$A$12:$G$211,3,FALSE)),\"   \",(VLOOKUP($C196,Inscription!$A$12:$G$211,4,FALSE))),\" \")","v":" "},null,{"$f":"IF(C196>0,(VLOOKUP($C196,Inscription!$A$12:$G$211,5,FALSE)),\" \")","v":" "},{"$f":"IF(C196>0,(VLOOKUP($C196,Inscription!$A$12:$G$211,7,FALSE)),\" \")","v":" "},{"$f":"LEFT(IF(C196>0,(VLOOKUP($C196,Inscription!$A$12:$G$211,6,FALSE)),\" \"),8)","v":" "},{"$f":"IF(COUNTIF($F$4:$F196,$F196)<2,$F196,\" \")","v":" "},192,{"$f":"IF(I196=F196,#REF!,\"\")","v":{"$error":"#REF!"}},{"$f":"IF(COUNTIF($F$4:$F196,$F196)<3,$F196,\" \")","v":" "},192,{"$f":"IF(L196=$F196,#REF!,\"\")","v":{"$error":"#REF!"}},"",1000,{"$f":"IF(O196=$F196,#REF!,1000)","v":1000},{"$f":"IF(COUNTIF($F$4:$F196,I196)<4,$F196,\" \")","v":" "},192,{"$f":"IF(R196=$F196,#REF!,\"\")","v":{"$error":"#REF!"}},"","","",{"$f":"IF(V196=$F196,#REF!,\"\")","v":""}," ",192]
[193,193,null,{"$f":"IF(C197>0,CONCATENATE((VLOOKUP($C197,Inscription!$A$12:$G$211,3,FALSE)),\"   \",(VLOOKUP($C197,Inscription!$A$12:$G$211,4,FALSE))),\" \")","v":" "},null,{"$f":"IF(C197>0,(VLOOKUP($C197,Inscription!$A$12:$G$211,5,FALSE)),\" \")","v":" "},{"$f":"IF(C197>0,(VLOOKUP($C197,Inscription!$A$12:$G$211,7,FALSE)),\" \")","v":" "},{"$f":"LEFT(IF(C197>0,(VLOOKUP($C197,Inscription!$A$12:$G$211,6,FALSE)),\" \"),8)","v":" "},{"$f":"IF(COUNTIF($F$4:$F197,$F197)<2,$F197,\" \")","v":" "},193,{"$f":"IF(I197=F197,#REF!,\"\")","v":{"$error":"#REF!"}},{"$f":"IF(COUNTIF($F$4:$F197,$F197)<3,$F197,\" \")","v":" "},193,{"$f":"IF(L197=$F197,#REF!,\"\")","v":{"$error":"#REF!"}},"",1000,{"$f":"IF(O197=$F197,#REF!,1000)","v":1000},{"$f":"IF(COUNTIF($F$4:$F197,I197)<4,$F197,\" \")","v":" "},193,{"$f":"IF(R197=$F197,#REF!,\"\")","v":{"$error":"#REF!"}},"","","",{"$f":"IF(V197=$F197,#REF!,\"\")","v":""}," ",193]
[194,194,null,{"$f":"IF(C198>0,CONCATENATE((VLOOKUP($C198,Inscription!$A$12:$G$211,3,FALSE)),\"   \",(VLOOKUP($C198,Inscription!$A$12:$G$211,4,FALSE))),\" \")","v":" "},null,{"$f":"IF(C198>0,(VLOOKUP($C198,Inscription!$A$12:$G$211,5,FALSE)),\" \")","v":" "},{"$f":"IF(C198>0,(VLOOKUP($C198,Inscription!$A$12:$G$211,7,FALSE)),\" \")","v":" "},{"$f":"LEFT(IF(C198>0,(VLOOKUP($C198,Inscription!$A$12:$G$211,6,FALSE)),\" \"),8)","v":" "},{"$f":"IF(COUNTIF($F$4:$F198,$F198)<2,$F198,\" \")","v":" "},194,{"$f":"IF(I198=F198,#REF!,\"\")","v":{"$error":"#REF!"}},{"$f":"IF(COUNTIF($F$4:$F198,$F198)<3,$F198,\" \")","v":" "},{"$f":"IF(L198=$F198,$A198,\"\")","v":194},{"$f":"IF(L198=$F198,#REF!,\"\")","v":{"$error":"#REF!"}},{"$f":"IF(L198=I198,\"\",L198)","v":""},{"$f":"IF(O198=$F198,$A198,1000)","v":1000},{"$f":"IF(O198=$F198,#REF!,1000)","v":1000},{"$f":"IF(COUNTIF($F$4:$F198,I198)<4,$F198,\" \")","v":" "},{"$f":"IF(R198=$F198,$A198,\"\")","v":194},{"$f":"IF(R198=$F198,#REF!,\"\")","v":{"$error":"#REF!"}},{"$f":"IF(R198=I198,\"\",R198)","v":""},{"$f":"IF(U198=O198,\"\",R198)","v":""},{"$f":"IF(V198=$F198,$A198,\"\")","v":""},{"$f":"IF(V198=$F198,#REF!,\"\")","v":""}," ",194]
[195,195,null,{"$f":"IF(C199>0,CONCATENATE((VLOOKUP($C199,Inscription!$A$12:$G$211,3,FALSE)),\"   \",(VLOOKUP($C199,Inscription!$A$12:$G$211,4,FALSE))),\" \")","v":" "},null,{"$f":"IF(C199>0,(VLOOKUP($C199,Inscription!$A$12:$G$211,5,FALSE)),\" \")","v":" "},{"$f":"IF(C199>0,(VLOOKUP($C199,Inscription!$A$12:$G$211,7,FALSE)),\" \")","v":" "},{"$f":"LEFT(IF(C199>0,(VLOOKUP($C199,Inscription!$A$12:$G$211,6,FALSE)),\" \"),8)","v":" "},{"$f":"IF(COUNTIF($F$4:$F199,$F199)<2,$F199,\" \")","v":" "},195,{"$f":"IF(I199=F199,#REF!,\"\")","v":{"$error":"#REF!"}},{"$f":"IF(COUNTIF($F$4:$F199,$F199)<3,$F199,\" \")","v":" "},195,{"$f":"IF(L199=$F199,#REF!,\"\")","v":{"$error":"#REF!"}},"",1000,{"$f":"IF(O199=$F199,#REF!,1000)","v":1000},{"$f":"IF(COUNTIF($F$4:$F199,I199)<4,$F199,\" \")","v":" "},195,{"$f":"IF(R199=$F199,#REF!,\"\")","v":{"$error":"#REF!"}},"","","",{"$f":"IF(V199=$F199,#REF!,\"\")","v":""}," ",195]
[196,196,null,{"$f":"IF(C200>0,CONCATENATE((VLOOKUP($C200,Inscription!$A$12:$G$211,3,FALSE)),\"   \",(VLOOKUP($C200,Inscription!$A$12:$G$211,4,FALSE))),\" \")","v":" "},null,{"$f":"IF(C200>0,(VLOOKUP($C200,Inscription!$A$12:$G$211,5,FALSE)),\" \")","v":" "},{"$f":"IF(C200>0,(VLOOKUP($C200,Inscription!$A$12:$G$211,7,FALSE)),\" \")","v":" "},{"$f":"LEFT(IF(C200>0,(VLOOKUP($C200,Inscription!$A$12:$G$211,6,FALSE)),\" \"),8)","v":" "},{"$f":"IF(COUNTIF($F$4:$F200,$F200)<2,$F200,\" \")","v":" "},196,{"$f":"IF(I200=F200,#REF!,\"\")","v":{"$error":"#REF!"}},{"$f":"IF(COUNTIF($F$4:$F200,$F200)<3,$F200,\" \")","v":" "},196,{"$f":"IF(L200=$F200,#REF!,\"\")","v":{"$error":"#REF!"}},"",1000,{"$f":"IF(O200=$F200,#REF!,1000)","v":1000},{"$f":"IF(COUNTIF($F$4:$F200,I200)<4,$F200,\" \")","v":" "},196,{"$f":"IF(R200=$F200,#REF!,\"\")","v":{"$error":"#REF!"}},"","","",{"$f":"IF(V200=$F200,#REF!,\"\")","v":""}," ",196]
[197,197,null,{"$f":"IF(C201>0,CONCATENATE((VLOOKUP($C201,Inscription!$A$12:$G$211,3,FALSE)),\"   \",(VLOOKUP($C201,Inscription!$A$12:$G$211,4,FALSE))),\" \")","v":" "},null,{"$f":"IF(C201>0,(VLOOKUP($C201,Inscription!$A$12:$G$211,5,FALSE)),\" \")","v":" "},{"$f":"IF(C201>0,(VLOOKUP($C201,Inscription!$A$12:$G$211,7,FALSE)),\" \")","v":" "},{"$f":"LEFT(IF(C201>0,(VLOOKUP($C201,Inscription!$A$12:$G$211,6,FALSE)),\" \"),8)","v":" "},{"$f":"IF(COUNTIF($F$4:$F201,$F201)<2,$F201,\" \")","v":" "},197,{"$f":"IF(I201=F201,#REF!,\"\")","v":{"$error":"#REF!"}},{"$f":"IF(COUNTIF($F$4:$F201,$F201)<3,$F201,\" \")","v":" "},197,{"$f":"IF(L201=$F201,#REF!,\"\")","v":{"$error":"#REF!"}},"",1000,{"$f":"IF(O201=$F201,#REF!,1000)","v":1000},{"$f":"IF(COUNTIF($F$4:$F201,I201)<4,$F201,\" \")","v":" "},197,{"$f":"IF(R201=$F201,#REF!,\"\")","v":{"$error":"#REF!"}},"","","",{"$f":"IF(V201=$F201,#REF!,\"\")","v":""}," ",197]
[198,198,null,{"$f":"IF(C202>0,CONCATENATE((VLOOKUP($C202,Inscription!$A$12:$G$211,3,FALSE)),\"   \",(VLOOKUP($C202,Inscription!$A$12:$G$211,4,FALSE))),\" \")","v":" "},null,{"$f":"IF(C202>0,(VLOOKUP($C202,Inscription!$A$12:$G$211,5,FALSE)),\" \")","v":" "},{"$f":"IF(C202>0,(VLOOKUP($C202,Inscription!$A$12:$G$211,7,FALSE)),\" \")","v":" "},{"$f":"LEFT(IF(C202>0,(VLOOKUP($C202,Inscription!$A$12:$G$211,6,FALSE)),\" \"),8)","v":" "},{"$f":"IF(COUNTIF($F$4:$F202,$F202)<2,$F202,\" \")","v":" "},198,{"$f":"IF(I202=F202,#REF!,\"\")","v":{"$error":"#REF!"}},{"$f":"IF(COUNTIF($F$4:$F202,$F202)<3,$F202,\" \")","v":" "},198,{"$f":"IF(L202=$F202,#REF!,\"\")","v":{"$error":"#REF!"}},"",1000,{"$f":"IF(O202=$F202,#REF!,1000)","v":1000},{"$f":"IF(COUNTIF($F$4:$F202,I202)<4,$F202,\" \")","v":" "},198,{"$f":"IF(R202=$F202,#REF!,\"\")","v":{"$error":"#REF!"}},"","","",{"$f":"IF(V202=$F202,#REF!,\"\")","v":""}," ",198]
[199,199,null,{"$f":"IF(C203>0,CONCATENATE((VLOOKUP($C203,Inscription!$A$12:$G$211,3,FALSE)),\"   \",(VLOOKUP($C203,Inscription!$A$12:$G$211,4,FALSE))),\" \")","v":" "},null,{"$f":"IF(C203>0,(VLOOKUP($C203,Inscription!$A$12:$G$211,5,FALSE)),\" \")","v":" "},{"$f":"IF(C203>0,(VLOOKUP($C203,Inscription!$A$12:$G$211,7,FALSE)),\" \")","v":" "},{"$f":"LEFT(IF(C203>0,(VLOOKUP($C203,Inscription!$A$12:$G$211,6,FALSE)),\" \"),8)","v":" "},{"$f":"IF(COUNTIF($F$4:$F203,$F203)<2,$F203,\" \")","v":" "},199,{"$f":"IF(I203=F203,#REF!,\"\")","v":{"$error":"#REF!"}},{"$f":"IF(COUNTIF($F$4:$F203,$F203)<3,$F203,\" \")","v":" "},199,{"$f":"IF(L203=$F203,#REF!,\"\")","v":{"$error":"#REF!"}},"",1000,{"$f":"IF(O203=$F203,#REF!,1000)","v":1000},{"$f":"IF(COUNTIF($F$4:$F203,I203)<4,$F203,\" \")","v":" "},199,{"$f":"IF(R203=$F203,#REF!,\"\")","v":{"$error":"#REF!"}},"","","",{"$f":"IF(V203=$F203,#REF!,\"\")","v":""}," ",199]
[200,200,null,{"$f":"IF(C204>0,CONCATENATE((VLOOKUP($C204,Inscription!$A$12:$G$211,3,FALSE)),\"   \",(VLOOKUP($C204,Inscription!$A$12:$G$211,4,FALSE))),\" \")","v":" "},null,{"$f":"IF(C204>0,(VLOOKUP($C204,Inscription!$A$12:$G$211,5,FALSE)),\" \")","v":" "},{"$f":"IF(C204>0,(VLOOKUP($C204,Inscription!$A$12:$G$211,7,FALSE)),\" \")","v":" "},{"$f":"LEFT(IF(C204>0,(VLOOKUP($C204,Inscription!$A$12:$G$211,6,FALSE)),\" \"),8)","v":" "},{"$f":"IF(COUNTIF($F$4:$F204,$F204)<2,$F204,\" \")","v":" "},200,{"$f":"IF(I204=F204,#REF!,\"\")","v":{"$error":"#REF!"}},{"$f":"IF(COUNTIF($F$4:$F204,$F204)<3,$F204,\" \")","v":" "},200,{"$f":"IF(L204=$F204,#REF!,\"\")","v":{"$error":"#REF!"}},"",1000,{"$f":"IF(O204=$F204,#REF!,1000)","v":1000},{"$f":"IF(COUNTIF($F$4:$F204,I204)<4,$F204,\" \")","v":" "},200,{"$f":"IF(R204=$F204,#REF!,\"\")","v":{"$error":"#REF!"}},"","","",{"$f":"IF(V204=$F204,#REF!,\"\")","v":""}," ",200]

{"sheet":"CLASS INTERNET","index":6,"n_rows":122,"n_cols":7,"rows_kept":122,"cut":false,"hidden":false,"merged":[[126,5,126,6],[10,2,10,3]]}
[]
[]
[]
[null,null,null,null,null,null,"Commissaires :"]
[null,null,null,null,null,null," Nicole JEUNEU, Sandra GUILLAUME,"]
[null,null,null,null,null,null,"Maryvonne GOUYA,  Baptiste BEDEL, "]
[null,null,null,null,null,null,"Alain RICHEUX, Gwaldys LERAY, Stéphanie GOUYA"]
[]
["COURSE",null,{"$f":"CLASSEMENT!C1","v":"cyclo cross de Créhen  "},null,null,{"$f":"IF(Inscription!$D$4>0,\"DATE :  \"&TEXT(Inscription!D$4,\"jj mmmm aaaa\"),\"\")","v":"DATE :  30 novembre 2024"}]
[null,null,{"$f":"Inscription!D5","v":0},null,null,{"$f":"CLASSEMENT!G2","v":0}]
["Place","Doss","NOM et PRENOM",null,"CLUB","LICENCE","CAT."]
[{"$f":"CLASSEMENT!$B4","v":0},{"$f":"CLASSEMENT!C4","v":0},"Moustique",null,{"$f":"CLASSEMENT!F4","v":" "},{"$f":"CLASSEMENT!G4","v":" "},{"$f":"CLASSEMENT!H4","v":" "}]
[{"$f":"CLASSEMENT!$B5","v":1},{"$f":"CLASSEMENT!C5","v":170},{"$f":"CLASSEMENT!D5","v":"Brueziere   Eden"},null,{"$f":"CLASSEMENT!F5","v":"Team Bikers 22"},{"$f":"CLASSEMENT!G5","v":"moustique"},{"$f":"CLASSEMENT!H5","v":"491634"}]
[{"$f":"CLASSEMENT!$B6","v":0},{"$f":"CLASSEMENT!C6","v":0},{"$f":"CLASSEMENT!D6","v":" "},null,{"$f":"CLASSEMENT!F6","v":" "},{"$f":"CLASSEMENT!G6","v":" "},{"$f":"CLASSEMENT!H6","v":" "}]
[{"$f":"CLASSEMENT!$B7","v":0},{"$f":"CLASSEMENT!C7","v":0},"Poussins",null,{"$f":"CLASSEMENT!F7","v":" "},{"$f":"CLASSEMENT!G7","v":" "},{"$f":"CLASSEMENT!H7","v":" "}]
[{"$f":"CLASSEMENT!$B8","v":1},{"$f":"CLASSEMENT!C8","v":160},{"$f":"CLASSEMENT!D8","v":"Macé   Loukas"},null,{"$f":"CLASSEMENT!F8","v":"VC Evron"},{"$f":"CLASSEMENT!G8","v":"poussin"},{"$f":"CLASSEMENT!H8","v":"396776"}]
[{"$f":"CLASSEMENT!$B9","v":2},{"$f":"CLASSEMENT!C9","v":161},{"$f":"CLASSEMENT!D9","v":"Leveque   Nathan"},null,{"$f":"CLASSEMENT!F9","v":"Lamball'breizh"},{"$f":"CLASSEMENT!G9","v":"poussin"},{"$f":"CLASSEMENT!H9","v":"435105"}]
[3,{"$f":"CLASSEMENT!C10","v":162},{"$f":"CLASSEMENT!D10","v":"Lévèque   Clément"},null,{"$f":"CLASSEMENT!F10","v":"Accro Cycles"},{"$f":"CLASSEMENT!G10","v":"poussin"},{"$f":"CLASSEMENT!H10","v":"377265"}]
[4,{"$f":"CLASSEMENT!C11","v":164},{"$f":"CLASSEMENT!D11","v":"Gouret   Louison"},null,{"$f":"CLASSEMENT!F11","v":"VC Evron"},{"$f":"CLASSEMENT!G11","v":"poussin"},{"$f":"CLASSEMENT!H11","v":""}]
[5,{"$f":"CLASSEMENT!C12","v":163},{"$f":"CLASSEMENT!D12","v":"Vitel   Manoë"},null,{"$f":"CLASSEMENT!F12","v":"Team Bikers 22"},{"$f":"CLASSEMENT!G12","v":"Poussin"},{"$f":"CLASSEMENT!H12","v":""}]
[6,{"$f":"CLASSEMENT!C13","v":165},{"$f":"CLASSEMENT!D13","v":"Raoult   Léon"},null,{"$f":"CLASSEMENT!F13","v":"VC Evron"},{"$f":"CLASSEMENT!G13","v":"poussin"},{"$f":"CLASSEMENT!H13","v":""}]
[{"$f":"CLASSEMENT!$B14","v":7},{"$f":"CLASSEMENT!C14","v":166},{"$f":"CLASSEMENT!D14","v":"Boilet   Malo"},null,{"$f":"CLASSEMENT!F14","v":"Lamball'breizh"},{"$f":"CLASSEMENT!G14","v":"poussin"},{"$f":"CLASSEMENT!H14","v":"520459"}]
[{"$f":"CLASSEMENT!$B15","v":0},{"$f":"CLASSEMENT!C15","v":0},{"$f":"CLASSEMENT!D15","v":" "},null,{"$f":"CLASSEMENT!F15","v":" "},{"$f":"CLASSEMENT!G15","v":" "},{"$f":"CLASSEMENT!H15","v":" "}]
[{"$f":"CLASSEMENT!$B16","v":0},{"$f":"CLASSEMENT!C16","v":0},"Pupille fille",null,{"$f":"CLASSEMENT!F16","v":" "},{"$f":"CLASSEMENT!G16","v":" "},{"$f":"CLASSEMENT!H16","v":" "}]
[{"$f":"CLASSEMENT!$B17","v":1},{"$f":"CLASSEMENT!C17","v":140},{"$f":"CLASSEMENT!D17","v":"Meunier Le Breton   Lilwena"},null,{"$f":"CLASSEMENT!F17","v":"VTT Côtes D'Armor Hillion"},{"$f":"CLASSEMENT!G17","v":"pupille"},{"$f":"CLASSEMENT!H17","v":"369755"}]
[{"$f":"CLASSEMENT!$B18","v":0},{"$f":"CLASSEMENT!C18","v":0},{"$f":"CLASSEMENT!D18","v":" "},null,{"$f":"CLASSEMENT!F18","v":" "},{"$f":"CLASSEMENT!G18","v":" "},{"$f":"CLASSEMENT!H18","v":" "}]
[{"$f":"CLASSEMENT!$B19","v":0},{"$f":"CLASSEMENT!C19","v":0},"Pupille garçon",null,{"$f":"CLASSEMENT!F19","v":" "},{"$f":"CLASSEMENT!G19","v":" "},{"$f":"CLASSEMENT!H19","v":" "}]
[{"$f":"CLASSEMENT!$B20","v":1},{"$f":"CLASSEMENT!C20","v":142},{"$f":"CLASSEMENT!D20","v":"Rouillé Biard   Manech"},null,{"$f":"CLASSEMENT!F20","v":"VTT Côtes D'Armor Hillion"},{"$f":"CLASSEMENT!G20","v":"pupille"},{"$f":"CLASSEMENT!H20","v":"451260"}]
[{"$f":"CLASSEMENT!$B21","v":2},{"$f":"CLASSEMENT!C21","v":143},{"$f":"CLASSEMENT!D21","v":"Kowalski   Paul"},null,{"$f":"CLASSEMENT!F21","v":"Team Bikers 22"},{"$f":"CLASSEMENT!G21","v":"pupille"},{"$f":"CLASSEMENT!H21","v":"460607"}]
[{"$f":"CLASSEMENT!$B22","v":3},{"$f":"CLASSEMENT!C22","v":141},{"$f":"CLASSEMENT!D22","v":"Bruezière   Enzo"},null,{"$f":"CLASSEMENT!F22","v":"Team Bikers 22"},{"$f":"CLASSEMENT!G22","v":"pupille"},{"$f":"CLASSEMENT!H22","v":"459065"}]
[{"$f":"CLASSEMENT!$B23","v":4},{"$f":"CLASSEMENT!C23","v":144},{"$f":"CLASSEMENT!D23","v":"Devaux   Naël"},null,{"$f":"CLASSEMENT!F23","v":"Team Bikers 22"},{"$f":"CLASSEMENT!G23","v":"Pupille"},{"$f":"CLASSEMENT!H23","v":""}]
[{"$f":"CLASSEMENT!$B24","v":0},{"$f":"CLASSEMENT!C24","v":0},{"$f":"CLASSEMENT!D24","v":" "},null,{"$f":"CLASSEMENT!F24","v":" "},{"$f":"CLASSEMENT!G24","v":" "},{"$f":"CLASSEMENT!H24","v":" "}]
[{"$f":"CLASSEMENT!$B25","v":0},{"$f":"CLASSEMENT!C25","v":0},"Benjamine",null,{"$f":"CLASSEMENT!F25","v":" "},{"$f":"CLASSEMENT!G25","v":" "},{"$f":"CLASSEMENT!H25","v":" "}]
[{"$f":"CLASSEMENT!$B26","v":1},{"$f":"CLASSEMENT!C26","v":124},{"$f":"CLASSEMENT!D26","v":"Callennec   Lucy"},null,{"$f":"CLASSEMENT!F26","v":"Bégard VTT Gwerun"},{"$f":"CLASSEMENT!G26","v":"Benjamin"},{"$f":"CLASSEMENT!H26","v":"509013"}]
[{"$f":"CLASSEMENT!$B27","v":"absent"},{"$f":"CLASSEMENT!C27","v":121},{"$f":"CLASSEMENT!D27","v":"Croisier   Léa"},null,{"$f":"CLASSEMENT!F27","v":"Team Pays de Dinan"},{"$f":"CLASSEMENT!G27","v":"Benjamin"},{"$f":"CLASSEMENT!H27","v":"263040"}]
[{"$f":"CLASSEMENT!$B28","v":0},{"$f":"CLASSEMENT!C28","v":0},{"$f":"CLASSEMENT!D28","v":" "},null,{"$f":"CLASSEMENT!F28","v":" "},{"$f":"CLASSEMENT!G28","v":" "},{"$f":"CLASSEMENT!H28","v":" "}]
[{"$f":"CLASSEMENT!$B29","v":0},{"$f":"CLASSEMENT!C29","v":0},"Benjamin",null,{"$f":"CLASSEMENT!F29","v":" "},{"$f":"CLASSEMENT!G29","v":" "},{"$f":"CLASSEMENT!H29","v":" "}]
[{"$f":"CLASSEMENT!$B30","v":1},{"$f":"CLASSEMENT!C30","v":133},{"$f":"CLASSEMENT!D30","v":"Cadieu   Gabriel"},null,{"$f":"CLASSEMENT!F30","v":"VTT du Lié"},{"$f":"CLASSEMENT!G30","v":"benjamin"},{"$f":"CLASSEMENT!H30","v":""}]
[{"$f":"CLASSEMENT!$B31","v":2},{"$f":"CLASSEMENT!C31","v":120},{"$f":"CLASSEMENT!D31","v":"Briand   Axel"},null,{"$f":"CLASSEMENT!F31","v":"VC Evron"},{"$f":"CLASSEMENT!G31","v":"Benjamin"},{"$f":"CLASSEMENT!H31","v":"429219"}]
[{"$f":"CLASSEMENT!$B32","v":3},{"$f":"CLASSEMENT!C32","v":122},{"$f":"CLASSEMENT!D32","v":"Huguet   Mathis"},null,{"$f":"CLASSEMENT!F32","v":"Team Bikers 22"},{"$f":"CLASSEMENT!G32","v":"Benjamin"},{"$f":"CLASSEMENT!H32","v":"390457"}]
[{"$f":"CLASSEMENT!$B33","v":4},{"$f":"CLASSEMENT!C33","v":126},{"$f":"CLASSEMENT!D33","v":"Lanoé   Hugo"},null,{"$f":"CLASSEMENT!F33","v":"VC Evron"},{"$f":"CLASSEMENT!G33","v":"Benjamin"},{"$f":"CLASSEMENT!H33","v":"382435"}]
[{"$f":"CLASSEMENT!$B34","v":5},{"$f":"CLASSEMENT!C34","v":123},{"$f":"CLASSEMENT!D34","v":"Macé   Tom"},null,{"$f":"CLASSEMENT!F34","v":"Team Broons"},{"$f":"CLASSEMENT!G34","v":"Benjamin"},{"$f":"CLASSEMENT!H34","v":"256614"}]
[{"$f":"CLASSEMENT!$B35","v":6},{"$f":"CLASSEMENT!C35","v":125},{"$f":"CLASSEMENT!D35","v":"Lebret   Sacha"},null,{"$f":"CLASSEMENT!F35","v":"Team Bikers 22"},{"$f":"CLASSEMENT!G35","v":"Benjamin"},{"$f":"CLASSEMENT!H35","v":"390946"}]
[{"$f":"CLASSEMENT!$B36","v":7},{"$f":"CLASSEMENT!C36","v":128},{"$f":"CLASSEMENT!D36","v":"Lévéque   Noé"},null,{"$f":"CLASSEMENT!F36","v":"Accro Cycles"},{"$f":"CLASSEMENT!G36","v":"Benjamin"},{"$f":"CLASSEMENT!H36","v":"337516"}]
[{"$f":"CLASSEMENT!$B37","v":8},{"$f":"CLASSEMENT!C37","v":132},{"$f":"CLASSEMENT!D37","v":"Gerard   Jules"},null,{"$f":"CLASSEMENT!F37","v":"Team Bikers 22"},{"$f":"CLASSEMENT!G37","v":"Benjamin"},{"$f":"CLASSEMENT!H37","v":"491636"}]
[{"$f":"CLASSEMENT!$B38","v":9},{"$f":"CLASSEMENT!C38","v":127},{"$f":"CLASSEMENT!D38","v":"Creseveur   Gwenvael"},null,{"$f":"CLASSEMENT!F38","v":"Team XC du Léguer"},{"$f":"CLASSEMENT!G38","v":"Benjamin"},{"$f":"CLASSEMENT!H38","v":"330214"}]
[{"$f":"CLASSEMENT!$B39","v":10},{"$f":"CLASSEMENT!C39","v":131},{"$f":"CLASSEMENT!D39","v":"Auffret   Siméon"},null,{"$f":"CLASSEMENT!F39","v":"VC Plurien"},{"$f":"CLASSEMENT!G39","v":"benjamin"},{"$f":"CLASSEMENT!H39","v":"459988"}]
[{"$f":"CLASSEMENT!$B40","v":11},{"$f":"CLASSEMENT!C40","v":130},{"$f":"CLASSEMENT!D40","v":"Remond   Malo"},null,{"$f":"CLASSEMENT!F40","v":"Team XC du Léguer"},{"$f":"CLASSEMENT!G40","v":"benjamin"},{"$f":"CLASSEMENT!H40","v":"395912"}]
[{"$f":"CLASSEMENT!$B41","v":12},{"$f":"CLASSEMENT!C41","v":129},{"$f":"CLASSEMENT!D41","v":"Colas   Thibault"},null,{"$f":"CLASSEMENT!F41","v":"Team XC du Léguer"},{"$f":"CLASSEMENT!G41","v":"Benjamin"},{"$f":"CLASSEMENT!H41","v":"330206"}]
[]
[]
[]
[{"$f":"CLASSEMENT!$B45","v":0},{"$f":"CLASSEMENT!C45","v":0},"Minime",null,{"$f":"CLASSEMENT!F45","v":" "},null,{"$f":"CLASSEMENT!H45","v":" "}]
[{"$f":"CLASSEMENT!$B46","v":1},{"$f":"CLASSEMENT!C46","v":110},{"$f":"CLASSEMENT!D46","v":"Le Bihan   Clément"},null,{"$f":"CLASSEMENT!F46","v":"UC Plaudren"},{"$f":"CLASSEMENT!G46","v":"minime"},{"$f":"CLASSEMENT!H46","v":"136145"}]
[{"$f":"CLASSEMENT!$B47","v":2},{"$f":"CLASSEMENT!C47","v":112},{"$f":"CLASSEMENT!D47","v":"Le Bihan   Evann"},null,{"$f":"CLASSEMENT!F47","v":"UC Plaudren"},{"$f":"CLASSEMENT!G47","v":"minime"},{"$f":"CLASSEMENT!H47","v":"379622"}]
[{"$f":"CLASSEMENT!$B48","v":3},{"$f":"CLASSEMENT!C48","v":111},{"$f":"CLASSEMENT!D48","v":"Besnard colas   Ismaël"},null,{"$f":"CLASSEMENT!F48","v":"CC Moncontour"},{"$f":"CLASSEMENT!G48","v":"minime"},{"$f":"CLASSEMENT!H48","v":"400382"}]
[{"$f":"CLASSEMENT!$B49","v":4},{"$f":"CLASSEMENT!C49","v":115},{"$f":"CLASSEMENT!D49","v":"le Corguille   Brieuc"},null,{"$f":"CLASSEMENT!F49","v":"VC Plurien"},{"$f":"CLASSEMENT!G49","v":"minime"},{"$f":"CLASSEMENT!H49","v":"434773"}]
[{"$f":"CLASSEMENT!$B50","v":5},{"$f":"CLASSEMENT!C50","v":114},{"$f":"CLASSEMENT!D50","v":"Briand   Mathis"},null,{"$f":"CLASSEMENT!F50","v":"VC Evron"},{"$f":"CLASSEMENT!G50","v":"minime"},{"$f":"CLASSEMENT!H50","v":"431995"}]
[]
[{"$f":"CLASSEMENT!$B54","v":0},{"$f":"CLASSEMENT!C54","v":0},"Cadet",null,{"$f":"CLASSEMENT!F54","v":" "},{"$f":"CLASSEMENT!G54","v":" "},{"$f":"CLASSEMENT!H54","v":" "}]
[1,{"$f":"CLASSEMENT!C55","v":101},{"$f":"CLASSEMENT!D55","v":"Flégeau   Gaël"},null,{"$f":"CLASSEMENT!F55","v":"Team Bikers 22"},{"$f":"CLASSEMENT!G55","v":"cadet"},{"$f":"CLASSEMENT!H55","v":"269847"}]
[2,{"$f":"CLASSEMENT!C56","v":104},{"$f":"CLASSEMENT!D56","v":"Durand   Joan"},null,{"$f":"CLASSEMENT!F56","v":"Lamball'breizh"},{"$f":"CLASSEMENT!G56","v":"cadet"},{"$f":"CLASSEMENT!H56","v":"383110"}]
[3,{"$f":"CLASSEMENT!C57","v":100},{"$f":"CLASSEMENT!D57","v":"Creseveur   Gurwan"},null,{"$f":"CLASSEMENT!F57","v":"Team XC du Léguer"},{"$f":"CLASSEMENT!G57","v":"Cadet"},{"$f":"CLASSEMENT!H57","v":"330214"}]
[4,{"$f":"CLASSEMENT!C58","v":105},{"$f":"CLASSEMENT!D58","v":"Cadieu   Martin"},null,{"$f":"CLASSEMENT!F58","v":"VTT du Lié"},{"$f":"CLASSEMENT!G58","v":"Cadet"},{"$f":"CLASSEMENT!H58","v":""}]
[5,{"$f":"CLASSEMENT!C59","v":102},{"$f":"CLASSEMENT!D59","v":"Rouille   Robin"},null,{"$f":"CLASSEMENT!F59","v":"Team Bikers 22"},{"$f":"CLASSEMENT!G59","v":"cadet"},{"$f":"CLASSEMENT!H59","v":"390947"}]
[6,{"$f":"CLASSEMENT!C60","v":103},{"$f":"CLASSEMENT!D60","v":"Madec   Rafael"},null,{"$f":"CLASSEMENT!F60","v":"VS Ploumagoar"},{"$f":"CLASSEMENT!G60","v":"cadet"},{"$f":"CLASSEMENT!H60","v":""}]
[{"$f":"CLASSEMENT!$B61","v":0},{"$f":"CLASSEMENT!C61","v":0},{"$f":"CLASSEMENT!D61","v":" "},null,{"$f":"CLASSEMENT!F61","v":" "},{"$f":"CLASSEMENT!G61","v":" "},{"$f":"CLASSEMENT!H61","v":" "}]
[{"$f":"CLASSEMENT!$B62","v":0},{"$f":"CLASSEMENT!C62","v":0},"3ème Catégorie",null,{"$f":"CLASSEMENT!F62","v":" "},{"$f":"CLASSEMENT!G62","v":" "},{"$f":"CLASSEMENT!H62","v":" "}]
[1,{"$f":"CLASSEMENT!C63","v":62},{"$f":"CLASSEMENT!D63","v":"Lecellier   Raymond"},null,{"$f":"CLASSEMENT!F63","v":"Team Mégrit"},{"$f":"CLASSEMENT!G63","v":3},{"$f":"CLASSEMENT!H63","v":"143624"}]
[2,{"$f":"CLASSEMENT!C64","v":60},{"$f":"CLASSEMENT!D64","v":"Nicolas   Jean-Charles"},null,{"$f":"CLASSEMENT!F64","v":"AC Vildé-Guingalan"},{"$f":"CLASSEMENT!G64","v":3},{"$f":"CLASSEMENT!H64","v":"137756"}]
[3,{"$f":"CLASSEMENT!C65","v":69},{"$f":"CLASSEMENT!D65","v":"Guillot   Denis"},null,{"$f":"CLASSEMENT!F65","v":"Team Pays de Dinan"},{"$f":"CLASSEMENT!G65","v":3},{"$f":"CLASSEMENT!H65","v":""}]
[4,{"$f":"CLASSEMENT!C66","v":66},{"$f":"CLASSEMENT!D66","v":"Gouya   Noël"},null,{"$f":"CLASSEMENT!F66","v":"Team Pays de Dinan"},{"$f":"CLASSEMENT!G66","v":3},{"$f":"CLASSEMENT!H66","v":"136620"}]
[{"$f":"CLASSEMENT!$B67","v":5},{"$f":"CLASSEMENT!C67","v":61},{"$f":"CLASSEMENT!D67","v":"Lemaitre    Alain"},null,{"$f":"CLASSEMENT!F67","v":"AC Vildé-Guingalan"},{"$f":"CLASSEMENT!G67","v":3},{"$f":"CLASSEMENT!H67","v":"136151"}]
[{"$f":"CLASSEMENT!$B68","v":6},{"$f":"CLASSEMENT!C68","v":71},{"$f":"CLASSEMENT!D68","v":"Colleu   Pascal"},null,{"$f":"CLASSEMENT!F68","v":"CCV Beaussais"},{"$f":"CLASSEMENT!G68","v":3},{"$f":"CLASSEMENT!H68","v":"137558"}]
[{"$f":"CLASSEMENT!$B69","v":7},{"$f":"CLASSEMENT!C69","v":74},{"$f":"CLASSEMENT!D69","v":"Jeuneu   Gilles"},null,{"$f":"CLASSEMENT!F69","v":"Accro Cycles"},{"$f":"CLASSEMENT!G69","v":3},{"$f":"CLASSEMENT!H69","v":"137390"}]
[{"$f":"CLASSEMENT!$B70","v":8},{"$f":"CLASSEMENT!C70","v":65},{"$f":"CLASSEMENT!D70","v":"Colombier   Michel"},null,{"$f":"CLASSEMENT!F70","v":"CC Robert le Roux"},{"$f":"CLASSEMENT!G70","v":3},{"$f":"CLASSEMENT!H70","v":"286379"}]
[{"$f":"CLASSEMENT!$B71","v":9},{"$f":"CLASSEMENT!C71","v":76},{"$f":"CLASSEMENT!D71","v":"Colas   Roger"},null,{"$f":"CLASSEMENT!F71","v":"EC Créhen"},{"$f":"CLASSEMENT!G71","v":3},{"$f":"CLASSEMENT!H71","v":"137514"}]
[{"$f":"CLASSEMENT!$B72","v":10},{"$f":"CLASSEMENT!C72","v":75},{"$f":"CLASSEMENT!D72","v":"Pezres   Didier"},null,{"$f":"CLASSEMENT!F72","v":"EC Créhen"},{"$f":"CLASSEMENT!G72","v":3},{"$f":"CLASSEMENT!H72","v":"137518"}]
[{"$f":"CLASSEMENT!$B73","v":11},{"$f":"CLASSEMENT!C73","v":73},{"$f":"CLASSEMENT!D73","v":"Durand   Francky"},null,{"$f":"CLASSEMENT!F73","v":"CC Moncontour"},{"$f":"CLASSEMENT!G73","v":3},{"$f":"CLASSEMENT!H73","v":"480456"}]
[{"$f":"CLASSEMENT!$B74","v":12},{"$f":"CLASSEMENT!C74","v":72},{"$f":"CLASSEMENT!D74","v":"Goupil   Michel"},null,{"$f":"CLASSEMENT!F74","v":"Team Mégrit"},{"$f":"CLASSEMENT!G74","v":3},{"$f":"CLASSEMENT!H74","v":""}]
[{"$f":"CLASSEMENT!$B75","v":13},{"$f":"CLASSEMENT!C75","v":67},{"$f":"CLASSEMENT!D75","v":"Croisier   Ronan"},null,{"$f":"CLASSEMENT!F75","v":"Team Pays de Dinan"},{"$f":"CLASSEMENT!G75","v":3},{"$f":"CLASSEMENT!H75","v":"136268"}]
[{"$f":"CLASSEMENT!$B76","v":14},{"$f":"CLASSEMENT!C76","v":63},{"$f":"CLASSEMENT!D76","v":"Georget   Charles"},null,{"$f":"CLASSEMENT!F76","v":"Lamball'breizh"},{"$f":"CLASSEMENT!G76","v":3},{"$f":"CLASSEMENT!H76","v":"136132"}]
[{"$f":"CLASSEMENT!$B77","v":15},{"$f":"CLASSEMENT!C77","v":64},{"$f":"CLASSEMENT!D77","v":"Bedel   Michel"},null,{"$f":"CLASSEMENT!F77","v":"Lamball'breizh"},{"$f":"CLASSEMENT!G77","v":3},{"$f":"CLASSEMENT!H77","v":"267277"}]
[{"$f":"CLASSEMENT!$B78","v":16},{"$f":"CLASSEMENT!C78","v":77},{"$f":"CLASSEMENT!D78","v":"Gouya   Philippe"},null,{"$f":"CLASSEMENT!F78","v":"EC Créhen"},{"$f":"CLASSEMENT!G78","v":3},{"$f":"CLASSEMENT!H78","v":"136134"}]
[{"$f":"CLASSEMENT!$B79","v":17},{"$f":"CLASSEMENT!C79","v":70},{"$f":"CLASSEMENT!D79","v":"Gaillard   Marcel"},null,{"$f":"CLASSEMENT!F79","v":"COS Kerentrech"},{"$f":"CLASSEMENT!G79","v":3},{"$f":"CLASSEMENT!H79","v":"153464"}]
[18,{"$f":"CLASSEMENT!C80","v":68},{"$f":"CLASSEMENT!D80","v":"Durand   Jacques"},null,{"$f":"CLASSEMENT!F80","v":"Team Pays de Dinan"},{"$f":"CLASSEMENT!G80","v":3},{"$f":"CLASSEMENT!H80","v":"136617"}]
[{"$f":"CLASSEMENT!$B81","v":"absent"},{"$f":"CLASSEMENT!C81","v":78},{"$f":"CLASSEMENT!D81","v":"Gilson   Frédéric"},null,{"$f":"CLASSEMENT!F81","v":"CC Moncontour"},{"$f":"CLASSEMENT!G81","v":3},{"$f":"CLASSEMENT!H81","v":"424247"}]
[{"$f":"CLASSEMENT!$B82","v":0},{"$f":"CLASSEMENT!C82","v":0},{"$f":"CLASSEMENT!D82","v":" "},null,{"$f":"CLASSEMENT!F82","v":" "},{"$f":"CLASSEMENT!G82","v":" "},{"$f":"CLASSEMENT!H82","v":" "}]
[{"$f":"CLASSEMENT!$B83","v":0},{"$f":"CLASSEMENT!C83","v":0},"2ème Catégorie",null,{"$f":"CLASSEMENT!F83","v":" "},{"$f":"CLASSEMENT!G83","v":" "},{"$f":"CLASSEMENT!H83","v":" "}]
[{"$f":"CLASSEMENT!$B84","v":1},{"$f":"CLASSEMENT!C84","v":34},{"$f":"CLASSEMENT!D84","v":"Perrennou   Claude"},null,{"$f":"CLASSEMENT!F84","v":"COS Kerentrech"},{"$f":"CLASSEMENT!G84","v":2},{"$f":"CLASSEMENT!H84","v":""}]
[{"$f":"CLASSEMENT!$B85","v":2},{"$f":"CLASSEMENT!C85","v":31},{"$f":"CLASSEMENT!D85","v":"Prigent   Benoit"},null,{"$f":"CLASSEMENT!F85","v":"Lamball'breizh"},{"$f":"CLASSEMENT!G85","v":2},{"$f":"CLASSEMENT!H85","v":"468745"}]
[{"$f":"CLASSEMENT!$B86","v":3},{"$f":"CLASSEMENT!C86","v":41},{"$f":"CLASSEMENT!D86","v":"letaconnoux   sylvain"},null,{"$f":"CLASSEMENT!F86","v":"accro cycles"},{"$f":"CLASSEMENT!G86","v":2},{"$f":"CLASSEMENT!H86","v":""}]
[{"$f":"CLASSEMENT!$B87","v":4},{"$f":"CLASSEMENT!C87","v":30},{"$f":"CLASSEMENT!D87","v":"Huby   Laurent"},null,{"$f":"CLASSEMENT!F87","v":"CC d'Uzel"},{"$f":"CLASSEMENT!G87","v":2},{"$f":"CLASSEMENT!H87","v":"278430"}]
[{"$f":"CLASSEMENT!$B88","v":5},{"$f":"CLASSEMENT!C88","v":33},{"$f":"CLASSEMENT!D88","v":"Nicolas   Patrice"},null,{"$f":"CLASSEMENT!F88","v":"COS Kerentrech"},{"$f":"CLASSEMENT!G88","v":2},{"$f":"CLASSEMENT!H88","v":"247939"}]
[{"$f":"CLASSEMENT!$B89","v":6},{"$f":"CLASSEMENT!C89","v":32},"Bedel  Baptiste",null,{"$f":"CLASSEMENT!F89","v":"Lamball'breizh"},{"$f":"CLASSEMENT!G89","v":2},{"$f":"CLASSEMENT!H89","v":"136137"}]
[{"$f":"CLASSEMENT!$B90","v":7},{"$f":"CLASSEMENT!C90","v":37},{"$f":"CLASSEMENT!D90","v":"Besnard   Jean-Jacques"},null,{"$f":"CLASSEMENT!F90","v":"CC Moncontour"},{"$f":"CLASSEMENT!G90","v":2},{"$f":"CLASSEMENT!H90","v":"425505"}]
[{"$f":"CLASSEMENT!$B91","v":8},{"$f":"CLASSEMENT!C91","v":35},{"$f":"CLASSEMENT!D91","v":"Leroux   Jérôme"},null,{"$f":"CLASSEMENT!F91","v":"CCV Beaussais"},{"$f":"CLASSEMENT!G91","v":2},{"$f":"CLASSEMENT!H91","v":"349169"}]
[{"$f":"CLASSEMENT!$B92","v":"abandon"},{"$f":"CLASSEMENT!C92","v":36},{"$f":"CLASSEMENT!D92","v":"Bittoré   Luca"},null,{"$f":"CLASSEMENT!F92","v":"CCV Beaussais"},{"$f":"CLASSEMENT!G92","v":2},{"$f":"CLASSEMENT!H92","v":"465568"}]
[{"$f":"CLASSEMENT!$B93","v":"absent"},{"$f":"CLASSEMENT!C93","v":38},{"$f":"CLASSEMENT!D93","v":"Macé   Jérome"},null,{"$f":"CLASSEMENT!F93","v":"VC Evron"},{"$f":"CLASSEMENT!G93","v":2},{"$f":"CLASSEMENT!H93","v":"434904"}]
[{"$f":"CLASSEMENT!$B94","v":"absent"},{"$f":"CLASSEMENT!C94","v":39},{"$f":"CLASSEMENT!D94","v":"Henry   Damien"},null,{"$f":"CLASSEMENT!F94","v":"VC Dinan"},{"$f":"CLASSEMENT!G94","v":2},{"$f":"CLASSEMENT!H94","v":"474783"}]
[{"$f":"CLASSEMENT!$B95","v":0},{"$f":"CLASSEMENT!C95","v":0},{"$f":"CLASSEMENT!D95","v":" "},null,{"$f":"CLASSEMENT!F95","v":" "},{"$f":"CLASSEMENT!G95","v":" "},{"$f":"CLASSEMENT!H95","v":" "}]
[{"$f":"CLASSEMENT!$B96","v":0},{"$f":"CLASSEMENT!C96","v":0},{"$f":"CLASSEMENT!D96","v":" "},null,{"$f":"CLASSEMENT!F96","v":" "},{"$f":"CLASSEMENT!G96","v":" "},{"$f":"CLASSEMENT!H96","v":" "}]
[{"$f":"CLASSEMENT!$B97","v":0},{"$f":"CLASSEMENT!C97","v":0},{"$f":"CLASSEMENT!D97","v":" "},null,{"$f":"CLASSEMENT!F97","v":" "},{"$f":"CLASSEMENT!G97","v":" "},{"$f":"CLASSEMENT!H97","v":" "}]
[{"$f":"CLASSEMENT!$B98","v":0},{"$f":"CLASSEMENT!C98","v":0},{"$f":"CLASSEMENT!D98","v":"1ère Catégorie"},null,{"$f":"CLASSEMENT!F98","v":" "},{"$f":"CLASSEMENT!G98","v":" "},{"$f":"CLASSEMENT!H98","v":" "}]
[{"$f":"CLASSEMENT!$B99","v":1},{"$f":"CLASSEMENT!C99","v":4},{"$f":"CLASSEMENT!D99","v":"Allot   Sébastien"},null,{"$f":"CLASSEMENT!F99","v":"VS Ploumagoar"},{"$f":"CLASSEMENT!G99","v":1},{"$f":"CLASSEMENT!H99","v":""}]
[{"$f":"CLASSEMENT!$B100","v":2},{"$f":"CLASSEMENT!C100","v":8},{"$f":"CLASSEMENT!D100","v":"Le Ponner   Christophe"},null,{"$f":"CLASSEMENT!F100","v":"UC Plaudren"},{"$f":"CLASSEMENT!G100","v":1},{"$f":"CLASSEMENT!H100","v":""}]
[{"$f":"CLASSEMENT!$B101","v":3},{"$f":"CLASSEMENT!C101","v":2},{"$f":"CLASSEMENT!D101","v":"Coualan   Jordan"},null,{"$f":"CLASSEMENT!F101","v":"CC Pleven"},{"$f":"CLASSEMENT!G101","v":1},{"$f":"CLASSEMENT!H101","v":"511484"}]
[{"$f":"CLASSEMENT!$B102","v":4},{"$f":"CLASSEMENT!C102","v":6},{"$f":"CLASSEMENT!D102","v":"Le Bellego   Maxime"},null,{"$f":"CLASSEMENT!F102","v":"VTT du Lié"},{"$f":"CLASSEMENT!G102","v":1},{"$f":"CLASSEMENT!H102","v":"480114"}]
[{"$f":"CLASSEMENT!$B103","v":5},{"$f":"CLASSEMENT!C103","v":3},{"$f":"CLASSEMENT!D103","v":"Sieurin   Sébastien"},null,{"$f":"CLASSEMENT!F103","v":"VC Evron"},{"$f":"CLASSEMENT!G103","v":1},{"$f":"CLASSEMENT!H103","v":""}]
[{"$f":"CLASSEMENT!$B104","v":6},{"$f":"CLASSEMENT!C104","v":7},{"$f":"CLASSEMENT!D104","v":"Flégeau   David"},null,{"$f":"CLASSEMENT!F104","v":"Team Bikers 22"},{"$f":"CLASSEMENT!G104","v":1},{"$f":"CLASSEMENT!H104","v":"137996"}]
[{"$f":"CLASSEMENT!$B105","v":7},{"$f":"CLASSEMENT!C105","v":5},{"$f":"CLASSEMENT!D105","v":"Joannot   Jérémy"},null,{"$f":"CLASSEMENT!F105","v":"Team Broons"},{"$f":"CLASSEMENT!G105","v":1},{"$f":"CLASSEMENT!H105","v":"506026"}]
[{"$f":"CLASSEMENT!$B106","v":"absent"},{"$f":"CLASSEMENT!C106","v":1},{"$f":"CLASSEMENT!D106","v":"Saulnier   Florentin"},null,{"$f":"CLASSEMENT!F106","v":"CCV Beaussais"},{"$f":"CLASSEMENT!G106","v":1},{"$f":"CLASSEMENT!H106","v":"137523"}]
[{"$f":"CLASSEMENT!$B107","v":0},{"$f":"CLASSEMENT!C107","v":0},{"$f":"CLASSEMENT!D107","v":" "},null,{"$f":"CLASSEMENT!F107","v":" "},{"$f":"CLASSEMENT!G107","v":" "},{"$f":"CLASSEMENT!H107","v":" "}]
[{"$f":"CLASSEMENT!$B108","v":0},{"$f":"CLASSEMENT!C108","v":0},{"$f":"CLASSEMENT!D108","v":"Junior"},null,{"$f":"CLASSEMENT!F108","v":" "},{"$f":"CLASSEMENT!G108","v":" "},{"$f":"CLASSEMENT!H108","v":" "}]
[{"$f":"CLASSEMENT!$B109","v":0},{"$f":"CLASSEMENT!C109","v":20},{"$f":"CLASSEMENT!D109","v":"Ruffet   Titouan"},null,{"$f":"CLASSEMENT!F109","v":"CC Moncontour"},{"$f":"CLASSEMENT!G109","v":"junior"},{"$f":"CLASSEMENT!H109","v":"457920"}]
[{"$f":"CLASSEMENT!$B110","v":"absent"},{"$f":"CLASSEMENT!C110","v":21},{"$f":"CLASSEMENT!D110","v":"Le Masson   Hugo"},null,{"$f":"CLASSEMENT!F110","v":"VC Evron"},{"$f":"CLASSEMENT!G110","v":"Junior"},{"$f":"CLASSEMENT!H110","v":""}]
[{"$f":"CLASSEMENT!$B111","v":0},{"$f":"CLASSEMENT!C111","v":0},{"$f":"CLASSEMENT!D111","v":" "},null,{"$f":"CLASSEMENT!F111","v":" "},{"$f":"CLASSEMENT!G111","v":" "},{"$f":"CLASSEMENT!H111","v":" "}]
[{"$f":"CLASSEMENT!$B112","v":0},{"$f":"CLASSEMENT!C112","v":0},{"$f":"CLASSEMENT!D112","v":"Féminine"},null,{"$f":"CLASSEMENT!F112","v":" "},{"$f":"CLASSEMENT!G112","v":" "},{"$f":"CLASSEMENT!H112","v":" "}]
[{"$f":"CLASSEMENT!$B113","v":1},{"$f":"CLASSEMENT!C113","v":93},{"$f":"CLASSEMENT!D113","v":"Amice   Florine"},null,"Team Pays de Dinan",{"$f":"CLASSEMENT!G113","v":"féminine"},{"$f":"CLASSEMENT!H113","v":"137425"}]
[{"$f":"CLASSEMENT!$B114","v":2},{"$f":"CLASSEMENT!C114","v":91},{"$f":"CLASSEMENT!D114","v":"Rivolet   Agnes"},null,{"$f":"CLASSEMENT!F114","v":"VTT Côtes d'Armor Hillion"},{"$f":"CLASSEMENT!G114","v":"féminine"},{"$f":"CLASSEMENT!H114","v":"443442"}]
[{"$f":"CLASSEMENT!$B115","v":3},{"$f":"CLASSEMENT!C115","v":92},{"$f":"CLASSEMENT!D115","v":"Leray   Gwladys"},null,{"$f":"CLASSEMENT!F115","v":"Team XC du Léguer"},{"$f":"CLASSEMENT!G115","v":"féminine"},{"$f":"CLASSEMENT!H115","v":"359228"}]
[{"$f":"CLASSEMENT!$B116","v":"abandon"},{"$f":"CLASSEMENT!C116","v":90},{"$f":"CLASSEMENT!D116","v":"Camus   Kristell"},null,{"$f":"CLASSEMENT!F116","v":"VC Evron"},{"$f":"CLASSEMENT!G116","v":"féminine"},{"$f":"CLASSEMENT!H116","v":""}]

{"sheet":"FEUILLE RESULTATS","index":7,"n_rows":199,"n_cols":17,"rows_kept":199,"cut":false,"hidden":false,"merged":[[52,2,52,5],[51,2,51,5],[16,10,16,11],[17,10,17,11],[18,10,18,11],[49,2,49,5],[50,2,50,5],[20,10,20,11],[29,7,29,9],[23,7,23,9],[48,2,48,5],[47,9,47,12],[27,7,27,9],[28,7,28,9],[31,7,31,9],[18,7,18,9],[10,10,10,11],[11,10,11,11],[12,10,12,11],[6,0,6,13],[7,10,7,11],[7,12,7,13],[8,10,8,11],[9,10,9,11],[7,8,7,9],[7,6,7,7],[8,2,8,6],[9,7,9,9],[10,7,10,9],[8,7,8,9],[11,7,11,9],[12,7,12,9],[5,12,5,13],[1,3,1,9],[2,3,2,9],[4,0,4,2],[1,0,1,2],[2,0,2,2],[3,0,3,2],[5,0,5,1],[1,10,1,13],[2,10,2,13],[4,8,4,10],[4,3,4,7],[5,2,5,4],[5,5,5,6],[5,7,5,9],[5,10,5,11],[47,0,47,6],[39,0,39,1],[24,7,24,9],[25,7,25,9],[32,7,32,9],[33,7,33,9],[38,7,38,9],[34,7,34,9],[37,7,37,9],[30,7,30,9],[35,7,35,9],[36,7,36,9],[26,7,26,9],[15,7,15,9],[16,7,16,9],[13,7,13,9],[15,10,15,11],[17,7,17,9],[13,10,13,11],[37,10,37,11],[38,10,38,11],[33,10,33,11],[35,10,35,11],[27,10,27,11],[28,10,28,11],[32,10,32,11],[34,10,34,11],[36,10,36,11],[25,10,25,11],[29,10,29,11],[30,10,30,11],[31,10,31,11],[14,7,14,9],[26,10,26,11],[19,7,19,9],[24,10,24,11],[21,10,21,11],[22,10,22,11],[23,10,23,11],[14,10,14,11],[20,7,20,9],[21,7,21,9],[22,7,22,9],[19,10,19,11]]}
[null,null,null,null,null,null,null,null,null,null,null,null,null,null,null,null,"01:00:00"]
["NOM DE L'EPREUVE :",null,null,{"$f":"Inscription!D1","v":0},null,null,null,null,null,null,{"$f":"IF(Inscription!$D$4>0,\"DATE :  \"&TEXT(Inscription!D$4,\"jj mmmm aaaa\"),\"\")","v":"DATE :  30 novembre 2024"}]
["ORGANISATEUR :",null,null,{"$f":"Inscription!D3","v":"EC Créhen"}]
["SERIES / CATEGORIES :",null,null,{"$f":"Inscription!D5","v":0}]
["VILLE DE DEPART :",null,null,{"$f":"Inscription!D2","v":"cyclo cross de Créhen"},null,null,null,null,"DEPARTEMENT :",null,null,{"$f":"Inscription!G2","v":0}]
["ENGAGES :",null,{"$f":"Inscription!D8","v":0},null,null,"PARTANTS :",null,{"$f":"Inscription!F8","v":0},null,null,"CLASSES :",null,{"$f":"COUNTIF(A10:A39,\">0\")+COUNTIF(C40:N40,\">0\")+COUNTIF(A41:N47,\">0\")","v":78}]
["TABLEAU DE CLASSEMENT"]
[null,null,null,null,null,null,"MOYENNE",null,{"$f":"IF(N10>0,$M$8/$N$10*$Q$1,\"\")","v":{"$error":"#REF!"}},null,"DISTANCE :",null,{"$f":"Inscription!F7","v":0}]
["DOSS","Place","NOM et PRENOM",null,null,null,null,"CLUB",null,null,"N° LICENCE",null,"CAT.","TEMPS"]
[{"$f":"CLASSEMENT!C4","v":0},{"$f":"CLASSEMENT!$B4","v":0},{"$f":"IF(A10>0,CONCATENATE((VLOOKUP($A10,Inscription!$A$12:$G$211,3,FALSE)),\"   \",(VLOOKUP($A10,Inscription!$A$12:$G$211,4,FALSE))),\" \")","v":" "},null,null,null,null,{"$f":"IF(A10>0,(VLOOKUP($A10,Inscription!$A$12:$G$211,5,FALSE)),\" \")","v":" "},null,null,{"$f":"IF(A10>0,(VLOOKUP($A10,Inscription!$A$12:$G$211,7,FALSE)),\" \")","v":" "},null,{"$f":"IF(A10>0,(VLOOKUP($A10,Inscription!$A$12:$G$211,6,FALSE)),\" \")","v":" "},{"$f":"CLASSEMENT!#REF!","v":{"$error":"#REF!"}},{"$f":"SUM(A10:M10)","v":0},{"$f":"CLASSEMENT!C4","v":0}]
[{"$f":"CLASSEMENT!C5","v":170},{"$f":"CLASSEMENT!$B5","v":1},{"$f":"IF(A11>0,CONCATENATE((VLOOKUP($A11,Inscription!$A$12:$G$211,3,FALSE)),\"   \",(VLOOKUP($A11,Inscription!$A$12:$G$211,4,FALSE))),\" \")","v":"Brueziere   Eden"},null,null,null,null,{"$f":"IF(A11>0,(VLOOKUP($A11,Inscription!$A$12:$G$211,5,FALSE)),\" \")","v":"Team Bikers 22"},null,null,{"$f":"IF(A11>0,(VLOOKUP($A11,Inscription!$A$12:$G$211,7,FALSE)),\" \")","v":"moustique"},null,{"$f":"IF(A11>0,(VLOOKUP($A11,Inscription!$A$12:$G$211,6,FALSE)),\" \")","v":491634},{"$f":"IF(CLASSEMENT!#REF!=CLASSEMENT!#REF!,0,CLASSEMENT!#REF!-CLASSEMENT!#REF!)","v":{"$error":"#REF!"}},491805,{"$f":"CLASSEMENT!C5","v":170}]
[{"$f":"CLASSEMENT!C6","v":0},{"$f":"CLASSEMENT!$B6","v":0},{"$f":"IF(A12>0,CONCATENATE((VLOOKUP($A12,Inscription!$A$12:$G$211,3,FALSE)),\"   \",(VLOOKUP($A12,Inscription!$A$12:$G$211,4,FALSE))),\" \")","v":" "},null,null,null,null,{"$f":"IF(A12>0,(VLOOKUP($A12,Inscription!$A$12:$G$211,5,FALSE)),\" \")","v":" "},null,null,{"$f":"IF(A12>0,(VLOOKUP($A12,Inscription!$A$12:$G$211,7,FALSE)),\" \")","v":" "},null,{"$f":"IF(A12>0,(VLOOKUP($A12,Inscription!$A$12:$G$211,6,FALSE)),\" \")","v":" "},{"$f":"IF(CLASSEMENT!#REF!=CLASSEMENT!#REF!,0,CLASSEMENT!#REF!-CLASSEMENT!#REF!)","v":{"$error":"#REF!"}},0,{"$f":"CLASSEMENT!C6","v":0}]
[{"$f":"CLASSEMENT!C7","v":0},{"$f":"CLASSEMENT!$B7","v":0},{"$f":"IF(A13>0,CONCATENATE((VLOOKUP($A13,Inscription!$A$12:$G$211,3,FALSE)),\"   \",(VLOOKUP($A13,Inscription!$A$12:$G$211,4,FALSE))),\" \")","v":" "},null,null,null,null,{"$f":"IF(A13>0,(VLOOKUP($A13,Inscription!$A$12:$G$211,5,FALSE)),\" \")","v":" "},null,null,{"$f":"IF(A13>0,(VLOOKUP($A13,Inscription!$A$12:$G$211,7,FALSE)),\" \")","v":" "},null,{"$f":"IF(A13>0,(VLOOKUP($A13,Inscription!$A$12:$G$211,6,FALSE)),\" \")","v":" "},{"$f":"IF(CLASSEMENT!#REF!=CLASSEMENT!#REF!,0,CLASSEMENT!#REF!-CLASSEMENT!#REF!)","v":{"$error":"#REF!"}},0,{"$f":"CLASSEMENT!C7","v":0}]
[{"$f":"CLASSEMENT!C8","v":160},{"$f":"CLASSEMENT!$B8","v":1},{"$f":"IF(A14>0,CONCATENATE((VLOOKUP($A14,Inscription!$A$12:$G$211,3,FALSE)),\"   \",(VLOOKUP($A14,Inscription!$A$12:$G$211,4,FALSE))),\" \")","v":"Macé   Loukas"},null,null,null,null,{"$f":"IF(A14>0,(VLOOKUP($A14,Inscription!$A$12:$G$211,5,FALSE)),\" \")","v":"VC Evron"},null,null,{"$f":"IF(A14>0,(VLOOKUP($A14,Inscription!$A$12:$G$211,7,FALSE)),\" \")","v":"poussin"},null,{"$f":"IF(A14>0,(VLOOKUP($A14,Inscription!$A$12:$G$211,6,FALSE)),\" \")","v":396776},{"$f":"IF(CLASSEMENT!#REF!=CLASSEMENT!#REF!,0,CLASSEMENT!#REF!-CLASSEMENT!#REF!)","v":{"$error":"#REF!"}},396937,{"$f":"CLASSEMENT!C8","v":160}]
[{"$f":"CLASSEMENT!C9","v":161},{"$f":"CLASSEMENT!$B9","v":2},{"$f":"IF(A15>0,CONCATENATE((VLOOKUP($A15,Inscription!$A$12:$G$211,3,FALSE)),\"   \",(VLOOKUP($A15,Inscription!$A$12:$G$211,4,FALSE))),\" \")","v":"Leveque   Nathan"},null,null,null,null,{"$f":"IF(A15>0,(VLOOKUP($A15,Inscription!$A$12:$G$211,5,FALSE)),\" \")","v":"Lamball'breizh"},null,null,{"$f":"IF(A15>0,(VLOOKUP($A15,Inscription!$A$12:$G$211,7,FALSE)),\" \")","v":"poussin"},null,{"$f":"IF(A15>0,(VLOOKUP($A15,Inscription!$A$12:$G$211,6,FALSE)),\" \")","v":435105},{"$f":"IF(CLASSEMENT!#REF!=CLASSEMENT!#REF!,0,CLASSEMENT!#REF!-CLASSEMENT!#REF!)","v":{"$error":"#REF!"}},435268,{"$f":"CLASSEMENT!C9","v":161}]
[{"$f":"CLASSEMENT!C10","v":162},{"$f":"CLASSEMENT!$B10","v":3},{"$f":"IF(A16>0,CONCATENATE((VLOOKUP($A16,Inscription!$A$12:$G$211,3,FALSE)),\"   \",(VLOOKUP($A16,Inscription!$A$12:$G$211,4,FALSE))),\" \")","v":"Lévèque   Clément"},null,null,null,null,{"$f":"IF(A16>0,(VLOOKUP($A16,Inscription!$A$12:$G$211,5,FALSE)),\" \")","v":"Accro Cycles"},null,null,{"$f":"IF(A16>0,(VLOOKUP($A16,Inscription!$A$12:$G$211,7,FALSE)),\" \")","v":"poussin"},null,{"$f":"IF(A16>0,(VLOOKUP($A16,Inscription!$A$12:$G$211,6,FALSE)),\" \")","v":377265},{"$f":"IF(CLASSEMENT!#REF!=CLASSEMENT!#REF!,0,CLASSEMENT!#REF!-CLASSEMENT!#REF!)","v":{"$error":"#REF!"}},377430,{"$f":"CLASSEMENT!C10","v":162}]
[{"$f":"CLASSEMENT!C11","v":164},{"$f":"CLASSEMENT!$B11","v":4},{"$f":"IF(A17>0,CONCATENATE((VLOOKUP($A17,Inscription!$A$12:$G$211,3,FALSE)),\"   \",(VLOOKUP($A17,Inscription!$A$12:$G$211,4,FALSE))),\" \")","v":"Gouret   Louison"},null,null,null,null,{"$f":"IF(A17>0,(VLOOKUP($A17,Inscription!$A$12:$G$211,5,FALSE)),\" \")","v":"VC Evron"},null,null,{"$f":"IF(A17>0,(VLOOKUP($A17,Inscription!$A$12:$G$211,7,FALSE)),\" \")","v":"poussin"},null,{"$f":"IF(A17>0,(VLOOKUP($A17,Inscription!$A$12:$G$211,6,FALSE)),\" \")","v":0},{"$f":"IF(CLASSEMENT!#REF!=CLASSEMENT!#REF!,0,CLASSEMENT!#REF!-CLASSEMENT!#REF!)","v":{"$error":"#REF!"}},168,{"$f":"CLASSEMENT!C11","v":164}]
[{"$f":"CLASSEMENT!C12","v":163},{"$f":"CLASSEMENT!$B12","v":5},{"$f":"IF(A18>0,CONCATENATE((VLOOKUP($A18,Inscription!$A$12:$G$211,3,FALSE)),\"   \",(VLOOKUP($A18,Inscription!$A$12:$G$211,4,FALSE))),\" \")","v":"Vitel   Manoë"},null,null,null,null,{"$f":"IF(A18>0,(VLOOKUP($A18,Inscription!$A$12:$G$211,5,FALSE)),\" \")","v":"Team Bikers 22"},null,null,{"$f":"IF(A18>0,(VLOOKUP($A18,Inscription!$A$12:$G$211,7,FALSE)),\" \")","v":"Poussin"},null,{"$f":"IF(A18>0,(VLOOKUP($A18,Inscription!$A$12:$G$211,6,FALSE)),\" \")","v":0},{"$f":"IF(CLASSEMENT!#REF!=CLASSEMENT!#REF!,0,CLASSEMENT!#REF!-CLASSEMENT!#REF!)","v":{"$error":"#REF!"}},168,{"$f":"CLASSEMENT!C12","v":163}]
[{"$f":"CLASSEMENT!C13","v":165},{"$f":"CLASSEMENT!$B13","v":6},{"$f":"IF(A19>0,CONCATENATE((VLOOKUP($A19,Inscription!$A$12:$G$211,3,FALSE)),\"   \",(VLOOKUP($A19,Inscription!$A$12:$G$211,4,FALSE))),\" \")","v":"Raoult   Léon"},null,null,null,null,{"$f":"IF(A19>0,(VLOOKUP($A19,Inscription!$A$12:$G$211,5,FALSE)),\" \")","v":"VC Evron"},null,null,{"$f":"IF(A19>0,(VLOOKUP($A19,Inscription!$A$12:$G$211,7,FALSE)),\" \")","v":"poussin"},null,{"$f":"IF(A19>0,(VLOOKUP($A19,Inscription!$A$12:$G$211,6,FALSE)),\" \")","v":0},{"$f":"IF(CLASSEMENT!#REF!=CLASSEMENT!#REF!,0,CLASSEMENT!#REF!-CLASSEMENT!#REF!)","v":{"$error":"#REF!"}},171,{"$f":"CLASSEMENT!C13","v":165}]
[{"$f":"CLASSEMENT!C14","v":166},{"$f":"CLASSEMENT!$B14","v":7},{"$f":"IF(A20>0,CONCATENATE((VLOOKUP($A20,Inscription!$A$12:$G$211,3,FALSE)),\"   \",(VLOOKUP($A20,Inscription!$A$12:$G$211,4,FALSE))),\" \")","v":"Boilet   Malo"},null,null,null,null,{"$f":"IF(A20>0,(VLOOKUP($A20,Inscription!$A$12:$G$211,5,FALSE)),\" \")","v":"Lamball'breizh"},null,null,{"$f":"IF(A20>0,(VLOOKUP($A20,Inscription!$A$12:$G$211,7,FALSE)),\" \")","v":"poussin"},null,{"$f":"IF(A20>0,(VLOOKUP($A20,Inscription!$A$12:$G$211,6,FALSE)),\" \")","v":520459},{"$f":"IF(CLASSEMENT!#REF!=CLASSEMENT!#REF!,0,CLASSEMENT!#REF!-CLASSEMENT!#REF!)","v":{"$error":"#REF!"}},null,{"$f":"CLASSEMENT!C14","v":166}]
[{"$f":"CLASSEMENT!C15","v":0},{"$f":"CLASSEMENT!$B15","v":0},{"$f":"IF(A21>0,CONCATENATE((VLOOKUP($A21,Inscription!$A$12:$G$211,3,FALSE)),\"   \",(VLOOKUP($A21,Inscription!$A$12:$G$211,4,FALSE))),\" \")","v":" "},null,null,null,null,{"$f":"IF(A21>0,(VLOOKUP($A21,Inscription!$A$12:$G$211,5,FALSE)),\" \")","v":" "},null,null,{"$f":"IF(A21>0,(VLOOKUP($A21,Inscription!$A$12:$G$211,7,FALSE)),\" \")","v":" "},null,{"$f":"IF(A21>0,(VLOOKUP($A21,Inscription!$A$12:$G$211,6,FALSE)),\" \")","v":" "},{"$f":"IF(CLASSEMENT!#REF!=CLASSEMENT!#REF!,0,CLASSEMENT!#REF!-CLASSEMENT!#REF!)","v":{"$error":"#REF!"}},null,{"$f":"CLASSEMENT!C15","v":0}]
[{"$f":"CLASSEMENT!C16","v":0},{"$f":"CLASSEMENT!$B16","v":0},{"$f":"IF(A22>0,CONCATENATE((VLOOKUP($A22,Inscription!$A$12:$G$211,3,FALSE)),\"   \",(VLOOKUP($A22,Inscription!$A$12:$G$211,4,FALSE))),\" \")","v":" "},null,null,null,null,{"$f":"IF(A22>0,(VLOOKUP($A22,Inscription!$A$12:$G$211,5,FALSE)),\" \")","v":" "},null,null,{"$f":"IF(A22>0,(VLOOKUP($A22,Inscription!$A$12:$G$211,7,FALSE)),\" \")","v":" "},null,{"$f":"IF(A22>0,(VLOOKUP($A22,Inscription!$A$12:$G$211,6,FALSE)),\" \")","v":" "},{"$f":"IF(CLASSEMENT!#REF!=CLASSEMENT!#REF!,0,CLASSEMENT!#REF!-CLASSEMENT!#REF!)","v":{"$error":"#REF!"}},null,{"$f":"CLASSEMENT!C16","v":0}]
[{"$f":"CLASSEMENT!C17","v":140},{"$f":"CLASSEMENT!$B17","v":1},{"$f":"IF(A23>0,CONCATENATE((VLOOKUP($A23,Inscription!$A$12:$G$211,3,FALSE)),\"   \",(VLOOKUP($A23,Inscription!$A$12:$G$211,4,FALSE))),\" \")","v":"Meunier Le Breton   Lilwena"},null,null,null,null,{"$f":"IF(A23>0,(VLOOKUP($A23,Inscription!$A$12:$G$211,5,FALSE)),\" \")","v":"VTT Côtes D'Armor Hillion"},null,null,{"$f":"IF(A23>0,(VLOOKUP($A23,Inscription!$A$12:$G$211,7,FALSE)),\" \")","v":"pupille"},null,{"$f":"IF(A23>0,(VLOOKUP($A23,Inscription!$A$12:$G$211,6,FALSE)),\" \")","v":369755},{"$f":"IF(CLASSEMENT!#REF!=CLASSEMENT!#REF!,0,CLASSEMENT!#REF!-CLASSEMENT!#REF!)","v":{"$error":"#REF!"}},null,{"$f":"CLASSEMENT!C17","v":140}]
[{"$f":"CLASSEMENT!C18","v":0},{"$f":"CLASSEMENT!$B18","v":0},{"$f":"IF(A24>0,CONCATENATE((VLOOKUP($A24,Inscription!$A$12:$G$211,3,FALSE)),\"   \",(VLOOKUP($A24,Inscription!$A$12:$G$211,4,FALSE))),\" \")","v":" "},null,null,null,null,{"$f":"IF(A24>0,(VLOOKUP($A24,Inscription!$A$12:$G$211,5,FALSE)),\" \")","v":" "},null,null,{"$f":"IF(A24>0,(VLOOKUP($A24,Inscription!$A$12:$G$211,7,FALSE)),\" \")","v":" "},null,{"$f":"IF(A24>0,(VLOOKUP($A24,Inscription!$A$12:$G$211,6,FALSE)),\" \")","v":" "},{"$f":"IF(CLASSEMENT!#REF!=CLASSEMENT!#REF!,0,CLASSEMENT!#REF!-CLASSEMENT!#REF!)","v":{"$error":"#REF!"}},null,{"$f":"CLASSEMENT!C18","v":0}]
[{"$f":"CLASSEMENT!C19","v":0},{"$f":"CLASSEMENT!$B19","v":0},{"$f":"IF(A25>0,CONCATENATE((VLOOKUP($A25,Inscription!$A$12:$G$211,3,FALSE)),\"   \",(VLOOKUP($A25,Inscription!$A$12:$G$211,4,FALSE))),\" \")","v":" "},null,null,null,null,{"$f":"IF(A25>0,(VLOOKUP($A25,Inscription!$A$12:$G$211,5,FALSE)),\" \")","v":" "},null,null,{"$f":"IF(A25>0,(VLOOKUP($A25,Inscription!$A$12:$G$211,7,FALSE)),\" \")","v":" "},null,{"$f":"IF(A25>0,(VLOOKUP($A25,Inscription!$A$12:$G$211,6,FALSE)),\" \")","v":" "},{"$f":"IF(CLASSEMENT!#REF!=CLASSEMENT!#REF!,0,CLASSEMENT!#REF!-CLASSEMENT!#REF!)","v":{"$error":"#REF!"}},null,{"$f":"CLASSEMENT!C19","v":0}]
[{"$f":"CLASSEMENT!C20","v":142},{"$f":"CLASSEMENT!$B20","v":1},{"$f":"IF(A26>0,CONCATENATE((VLOOKUP($A26,Inscription!$A$12:$G$211,3,FALSE)),\"   \",(VLOOKUP($A26,Inscription!$A$12:$G$211,4,FALSE))),\" \")","v":"Rouillé Biard   Manech"},null,null,null,null,{"$f":"IF(A26>0,(VLOOKUP($A26,Inscription!$A$12:$G$211,5,FALSE)),\" \")","v":"VTT Côtes D'Armor Hillion"},null,null,{"$f":"IF(A26>0,(VLOOKUP($A26,Inscription!$A$12:$G$211,7,FALSE)),\" \")","v":"pupille"},null,{"$f":"IF(A26>0,(VLOOKUP($A26,Inscription!$A$12:$G$211,6,FALSE)),\" \")","v":451260},{"$f":"IF(CLASSEMENT!#REF!=CLASSEMENT!#REF!,0,CLASSEMENT!#REF!-CLASSEMENT!#REF!)","v":{"$error":"#REF!"}},null,{"$f":"CLASSEMENT!C20","v":142}]
[{"$f":"CLASSEMENT!C21","v":143},{"$f":"CLASSEMENT!$B21","v":2},{"$f":"IF(A27>0,CONCATENATE((VLOOKUP($A27,Inscription!$A$12:$G$211,3,FALSE)),\"   \",(VLOOKUP($A27,Inscription!$A$12:$G$211,4,FALSE))),\" \")","v":"Kowalski   Paul"},null,null,null,null,{"$f":"IF(A27>0,(VLOOKUP($A27,Inscription!$A$12:$G$211,5,FALSE)),\" \")","v":"Team Bikers 22"},null,null,{"$f":"IF(A27>0,(VLOOKUP($A27,Inscription!$A$12:$G$211,7,FALSE)),\" \")","v":"pupille"},null,{"$f":"IF(A27>0,(VLOOKUP($A27,Inscription!$A$12:$G$211,6,FALSE)),\" \")","v":460607},{"$f":"IF(CLASSEMENT!#REF!=CLASSEMENT!#REF!,0,CLASSEMENT!#REF!-CLASSEMENT!#REF!)","v":{"$error":"#REF!"}},null,{"$f":"CLASSEMENT!C21","v":143}]
[{"$f":"CLASSEMENT!C22","v":141},{"$f":"CLASSEMENT!$B22","v":3},{"$f":"IF(A28>0,CONCATENATE((VLOOKUP($A28,Inscription!$A$12:$G$211,3,FALSE)),\"   \",(VLOOKUP($A28,Inscription!$A$12:$G$211,4,FALSE))),\" \")","v":"Bruezière   Enzo"},null,null,null,null,{"$f":"IF(A28>0,(VLOOKUP($A28,Inscription!$A$12:$G$211,5,FALSE)),\" \")","v":"Team Bikers 22"},null,null,{"$f":"IF(A28>0,(VLOOKUP($A28,Inscription!$A$12:$G$211,7,FALSE)),\" \")","v":"pupille"},null,{"$f":"IF(A28>0,(VLOOKUP($A28,Inscription!$A$12:$G$211,6,FALSE)),\" \")","v":459065},{"$f":"IF(CLASSEMENT!#REF!=CLASSEMENT!#REF!,0,CLASSEMENT!#REF!-CLASSEMENT!#REF!)","v":{"$error":"#REF!"}},null,{"$f":"CLASSEMENT!C22","v":141}]
[{"$f":"CLASSEMENT!C23","v":144},{"$f":"CLASSEMENT!$B23","v":4},{"$f":"IF(A29>0,CONCATENATE((VLOOKUP($A29,Inscription!$A$12:$G$211,3,FALSE)),\"   \",(VLOOKUP($A29,Inscription!$A$12:$G$211,4,FALSE))),\" \")","v":"Devaux   Naël"},null,null,null,null,{"$f":"IF(A29>0,(VLOOKUP($A29,Inscription!$A$12:$G$211,5,FALSE)),\" \")","v":"Team Bikers 22"},null,null,{"$f":"IF(A29>0,(VLOOKUP($A29,Inscription!$A$12:$G$211,7,FALSE)),\" \")","v":"Pupille"},null,{"$f":"IF(A29>0,(VLOOKUP($A29,Inscription!$A$12:$G$211,6,FALSE)),\" \")","v":0},{"$f":"IF(CLASSEMENT!#REF!=CLASSEMENT!#REF!,0,CLASSEMENT!#REF!-CLASSEMENT!#REF!)","v":{"$error":"#REF!"}},null,{"$f":"CLASSEMENT!C23","v":144}]
[{"$f":"CLASSEMENT!C24","v":0},{"$f":"CLASSEMENT!$B24","v":0},{"$f":"IF(A30>0,CONCATENATE((VLOOKUP($A30,Inscription!$A$12:$G$211,3,FALSE)),\"   \",(VLOOKUP($A30,Inscription!$A$12:$G$211,4,FALSE))),\" \")","v":" "},null,null,null,null,{"$f":"IF(A30>0,(VLOOKUP($A30,Inscription!$A$12:$G$211,5,FALSE)),\" \")","v":" "},null,null,{"$f":"IF(A30>0,(VLOOKUP($A30,Inscription!$A$12:$G$211,7,FALSE)),\" \")","v":" "},null,{"$f":"IF(A30>0,(VLOOKUP($A30,Inscription!$A$12:$G$211,6,FALSE)),\" \")","v":" "},{"$f":"IF(CLASSEMENT!#REF!=CLASSEMENT!#REF!,0,CLASSEMENT!#REF!-CLASSEMENT!#REF!)","v":{"$error":"#REF!"}},null,{"$f":"CLASSEMENT!C24","v":0}]
[{"$f":"CLASSEMENT!C25","v":0},{"$f":"CLASSEMENT!$B25","v":0},{"$f":"IF(A31>0,CONCATENATE((VLOOKUP($A31,Inscription!$A$12:$G$211,3,FALSE)),\"   \",(VLOOKUP($A31,Inscription!$A$12:$G$211,4,FALSE))),\" \")","v":" "},null,null,null,null,{"$f":"IF(A31>0,(VLOOKUP($A31,Inscription!$A$12:$G$211,5,FALSE)),\" \")","v":" "},null,null,{"$f":"IF(A31>0,(VLOOKUP($A31,Inscription!$A$12:$G$211,7,FALSE)),\" \")","v":" "},null,{"$f":"IF(A31>0,(VLOOKUP($A31,Inscription!$A$12:$G$211,6,FALSE)),\" \")","v":" "},{"$f":"IF(CLASSEMENT!#REF!=CLASSEMENT!#REF!,0,CLASSEMENT!#REF!-CLASSEMENT!#REF!)","v":{"$error":"#REF!"}},null,{"$f":"CLASSEMENT!C25","v":0}]
[{"$f":"CLASSEMENT!C26","v":124},{"$f":"CLASSEMENT!$B26","v":1},{"$f":"IF(A32>0,CONCATENATE((VLOOKUP($A32,Inscription!$A$12:$G$211,3,FALSE)),\"   \",(VLOOKUP($A32,Inscription!$A$12:$G$211,4,FALSE))),\" \")","v":"Callennec   Lucy"},null,null,null,null,{"$f":"IF(A32>0,(VLOOKUP($A32,Inscription!$A$12:$G$211,5,FALSE)),\" \")","v":"Bégard VTT Gwerun"},null,null,{"$f":"IF(A32>0,(VLOOKUP($A32,Inscription!$A$12:$G$211,7,FALSE)),\" \")","v":"Benjamin"},null,{"$f":"IF(A32>0,(VLOOKUP($A32,Inscription!$A$12:$G$211,6,FALSE)),\" \")","v":509013},{"$f":"IF(CLASSEMENT!#REF!=CLASSEMENT!#REF!,0,CLASSEMENT!#REF!-CLASSEMENT!#REF!)","v":{"$error":"#REF!"}},null,{"$f":"CLASSEMENT!C26","v":124}]
[{"$f":"CLASSEMENT!C27","v":121},{"$f":"CLASSEMENT!$B27","v":"absent"},{"$f":"IF(A33>0,CONCATENATE((VLOOKUP($A33,Inscription!$A$12:$G$211,3,FALSE)),\"   \",(VLOOKUP($A33,Inscription!$A$12:$G$211,4,FALSE))),\" \")","v":"Croisier   Léa"},null,null,null,null,{"$f":"IF(A33>0,(VLOOKUP($A33,Inscription!$A$12:$G$211,5,FALSE)),\" \")","v":"Team Pays de Dinan"},null,null,{"$f":"IF(A33>0,(VLOOKUP($A33,Inscription!$A$12:$G$211,7,FALSE)),\" \")","v":"Benjamin"},null,{"$f":"IF(A33>0,(VLOOKUP($A33,Inscription!$A$12:$G$211,6,FALSE)),\" \")","v":263040},{"$f":"IF(CLASSEMENT!#REF!=CLASSEMENT!#REF!,0,CLASSEMENT!#REF!-CLASSEMENT!#REF!)","v":{"$error":"#REF!"}},null,{"$f":"CLASSEMENT!C27","v":121}]
[{"$f":"CLASSEMENT!C28","v":0},{"$f":"CLASSEMENT!$B28","v":0},{"$f":"IF(A34>0,CONCATENATE((VLOOKUP($A34,Inscription!$A$12:$G$211,3,FALSE)),\"   \",(VLOOKUP($A34,Inscription!$A$12:$G$211,4,FALSE))),\" \")","v":" "},null,null,null,null,{"$f":"IF(A34>0,(VLOOKUP($A34,Inscription!$A$12:$G$211,5,FALSE)),\" \")","v":" "},null,null,{"$f":"IF(A34>0,(VLOOKUP($A34,Inscription!$A$12:$G$211,7,FALSE)),\" \")","v":" "},null,{"$f":"IF(A34>0,(VLOOKUP($A34,Inscription!$A$12:$G$211,6,FALSE)),\" \")","v":" "},{"$f":"IF(CLASSEMENT!#REF!=CLASSEMENT!#REF!,0,CLASSEMENT!#REF!-CLASSEMENT!#REF!)","v":{"$error":"#REF!"}},null,{"$f":"CLASSEMENT!C28","v":0}]
[{"$f":"CLASSEMENT!C29","v":0},{"$f":"CLASSEMENT!$B29","v":0},{"$f":"IF(A35>0,CONCATENATE((VLOOKUP($A35,Inscription!$A$12:$G$211,3,FALSE)),\"   \",(VLOOKUP($A35,Inscription!$A$12:$G$211,4,FALSE))),\" \")","v":" "},null,null,null,null,{"$f":"IF(A35>0,(VLOOKUP($A35,Inscription!$A$12:$G$211,5,FALSE)),\" \")","v":" "},null,null,{"$f":"IF(A35>0,(VLOOKUP($A35,Inscription!$A$12:$G$211,7,FALSE)),\" \")","v":" "},null,{"$f":"IF(A35>0,(VLOOKUP($A35,Inscription!$A$12:$G$211,6,FALSE)),\" \")","v":" "},{"$f":"IF(CLASSEMENT!#REF!=CLASSEMENT!#REF!,0,CLASSEMENT!#REF!-CLASSEMENT!#REF!)","v":{"$error":"#REF!"}},null,{"$f":"CLASSEMENT!C29","v":0}]
[{"$f":"CLASSEMENT!C30","v":133},{"$f":"CLASSEMENT!$B30","v":1},{"$f":"IF(A36>0,CONCATENATE((VLOOKUP($A36,Inscription!$A$12:$G$211,3,FALSE)),\"   \",(VLOOKUP($A36,Inscription!$A$12:$G$211,4,FALSE))),\" \")","v":"Cadieu   Gabriel"},null,null,null,null,{"$f":"IF(A36>0,(VLOOKUP($A36,Inscription!$A$12:$G$211,5,FALSE)),\" \")","v":"VTT du Lié"},null,null,{"$f":"IF(A36>0,(VLOOKUP($A36,Inscription!$A$12:$G$211,7,FALSE)),\" \")","v":"benjamin"},null,{"$f":"IF(A36>0,(VLOOKUP($A36,Inscription!$A$12:$G$211,6,FALSE)),\" \")","v":0},{"$f":"IF(CLASSEMENT!#REF!=CLASSEMENT!#REF!,0,CLASSEMENT!#REF!-CLASSEMENT!#REF!)","v":{"$error":"#REF!"}},null,{"$f":"CLASSEMENT!C30","v":133}]
[{"$f":"CLASSEMENT!C31","v":120},{"$f":"CLASSEMENT!$B31","v":2},{"$f":"IF(A37>0,CONCATENATE((VLOOKUP($A37,Inscription!$A$12:$G$211,3,FALSE)),\"   \",(VLOOKUP($A37,Inscription!$A$12:$G$211,4,FALSE))),\" \")","v":"Briand   Axel"},null,null,null,null,{"$f":"IF(A37>0,(VLOOKUP($A37,Inscription!$A$12:$G$211,5,FALSE)),\" \")","v":"VC Evron"},null,null,{"$f":"IF(A37>0,(VLOOKUP($A37,Inscription!$A$12:$G$211,7,FALSE)),\" \")","v":"Benjamin"},null,{"$f":"IF(A37>0,(VLOOKUP($A37,Inscription!$A$12:$G$211,6,FALSE)),\" \")","v":429219},{"$f":"IF(CLASSEMENT!#REF!=CLASSEMENT!#REF!,0,CLASSEMENT!#REF!-CLASSEMENT!#REF!)","v":{"$error":"#REF!"}},null,{"$f":"CLASSEMENT!C31","v":120}]
[{"$f":"CLASSEMENT!C32","v":122},{"$f":"CLASSEMENT!$B32","v":3},{"$f":"IF(A38>0,CONCATENATE((VLOOKUP($A38,Inscription!$A$12:$G$211,3,FALSE)),\"   \",(VLOOKUP($A38,Inscription!$A$12:$G$211,4,FALSE))),\" \")","v":"Huguet   Mathis"},null,null,null,null,{"$f":"IF(A38>0,(VLOOKUP($A38,Inscription!$A$12:$G$211,5,FALSE)),\" \")","v":"Team Bikers 22"},null,null,{"$f":"IF(A38>0,(VLOOKUP($A38,Inscription!$A$12:$G$211,7,FALSE)),\" \")","v":"Benjamin"},null,{"$f":"IF(A38>0,(VLOOKUP($A38,Inscription!$A$12:$G$211,6,FALSE)),\" \")","v":390457},{"$f":"IF(CLASSEMENT!#REF!=CLASSEMENT!#REF!,0,CLASSEMENT!#REF!-CLASSEMENT!#REF!)","v":{"$error":"#REF!"}},null,{"$f":"CLASSEMENT!C32","v":122}]
[{"$f":"CLASSEMENT!C33","v":126},{"$f":"CLASSEMENT!$B33","v":4},{"$f":"IF(A39>0,CONCATENATE((VLOOKUP($A39,Inscription!$A$12:$G$211,3,FALSE)),\"   \",(VLOOKUP($A39,Inscription!$A$12:$G$211,4,FALSE))),\" \")","v":"Lanoé   Hugo"},null,null,null,null,{"$f":"IF(A39>0,(VLOOKUP($A39,Inscription!$A$12:$G$211,5,FALSE)),\" \")","v":"VC Evron"},null,null,{"$f":"IF(A39>0,(VLOOKUP($A39,Inscription!$A$12:$G$211,7,FALSE)),\" \")","v":"Benjamin"},null,{"$f":"IF(A39>0,(VLOOKUP($A39,Inscription!$A$12:$G$211,6,FALSE)),\" \")","v":382435},{"$f":"IF(CLASSEMENT!#REF!=CLASSEMENT!#REF!,0,CLASSEMENT!#REF!-CLASSEMENT!#REF!)","v":{"$error":"#REF!"}},null,{"$f":"CLASSEMENT!C33","v":126}]
["SUITE : ",null,{"$f":"$P40","v":123},{"$f":"$P41","v":125},{"$f":"P42","v":128},{"$f":"P43","v":132},{"$f":"P44","v":127},{"$f":"P45","v":131},{"$f":"P46","v":130},{"$f":"P47","v":129},{"$f":"P48","v":{"$error":"#REF!"}},{"$f":"P49","v":{"$error":"#REF!"}},{"$f":"P50","v":{"$error":"#REF!"}},{"$f":"P51","v":0},null,{"$f":"CLASSEMENT!C34","v":123}]
[{"$f":"P52","v":110},{"$f":"P53","v":112},{"$f":"$P54","v":111},{"$f":"P55","v":115},{"$f":"P56","v":114},{"$f":"P57","v":0},{"$f":"P58","v":0},{"$f":"P59","v":0},{"$f":"P60","v":101},{"$f":"$P$61","v":104},{"$f":"$P$62","v":100},{"$f":"$P$63","v":105},{"$f":"$P$64","v":102},{"$f":"$P$65","v":103},null,{"$f":"CLASSEMENT!C35","v":125}]
[{"$f":"$P$66","v":0},{"$f":"$P$67","v":0},{"$f":"$P68","v":0},{"$f":"$P$69","v":0},{"$f":"$P$70","v":0},{"$f":"$P$71","v":0},{"$f":"$P$72","v":61},{"$f":"$P$73","v":71},{"$f":"$P$74","v":74},{"$f":"$P$75","v":65},{"$f":"$P$76","v":76},{"$f":"$P$77","v":75},{"$f":"$P$78","v":73},{"$f":"$P$79","v":72},null,{"$f":"CLASSEMENT!C36","v":128}]
[{"$f":"$P$80","v":67},{"$f":"$P$81","v":63},{"$f":"$P82","v":64},{"$f":"$P$83","v":77},{"$f":"$P$84","v":70},{"$f":"$P$85","v":68},{"$f":"$P$86","v":78},{"$f":"$P$87","v":0},{"$f":"$P$88","v":0},{"$f":"$P$89","v":34},{"$f":"$P$90","v":31},{"$f":"$P$91","v":41},{"$f":"$P$92","v":30},{"$f":"$P$93","v":33},null,{"$f":"CLASSEMENT!C37","v":132}]
[{"$f":"$P$94","v":32},{"$f":"$P$95","v":37},{"$f":"$P96","v":35},{"$f":"$P$97","v":36},{"$f":"$P$98","v":38},{"$f":"$P$99","v":39},{"$f":"$P$100","v":0},{"$f":"$P$101","v":0},{"$f":"$P$102","v":0},{"$f":"$P$103","v":0},{"$f":"$P$104","v":4},{"$f":"$P$105","v":8},{"$f":"$P$106","v":2},{"$f":"$P$107","v":6},null,{"$f":"CLASSEMENT!C38","v":127}]
[{"$f":"$P$108","v":3},{"$f":"$P$109","v":7},{"$f":"$P110","v":5},{"$f":"$P$111","v":1},{"$f":"$P$112","v":0},{"$f":"$P$113","v":0},{"$f":"$P$114","v":20},{"$f":"$P$115","v":21},{"$f":"$P$116","v":0},{"$f":"$P$117","v":0},{"$f":"$P$118","v":93},{"$f":"$P$119","v":91},{"$f":"$P$120","v":92},{"$f":"$P$121","v":90},null,{"$f":"CLASSEMENT!C39","v":131}]
[{"$f":"$P$122","v":{"$error":"#REF!"}},{"$f":"$P$123","v":{"$error":"#REF!"}},{"$f":"$P124","v":{"$error":"#REF!"}},{"$f":"$P$125","v":{"$error":"#REF!"}},{"$f":"$P$126","v":0},{"$f":"$P$127","v":0},{"$f":"$P$128","v":0},{"$f":"$P$129","v":0},{"$f":"$P$130","v":0},{"$f":"$P$131","v":0},{"$f":"$P$132","v":0},{"$f":"$P$133","v":0},{"$f":"$P$134","v":0},{"$f":"$P$135","v":0},null,{"$f":"CLASSEMENT!C40","v":130}]
[{"$f":"$P$136","v":0},{"$f":"$P$137","v":0},{"$f":"$P138","v":0},{"$f":"$P$139","v":0},{"$f":"$P$140","v":0},{"$f":"$P$141","v":0},{"$f":"$P$142","v":0},{"$f":"$P$143","v":0},{"$f":"$P$144","v":0},{"$f":"$P$145","v":0},{"$f":"$P$146","v":0},{"$f":"$P$147","v":0},{"$f":"$P$148","v":0},{"$f":"$P$149","v":0},null,{"$f":"CLASSEMENT!C41","v":129}]
[{"$f":"IF(Inscription!G6=\"oui\",\"CHALLENGE\",\"Meilleurs Animateurs\")","v":"Meilleurs Animateurs"},{"$f":"IF(Inscription!G4=\"oui\",\"CHALLENGE\",\"PRIX D EQUIPE\")","v":"PRIX D EQUIPE"},{"$f":"IF(Inscription!#REF!=\"oui\",\"CHALLENGE\",\"PRIX D EQUIPE\")","v":{"$error":"#REF!"}},{"$f":"IF(Inscription!#REF!=\"oui\",\"CHALLENGE\",\"PRIX D EQUIPE\")","v":{"$error":"#REF!"}},{"$f":"IF(Inscription!H4=\"oui\",\"CHALLENGE\",\"PRIX D EQUIPE\")","v":"PRIX D EQUIPE"},{"$f":"IF(Inscription!I4=\"oui\",\"CHALLENGE\",\"PRIX D EQUIPE\")","v":"PRIX D EQUIPE"},{"$f":"IF(Inscription!J4=\"oui\",\"CHALLENGE\",\"PRIX D EQUIPE\")","v":"PRIX D EQUIPE"},null,null,"Nombre de clubs engagés",null,null,null,{"$f":"COUNTA('PRIX D EQUIPE'!B5:B39)","v":0},null,{"$f":"CLASSEMENT!#REF!","v":{"$error":"#REF!"}}]
[null,"1er",{"$f":"IF(CLASSEMENT!AB45>0,CLASSEMENT!AB45,\" \")","v":" "},null,null,null,{"$f":"CLASSEMENT!AD45","v":1000},"+",{"$f":"CLASSEMENT!AF45","v":1000},"+",{"$f":"CLASSEMENT!AH45","v":1000},"=",{"$f":"IF(C49=\" \",\" \",IF(I49>200,G49,IF(K49>200,SUM(G49+I49),IF($C49>0,SUM(G49+I49+K49),\" \"))))","v":" "},{"$f":"IF(C49=\" \",\" \",IF(I49>200,\"(1H.)\",IF(K49>200,\"(2 H.)\",\" \")))","v":" "},null,{"$f":"CLASSEMENT!#REF!","v":{"$error":"#REF!"}}]
[null,"2e",{"$f":"IF(CLASSEMENT!AB46>0,CLASSEMENT!AB46,\" \")","v":" "},null,null,null,{"$f":"CLASSEMENT!AD46","v":1000},"+",{"$f":"CLASSEMENT!AF46","v":1000},"+",{"$f":"CLASSEMENT!AH46","v":1000},"=",{"$f":"IF(C50=\" \",\" \",IF(I50>200,G50,IF(K50>200,SUM(G50+I50),IF($C50>0,SUM(G50+I50+K50),\" \"))))","v":" "},{"$f":"IF(C50=\" \",\" \",IF(I50>200,\"(1H.)\",IF(K50>200,\"(2 H.)\",\" \")))","v":" "},null,{"$f":"CLASSEMENT!#REF!","v":{"$error":"#REF!"}}]
[null,"3e",{"$f":"IF(CLASSEMENT!AB47>0,CLASSEMENT!AB47,\" \")","v":" "},null,null,null,{"$f":"CLASSEMENT!AD47","v":1000},"+",{"$f":"CLASSEMENT!AF47","v":1000},"+",{"$f":"CLASSEMENT!AH47","v":1000},"=",{"$f":"IF(C51=\" \",\" \",IF(I51>200,G51,IF(K51>200,SUM(G51+I51),IF($C51>0,SUM(G51+I51+K51),\" \"))))","v":" "},{"$f":"IF(C51=\" \",\" \",IF(I51>200,\"(1H.)\",IF(K51>200,\"(2 H.)\",\" \")))","v":" "},null,{"$f":"CLASSEMENT!C45","v":0}]
[null,"4e",{"$f":"IF(CLASSEMENT!AB48>0,CLASSEMENT!AB48,\" \")","v":" "},null,null,null,{"$f":"CLASSEMENT!AD48","v":1000},"+",{"$f":"CLASSEMENT!AF48","v":1000},"+",{"$f":"CLASSEMENT!AH48","v":1000},"=",{"$f":"IF(C52=\" \",\" \",IF(I52>200,G52,IF(K52>200,SUM(G52+I52),IF($C52>0,SUM(G52+I52+K52),\" \"))))","v":" "},{"$f":"IF(C52=\" \",\" \",IF(I52>200,\"(1H.)\",IF(K52>200,\"(2 H.)\",\" \")))","v":" "},null,{"$f":"CLASSEMENT!C46","v":110}]
[null,"5e",{"$f":"IF(CLASSEMENT!AB49>0,CLASSEMENT!AB49,\" \")","v":" "},null,null,null,{"$f":"CLASSEMENT!AD49","v":1000},"+",{"$f":"CLASSEMENT!AF49","v":1000},"+",{"$f":"CLASSEMENT!AH49","v":1000},"=",{"$f":"IF(C53=\" \",\" \",IF(I53>200,G53,IF(K53>200,SUM(G53+I53),IF($C53>0,SUM(G53+I53+K53),\" \"))))","v":" "},{"$f":"IF(C53=\" \",\" \",IF(I53>200,\"(1H.)\",IF(K53>200,\"(2 H.)\",\" \")))","v":" "},null,{"$f":"CLASSEMENT!C47","v":112}]
[null,null,null,null,null,null,null,null,null,null,null,null,null,null,null,{"$f":"CLASSEMENT!C48","v":111}]
[null,null,null,null,null,null,null,null,null,null,null,null,null,null,null,{"$f":"CLASSEMENT!C49","v":115}]
[null,null,null,null,null,null,null,null,null,null,null,null,null,null,null,{"$f":"CLASSEMENT!C50","v":114}]
[null,null,null,null,null,null,null,null,null,null,null,null,null,null,null,{"$f":"CLASSEMENT!C52","v":0}]
[null,null,null,null,null,null,null,null,null,null,null,null,null,null,null,{"$f":"CLASSEMENT!C53","v":0}]
[null,null,null,null,null,null,null,null,null,null,null,null,null,null,null,{"$f":"CLASSEMENT!C54","v":0}]
[null,null,null,null,null,null,null,null,null,null,null,null,null,null,null,{"$f":"CLASSEMENT!C55","v":101}]
[null,null,null,null,null,null,null,null,null,null,null,null,null,null,null,{"$f":"CLASSEMENT!C56","v":104}]
[null,null,null,null,null,null,null,null,null,null,null,null,null,null,null,{"$f":"CLASSEMENT!C57","v":100}]
[null,null,null,null,null,null,null,null,null,null,null,null,null,null,null,{"$f":"CLASSEMENT!C58","v":105}]
[null,null,null,null,null,null,null,null,null,null,null,null,null,null,null,{"$f":"CLASSEMENT!C59","v":102}]
[null,null,null,null,null,null,null,null,null,null,null,null,null,null,null,{"$f":"CLASSEMENT!C60","v":103}]
[null,null,null,null,null,null,null,null,null,null,null,null,null,null,null,{"$f":"CLASSEMENT!C61","v":0}]
[null,null,null,null,null,null,null,null,null,null,null,null,null,null,null,{"$f":"CLASSEMENT!C62","v":0}]
[null,null,null,null,null,null,null,null,null,null,null,null,null,null,null,{"$f":"CLASSEMENT!C117","v":0}]
[null,null,null,null,null,null,null,null,null,null,null,null,null,null,null,{"$f":"CLASSEMENT!C118","v":0}]
[null,null,null,null,null,null,null,null,null,null,null,null,null,null,null,{"$f":"CLASSEMENT!C119","v":0}]
[null,null,null,null,null,null,null,null,null,null,null,null,null,null,null,{"$f":"CLASSEMENT!C120","v":0}]
[null,null,null,null,null,null,null,null,null,null,null,null,null,null,null,{"$f":"CLASSEMENT!C67","v":61}]
[null,null,null,null,null,null,null,null,null,null,null,null,null,null,null,{"$f":"CLASSEMENT!C68","v":71}]
[null,null,null,null,null,null,null,null,null,null,null,null,null,null,null,{"$f":"CLASSEMENT!C69","v":74}]
[null,null,null,null,null,null,null,null,null,null,null,null,null,null,null,{"$f":"CLASSEMENT!C70","v":65}]
[null,null,null,null,null,null,null,null,null,null,null,null,null,null,null,{"$f":"CLASSEMENT!C71","v":76}]
[null,null,null,null,null,null,null,null,null,null,null,null,null,null,null,{"$f":"CLASSEMENT!C72","v":75}]
[null,null,null,null,null,null,null,null,null,null,null,null,null,null,null,{"$f":"CLASSEMENT!C73","v":73}]
[null,null,null,null,null,null,null,null,null,null,null,null,null,null,null,{"$f":"CLASSEMENT!C74","v":72}]
[null,null,null,null,null,null,null,null,null,null,null,null,null,null,null,{"$f":"CLASSEMENT!C75","v":67}]
[null,null,null,null,null,null,null,null,null,null,null,null,null,null,null,{"$f":"CLASSEMENT!C76","v":63}]
[null,null,null,null,null,null,null,null,null,null,null,null,null,null,null,{"$f":"CLASSEMENT!C77","v":64}]
[null,null,null,null,null,null,null,null,null,null,null,null,null,null,null,{"$f":"CLASSEMENT!C78","v":77}]
[null,null,null,null,null,null,null,null,null,null,null,null,null,null,null,{"$f":"CLASSEMENT!C79","v":70}]
[null,null,null,null,null,null,null,null,null,null,null,null,null,null,null,{"$f":"CLASSEMENT!C80","v":68}]
[null,null,null,null,null,null,null,null,null,null,null,null,null,null,null,{"$f":"CLASSEMENT!C81","v":78}]
[null,null,null,null,null,null,null,null,null,null,null,null,null,null,null,{"$f":"CLASSEMENT!C82","v":0}]
[null,null,null,null,null,null,null,null,null,null,null,null,null,null,null,{"$f":"CLASSEMENT!C83","v":0}]
[null,null,null,null,null,null,null,null,null,null,null,null,null,null,null,{"$f":"CLASSEMENT!C84","v":34}]
[null,null,null,null,null,null,null,null,null,null,null,null,null,null,null,{"$f":"CLASSEMENT!C85","v":31}]
[null,null,null,null,null,null,null,null,null,null,null,null,null,null,null,{"$f":"CLASSEMENT!C86","v":41}]
[null,null,null,null,null,null,null,null,null,null,null,null,null,null,null,{"$f":"CLASSEMENT!C87","v":30}]
[null,null,null,null,null,null,null,null,null,null,null,null,null,null,null,{"$f":"CLASSEMENT!C88","v":33}]
[null,null,null,null,null,null,null,null,null,null,null,null,null,null,null,{"$f":"CLASSEMENT!C89","v":32}]
[null,null,null,null,null,null,null,null,null,null,null,null,null,null,null,{"$f":"CLASSEMENT!C90","v":37}]
[null,null,null,null,null,null,null,null,null,null,null,null,null,null,null,{"$f":"CLASSEMENT!C91","v":35}]
[null,null,null,null,null,null,null,null,null,null,null,null,null,null,null,{"$f":"CLASSEMENT!C92","v":36}]
[null,null,null,null,null,null,null,null,null,null,null,null,null,null,null,{"$f":"CLASSEMENT!C93","v":38}]
[null,null,null,null,null,null,null,null,null,null,null,null,null,null,null,{"$f":"CLASSEMENT!C94","v":39}]
[null,null,null,null,null,null,null,null,null,null,null,null,null,null,null,{"$f":"CLASSEMENT!C95","v":0}]
[null,null,null,null,null,null,null,null,null,null,null,null,null,null,null,{"$f":"CLASSEMENT!C96","v":0}]
[null,null,null,null,null,null,null,null,null,null,null,null,null,null,null,{"$f":"CLASSEMENT!C97","v":0}]
[null,null,null,null,null,null,null,null,null,null,null,null,null,null,null,{"$f":"CLASSEMENT!C98","v":0}]
[null,null,null,null,null,null,null,null,null,null,null,null,null,null,null,{"$f":"CLASSEMENT!C99","v":4}]
[null,null,null,null,null,null,null,null,null,null,null,null,null,null,null,{"$f":"CLASSEMENT!C100","v":8}]
[null,null,null,null,null,null,null,null,null,null,null,null,null,null,null,{"$f":"CLASSEMENT!C101","v":2}]
[null,null,null,null,null,null,null,null,null,null,null,null,null,null,null,{"$f":"CLASSEMENT!C102","v":6}]
[null,null,null,null,null,null,null,null,null,null,null,null,null,null,null,{"$f":"CLASSEMENT!C103","v":3}]
[null,null,null,null,null,null,null,null,null,null,null,null,null,null,null,{"$f":"CLASSEMENT!C104","v":7}]
[null,null,null,null,null,null,null,null,null,null,null,null,null,null,null,{"$f":"CLASSEMENT!C105","v":5}]
[null,null,null,null,null,null,null,null,null,null,null,null,null,null,null,{"$f":"CLASSEMENT!C106","v":1}]
[null,null,null,null,null,null,null,null,null,null,null,null,null,null,null,{"$f":"CLASSEMENT!C107","v":0}]
[null,null,null,null,null,null,null,null,null,null,null,null,null,null,null,{"$f":"CLASSEMENT!C108","v":0}]
[null,null,null,null,null,null,null,null,null,null,null,null,null,null,null,{"$f":"CLASSEMENT!C109","v":20}]
[null,null,null,null,null,null,null,null,null,null,null,null,null,null,null,{"$f":"CLASSEMENT!C110","v":21}]
[null,null,null,null,null,null,null,null,null,null,null,null,null,null,null,{"$f":"CLASSEMENT!C111","v":0}]
[null,null,null,null,null,null,null,null,null,null,null,null,null,null,null,{"$f":"CLASSEMENT!C112","v":0}]
[null,null,null,null,null,null,null,null,null,null,null,null,null,null,null,{"$f":"CLASSEMENT!C113","v":93}]
[null,null,null,null,null,null,null,null,null,null,null,null,null,null,null,{"$f":"CLASSEMENT!C114","v":91}]
[null,null,null,null,null,null,null,null,null,null,null,null,null,null,null,{"$f":"CLASSEMENT!C115","v":92}]
[null,null,null,null,null,null,null,null,null,null,null,null,null,null,null,{"$f":"CLASSEMENT!C116","v":90}]
[null,null,null,null,null,null,null,null,null,null,null,null,null,null,null,{"$f":"CLASSEMENT!#REF!","v":{"$error":"#REF!"}}]
[null,null,null,null,null,null,null,null,null,null,null,null,null,null,null,{"$f":"CLASSEMENT!#REF!","v":{"$error":"#REF!"}}]
[null,null,null,null,null,null,null,null,null,null,null,null,null,null,null,{"$f":"CLASSEMENT!#REF!","v":{"$error":"#REF!"}}]
[null,null,null,null,null,null,null,null,null,null,null,null,null,null,null,{"$f":"CLASSEMENT!#REF!","v":{"$error":"#REF!"}}]
[null,null,null,null,null,null,null,null,null,null,null,null,null,null,null,{"$f":"CLASSEMENT!C121","v":0}]
[null,null,null,null,null,null,null,null,null,null,null,null,null,null,null,{"$f":"CLASSEMENT!C122","v":0}]
[null,null,null,null,null,null,null,null,null,null,null,null,null,null,null,{"$f":"CLASSEMENT!C123","v":0}]
[null,null,null,null,null,null,null,null,null,null,null,null,null,null,null,{"$f":"CLASSEMENT!C124","v":0}]
[null,null,null,null,null,null,null,null,null,null,null,null,null,null,null,{"$f":"CLASSEMENT!C125","v":0}]
[null,null,null,null,null,null,null,null,null,null,null,null,null,null,null,{"$f":"CLASSEMENT!C126","v":0}]
[null,null,null,null,null,null,null,null,null,null,null,null,null,null,null,{"$f":"CLASSEMENT!C127","v":0}]
[null,null,null,null,null,null,null,null,null,null,null,null,null,null,null,{"$f":"CLASSEMENT!C128","v":0}]
[null,null,null,null,null,null,null,null,null,null,null,null,null,null,null,{"$f":"CLASSEMENT!C129","v":0}]
[null,null,null,null,null,null,null,null,null,null,null,null,null,null,null,{"$f":"CLASSEMENT!C130","v":0}]
[null,null,null,null,null,null,null,null,null,null,null,null,null,null,null,{"$f":"CLASSEMENT!C131","v":0}]
[null,null,null,null,null,null,null,null,null,null,null,null,null,null,null,{"$f":"CLASSEMENT!C132","v":0}]
[null,null,null,null,null,null,null,null,null,null,null,null,null,null,null,{"$f":"CLASSEMENT!C133","v":0}]
[null,null,null,null,null,null,null,null,null,null,null,null,null,null,null,{"$f":"CLASSEMENT!C134","v":0}]
[null,null,null,null,null,null,null,null,null,null,null,null,null,null,null,{"$f":"CLASSEMENT!C135","v":0}]
[null,null,null,null,null,null,null,null,null,null,null,null,null,null,null,{"$f":"CLASSEMENT!C136","v":0}]
[null,null,null,null,null,null,null,null,null,null,null,null,null,null,null,{"$f":"CLASSEMENT!C137","v":0}]
[null,null,null,null,null,null,null,null,null,null,null,null,null,null,null,{"$f":"CLASSEMENT!C138","v":0}]
[null,null,null,null,null,null,null,null,null,null,null,null,null,null,null,{"$f":"CLASSEMENT!C139","v":0}]
[null,null,null,null,null,null,null,null,null,null,null,null,null,null,null,{"$f":"CLASSEMENT!C140","v":0}]
[null,null,null,null,null,null,null,null,null,null,null,null,null,null,null,{"$f":"CLASSEMENT!C141","v":0}]
[null,null,null,null,null,null,null,null,null,null,null,null,null,null,null,{"$f":"CLASSEMENT!C142","v":0}]
[null,null,null,null,null,null,null,null,null,null,null,null,null,null,null,{"$f":"CLASSEMENT!C143","v":0}]
[null,null,null,null,null,null,null,null,null,null,null,null,null,null,null,{"$f":"CLASSEMENT!C144","v":0}]
[null,null,null,null,null,null,null,null,null,null,null,null,null,null,null,{"$f":"CLASSEMENT!C145","v":0}]
[null,null,null,null,null,null,null,null,null,null,null,null,null,null,null,{"$f":"CLASSEMENT!C146","v":0}]
[null,null,null,null,null,null,null,null,null,null,null,null,null,null,null,{"$f":"CLASSEMENT!C147","v":0}]
[null,null,null,null,null,null,null,null,null,null,null,null,null,null,null,{"$f":"CLASSEMENT!C148","v":0}]
[null,null,null,null,null,null,null,null,null,null,null,null,null,null,null,{"$f":"CLASSEMENT!C149","v":0}]
[null,null,null,null,null,null,null,null,null,null,null,null,null,null,null,{"$f":"CLASSEMENT!C150","v":0}]
[null,null,null,null,null,null,null,null,null,null,null,null,null,null,null,{"$f":"CLASSEMENT!C151","v":0}]
[null,null,null,null,null,null,null,null,null,null,null,null,null,null,null,{"$f":"CLASSEMENT!C152","v":0}]
[null,null,null,null,null,null,null,null,null,null,null,null,null,null,null,{"$f":"CLASSEMENT!C153","v":0}]
[null,null,null,null,null,null,null,null,null,null,null,null,null,null,null,{"$f":"CLASSEMENT!C154","v":0}]
[null,null,null,null,null,null,null,null,null,null,null,null,null,null,null,{"$f":"CLASSEMENT!C155","v":0}]
[null,null,null,null,null,null,null,null,null,null,null,null,null,null,null,{"$f":"CLASSEMENT!C156","v":0}]
[null,null,null,null,null,null,null,null,null,null,null,null,null,null,null,{"$f":"CLASSEMENT!C157","v":0}]
[null,null,null,null,null,null,null,null,null,null,null,null,null,null,null,{"$f":"CLASSEMENT!C158","v":0}]
[null,null,null,null,null,null,null,null,null,null,null,null,null,null,null,{"$f":"CLASSEMENT!C159","v":0}]
[null,null,null,null,null,null,null,null,null,null,null,null,null,null,null,{"$f":"CLASSEMENT!C160","v":0}]
[null,null,null,null,null,null,null,null,null,null,null,null,null,null,null,{"$f":"CLASSEMENT!C161","v":0}]
[null,null,null,null,null,null,null,null,null,null,null,null,null,null,null,{"$f":"CLASSEMENT!C162","v":0}]
[null,null,null,null,null,null,null,null,null,null,null,null,null,null,null,{"$f":"CLASSEMENT!C163","v":0}]
[null,null,null,null,null,null,null,null,null,null,null,null,null,null,null,{"$f":"CLASSEMENT!C164","v":0}]
[null,null,null,null,null,null,null,null,null,null,null,null,null,null,null,{"$f":"CLASSEMENT!C165","v":0}]
[null,null,null,null,null,null,null,null,null,null,null,null,null,null,null,{"$f":"CLASSEMENT!C166","v":0}]
[null,null,null,null,null,null,null,null,null,null,null,null,null,null,null,{"$f":"CLASSEMENT!C167","v":0}]
[null,null,null,null,null,null,null,null,null,null,null,null,null,null,null,{"$f":"CLASSEMENT!C168","v":0}]
[null,null,null,null,null,null,null,null,null,null,null,null,null,null,null,{"$f":"CLASSEMENT!C169","v":0}]
[null,null,null,null,null,null,null,null,null,null,null,null,null,null,null,{"$f":"CLASSEMENT!C170","v":0}]
[null,null,null,null,null,null,null,null,null,null,null,null,null,null,null,{"$f":"CLASSEMENT!C171","v":0}]
[null,null,null,null,null,null,null,null,null,null,null,null,null,null,null,{"$f":"CLASSEMENT!C172","v":0}]
[null,null,null,null,null,null,null,null,null,null,null,null,null,null,null,{"$f":"CLASSEMENT!C173","v":0}]
[null,null,null,null,null,null,null,null,null,null,null,null,null,null,null,{"$f":"CLASSEMENT!C174","v":0}]
[null,null,null,null,null,null,null,null,null,null,null,null,null,null,null,{"$f":"CLASSEMENT!C175","v":0}]
[null,null,null,null,null,null,null,null,null,null,null,null,null,null,null,{"$f":"CLASSEMENT!C176","v":0}]
[null,null,null,null,null,null,null,null,null,null,null,null,null,null,null,{"$f":"CLASSEMENT!C177","v":0}]
[null,null,null,null,null,null,null,null,null,null,null,null,null,null,null,{"$f":"CLASSEMENT!C178","v":0}]
[null,null,null,null,null,null,null,null,null,null,null,null,null,null,null,{"$f":"CLASSEMENT!C179","v":0}]
[null,null,null,null,null,null,null,null,null,null,null,null,null,null,null,{"$f":"CLASSEMENT!C180","v":0}]
[null,null,null,null,null,null,null,null,null,null,null,null,null,null,null,{"$f":"CLASSEMENT!C181","v":0}]
[null,null,null,null,null,null,null,null,null,null,null,null,null,null,null,{"$f":"CLASSEMENT!C182","v":0}]
[null,null,null,null,null,null,null,null,null,null,null,null,null,null,null,{"$f":"CLASSEMENT!C183","v":0}]
[null,null,null,null,null,null,null,null,null,null,null,null,null,null,null,{"$f":"CLASSEMENT!C184","v":0}]
[null,null,null,null,null,null,null,null,null,null,null,null,null,null,null,{"$f":"CLASSEMENT!C185","v":0}]
[null,null,null,null,null,null,null,null,null,null,null,null,null,null,null,{"$f":"CLASSEMENT!C186","v":0}]
[null,null,null,null,null,null,null,null,null,null,null,null,null,null,null,{"$f":"CLASSEMENT!C187","v":0}]
[null,null,null,null,null,null,null,null,null,null,null,null,null,null,null,{"$f":"CLASSEMENT!C188","v":0}]
[null,null,null,null,null,null,null,null,null,null,null,null,null,null,null,{"$f":"CLASSEMENT!C189","v":0}]
[null,null,null,null,null,null,null,null,null,null,null,null,null,null,null,{"$f":"CLASSEMENT!C190","v":0}]
[null,null,null,null,null,null,null,null,null,null,null,null,null,null,null,{"$f":"CLASSEMENT!C191","v":0}]
[null,null,null,null,null,null,null,null,null,null,null,null,null,null,null,{"$f":"CLASSEMENT!C192","v":0}]
[null,null,null,null,null,null,null,null,null,null,null,null,null,null,null,{"$f":"CLASSEMENT!C193","v":0}]
[null,null,null,null,null,null,null,null,null,null,null,null,null,null,null,{"$f":"CLASSEMENT!C204","v":0}]

{"sheet":"ETAT RESULT","index":8,"n_rows":39,"n_cols":7,"rows_kept":39,"cut":false,"hidden":false,"merged":[[23,3,23,4],[28,1,28,2],[23,5,23,6],[37,0,37,7],[24,1,26,1],[24,3,24,4],[25,3,25,4],[26,3,26,4],[25,5,25,6],[26,5,26,6],[27,5,27,6],[38,0,38,7],[24,5,24,6],[27,3,27,4],[28,3,28,4],[29,3,29,4],[29,5,29,6],[28,5,28,6],[35,0,36,7],[11,0,11,3],[21,3,21,7],[22,3,22,4],[22,5,22,6],[12,4,12,6],[13,4,13,5],[18,3,18,7],[19,5,19,6],[15,0,15,2],[15,3,15,7],[16,0,16,2],[16,3,16,5],[17,3,17,7],[8,0,8,7],[9,0,9,7],[0,0,0,7],[1,0,1,7],[2,0,2,7],[3,0,3,7],[4,0,4,7],[6,0,6,7]]}
["FEDERATION SPORTIVE ET GYMNIQUE DU TRAVAIL"]
["F.S.G.T 29"]
[]
[]
[]
[]
["Etat de Résultats"]
[]
["à transmettre dans les 48 heures qui suivent l'épreuve,"]
["pour HOMOLOGATION à la Commission Cyclisme 29"]
[]
["CONTRÔLE ANTIDOPAGE",null,null,null,"OUI",null,"NON"]
[null,null,null,null,"(Rayer la mention inutile)"]
[null,null,null,"DATE :"]
[]
["Titre de l'épreuve :"]
["Lieu de l'épreuve :"]
["Association organisatrice :"]
["Séries ou Catégories :"]
["Distance :",null,null,"kms","TEMPS :",{"$f":"CLASSEMENT!#REF!","v":{"$error":"#REF!"}}]
[]
[null,null,null,"COMMISSAIRES"]
[null,null,null,"NOMS",null,"ASSOCIATIONS"]
[null,null,"Prés. Du Jury"]
["1.","}"]
["2.",null,"Commissaires"]
["3."]
[null,null,"Juge à l'arrivée"]
[null,"Commissaire moto"]
[null,null,"Chronométreur"]
[]
[]
["ENGAGES : ",null,{"$f":"Inscription!$D$8","v":0},"PARTANTS :",{"$f":"Inscription!$F$8","v":0},null,{"$f":"CLASSEMENT!#REF!","v":{"$error":"#REF!"}}]
[]
["AVIS IMPORTANT :"]
["- Cet ETAT DE RESULTATS doit être rempli intégralement, le nom, le prénom usuel, le n°de licence et le nom de l'association du coureur doivent être indiqués en entier."]
[]
["   - Ne pas omettre de signer au verso (Commissaires, chrono, etc…)."]
["   - Joindre obligatoirement la liste des engagés"]

{"sheet":"ETAT RES VERSO","index":9,"n_rows":40,"n_cols":16,"rows_kept":40,"cut":false,"hidden":false,"merged":[[39,0,42,1],[39,2,42,12],[39,13,42,13],[39,14,42,15],[11,15,12,15],[12,2,12,11],[34,0,35,0],[34,1,35,1],[34,2,34,11],[11,14,12,14],[16,12,17,15],[32,1,33,1],[32,2,32,11],[32,12,33,15],[33,2,33,11],[15,12,15,15],[16,2,16,11],[18,12,19,15],[20,12,21,15],[11,1,12,1],[11,12,12,12],[11,13,12,13],[30,1,31,1],[30,2,30,11],[30,12,31,15],[32,0,33,0],[24,12,25,15],[24,2,24,11],[25,2,25,11],[22,12,23,15],[15,0,15,10],[38,3,38,11],[24,0,25,0],[24,1,25,1],[28,2,28,11],[26,1,27,1],[26,2,26,11],[27,2,27,11],[31,2,31,11],[34,12,35,15],[35,2,35,11],[30,0,31,0],[37,0,37,15],[28,12,29,15],[29,2,29,11],[22,0,23,0],[22,1,23,1],[22,2,22,11],[23,2,23,11],[26,12,27,15],[26,0,27,0],[28,0,29,0],[28,1,29,1],[18,0,19,0],[18,1,19,1],[9,1,10,1],[11,2,11,11],[18,2,18,11],[19,2,19,11],[20,2,20,11],[21,2,21,11],[20,0,21,0],[20,1,21,1],[11,0,12,0],[13,15,14,15],[13,14,14,14],[13,0,14,0],[13,1,14,1],[13,12,14,12],[13,13,14,13],[13,2,13,11],[14,2,14,11],[16,0,17,0],[16,1,17,1],[17,2,17,11],[9,12,10,12],[9,13,10,13],[7,12,8,12],[7,13,8,13],[9,0,10,0],[9,14,10,14],[9,15,10,15],[7,15,8,15],[7,14,8,14],[7,0,8,0],[7,1,8,1],[7,2,7,11],[8,2,8,11],[9,2,9,11],[10,2,10,11],[5,2,5,11],[6,2,6,11],[2,2,2,11],[3,2,3,11],[4,2,4,11],[0,14,1,15],[5,12,6,12],[5,13,6,13],[5,14,6,14],[5,15,6,15],[0,12,0,13],[1,0,1,13],[0,4,0,9],[5,0,6,0],[5,1,6,1]]}
["LIEU :",{"$f":"Inscription!D2","v":"cyclo cross de Créhen"},"DATE",null,{"$f":"Inscription!D4","v":"2024-11-30"},null,null,null,null,null,"CAT.:",null,{"$f":"Inscription!D5","v":0},null,"AVIS \nSUR LES DECISIONS CI-CONTRE"]
["PENALITES : (s'il y a lieu), par décision des trois Commissaires de Course, qui doivent apposer leur signature sous le(s) motif(s)."]
["N°",null,"ASSOCIATION"]
["DE","NOM ET PRENOM","N° DE LICENCE",null,null,null,null,null,null,null,null,null,"Pénalités","MOTIF(S)","Commission 29","F.S.G.T"]
["DOSSARD"]
[null,{"$f":"IF(A6>0,CONCATENATE((VLOOKUP($A6,Inscription!$A$12:$G$211,3,FALSE)),\"   \",(VLOOKUP($A6,Inscription!$A$12:$G$211,4,FALSE))),\" \")","v":" "},{"$f":"IF(A6>0,(VLOOKUP($A6,Inscription!$A$12:$G$211,5,FALSE)),\" \")","v":" "}]
[null,{"$f":"IF(A7>0,(VLOOKUP($C7,Inscription!$A$12:$G$211,3,FALSE)),\" \")","v":" "},{"$f":"IF(A6>0,(VLOOKUP($A6,Inscription!$A$12:$G$211,7,FALSE)),\" \")","v":" "}]
[null,{"$f":"IF(A8>0,(VLOOKUP($A8,Inscription!$A$12:$G$211,3,FALSE)),\" \")","v":" "},{"$f":"IF(A8>0,(VLOOKUP($A8,Inscription!$A$12:$G$211,5,FALSE)),\" \")","v":" "}]
[null,{"$f":"IF(A9>0,(VLOOKUP($C9,Inscription!$A$12:$G$211,3,FALSE)),\" \")","v":" "},{"$f":"IF(A8>0,(VLOOKUP($A8,Inscription!$A$12:$G$211,7,FALSE)),\" \")","v":" "}]
[null,{"$f":"IF(A10>0,(VLOOKUP($A10,Inscription!$A$12:$G$211,3,FALSE)),\" \")","v":" "},{"$f":"IF(A10>0,(VLOOKUP($A10,Inscription!$A$12:$G$211,5,FALSE)),\" \")","v":" "}]
[null,{"$f":"IF(A11>0,(VLOOKUP($C11,Inscription!$A$12:$G$211,3,FALSE)),\" \")","v":" "},{"$f":"IF(A10>0,(VLOOKUP($A10,Inscription!$A$12:$G$211,7,FALSE)),\" \")","v":" "}]
[null,{"$f":"IF(A12>0,(VLOOKUP($A12,Inscription!$A$12:$G$211,3,FALSE)),\" \")","v":" "},{"$f":"IF(A12>0,(VLOOKUP($A12,Inscription!$A$12:$G$211,5,FALSE)),\" \")","v":" "}]
[null,{"$f":"IF(A13>0,(VLOOKUP($C13,Inscription!$A$12:$G$211,3,FALSE)),\" \")","v":" "},{"$f":"IF(A12>0,(VLOOKUP($A12,Inscription!$A$12:$G$211,7,FALSE)),\" \")","v":" "}]
[null,{"$f":"IF(A14>0,(VLOOKUP($A14,Inscription!$A$12:$G$211,3,FALSE)),\" \")","v":" "},{"$f":"IF(A14>0,(VLOOKUP($A14,Inscription!$A$12:$G$211,5,FALSE)),\" \")","v":" "}]
[null,{"$f":"IF(A15>0,(VLOOKUP($C15,Inscription!$A$12:$G$211,3,FALSE)),\" \")","v":" "},{"$f":"IF(A14>0,(VLOOKUP($A14,Inscription!$A$12:$G$211,7,FALSE)),\" \")","v":" "}]
["CHUTES – ACCIDENTS :",null,null,null,null,null,null,null,null,null,null,null,"SUITE DONNEE "]
[null,{"$f":"IF(A17>0,CONCATENATE((VLOOKUP($A17,Inscription!$A$12:$G$211,3,FALSE)),\"   \",(VLOOKUP($A17,Inscription!$A$12:$G$211,4,FALSE))),\" \")","v":" "},{"$f":"IF(A17>0,(VLOOKUP($A17,Inscription!$A$12:$G$211,5,FALSE)),\" \")","v":" "}]
[null,{"$f":"IF(A18>0,(VLOOKUP($C18,Inscription!$A$12:$G$211,3,FALSE)),\" \")","v":" "},{"$f":"IF(A17>0,(VLOOKUP($A17,Inscription!$A$12:$G$211,7,FALSE)),\" \")","v":" "}]
[null,{"$f":"IF(A19>0,CONCATENATE((VLOOKUP($A19,Inscription!$A$12:$G$211,3,FALSE)),\"   \",(VLOOKUP($A19,Inscription!$A$12:$G$211,4,FALSE))),\" \")","v":" "},{"$f":"IF(A19>0,(VLOOKUP($A19,Inscription!$A$12:$G$211,5,FALSE)),\" \")","v":" "}]
[null,{"$f":"IF(A20>0,(VLOOKUP($C20,Inscription!$A$12:$G$211,3,FALSE)),\" \")","v":" "},{"$f":"IF(A19>0,(VLOOKUP($A19,Inscription!$A$12:$G$211,7,FALSE)),\" \")","v":" "}]
[null,{"$f":"IF(A21>0,CONCATENATE((VLOOKUP($A21,Inscription!$A$12:$G$211,3,FALSE)),\"   \",(VLOOKUP($A21,Inscription!$A$12:$G$211,4,FALSE))),\" \")","v":" "},{"$f":"IF(A21>0,(VLOOKUP($A21,Inscription!$A$12:$G$211,5,FALSE)),\" \")","v":" "}]
[null,{"$f":"IF(A22>0,(VLOOKUP($C22,Inscription!$A$12:$G$211,3,FALSE)),\" \")","v":" "},{"$f":"IF(A21>0,(VLOOKUP($A21,Inscription!$A$12:$G$211,7,FALSE)),\" \")","v":" "}]
[null,{"$f":"IF(A23>0,CONCATENATE((VLOOKUP($A23,Inscription!$A$12:$G$211,3,FALSE)),\"   \",(VLOOKUP($A23,Inscription!$A$12:$G$211,4,FALSE))),\" \")","v":" "},{"$f":"IF(A23>0,(VLOOKUP($A23,Inscription!$A$12:$G$211,5,FALSE)),\" \")","v":" "}]
[null,{"$f":"IF(A24>0,(VLOOKUP($C24,Inscription!$A$12:$G$211,3,FALSE)),\" \")","v":" "},{"$f":"IF(A23>0,(VLOOKUP($A23,Inscription!$A$12:$G$211,7,FALSE)),\" \")","v":" "}]
[null,{"$f":"IF(A25>0,CONCATENATE((VLOOKUP($A25,Inscription!$A$12:$G$211,3,FALSE)),\"   \",(VLOOKUP($A25,Inscription!$A$12:$G$211,4,FALSE))),\" \")","v":" "},{"$f":"IF(A25>0,(VLOOKUP($A25,Inscription!$A$12:$G$211,5,FALSE)),\" \")","v":" "}]
[null,{"$f":"IF(A26>0,(VLOOKUP($C26,Inscription!$A$12:$G$211,3,FALSE)),\" \")","v":" "},{"$f":"IF(A25>0,(VLOOKUP($A25,Inscription!$A$12:$G$211,7,FALSE)),\" \")","v":" "}]
[null,{"$f":"IF(A27>0,CONCATENATE((VLOOKUP($A27,Inscription!$A$12:$G$211,3,FALSE)),\"   \",(VLOOKUP($A27,Inscription!$A$12:$G$211,4,FALSE))),\" \")","v":" "},{"$f":"IF(A27>0,(VLOOKUP($A27,Inscription!$A$12:$G$211,5,FALSE)),\" \")","v":" "}]
[null,{"$f":"IF(A28>0,(VLOOKUP($C28,Inscription!$A$12:$G$211,3,FALSE)),\" \")","v":" "},{"$f":"IF(A27>0,(VLOOKUP($A27,Inscription!$A$12:$G$211,7,FALSE)),\" \")","v":" "}]
[null,{"$f":"IF(A29>0,CONCATENATE((VLOOKUP($A29,Inscription!$A$12:$G$211,3,FALSE)),\"   \",(VLOOKUP($A29,Inscription!$A$12:$G$211,4,FALSE))),\" \")","v":" "},{"$f":"IF(A29>0,(VLOOKUP($A29,Inscription!$A$12:$G$211,5,FALSE)),\" \")","v":" "}]
[null,{"$f":"IF(A30>0,(VLOOKUP($C30,Inscription!$A$12:$G$211,3,FALSE)),\" \")","v":" "},{"$f":"IF(A29>0,(VLOOKUP($A29,Inscription!$A$12:$G$211,7,FALSE)),\" \")","v":" "}]
[null,{"$f":"IF(A31>0,CONCATENATE((VLOOKUP($A31,Inscription!$A$12:$G$211,3,FALSE)),\"   \",(VLOOKUP($A31,Inscription!$A$12:$G$211,4,FALSE))),\" \")","v":" "},{"$f":"IF(A31>0,(VLOOKUP($A31,Inscription!$A$12:$G$211,5,FALSE)),\" \")","v":" "}]
[null,{"$f":"IF(A32>0,(VLOOKUP($C32,Inscription!$A$12:$G$211,3,FALSE)),\" \")","v":" "},{"$f":"IF(A31>0,(VLOOKUP($A31,Inscription!$A$12:$G$211,7,FALSE)),\" \")","v":" "}]
[null,{"$f":"IF(A33>0,CONCATENATE((VLOOKUP($A33,Inscription!$A$12:$G$211,3,FALSE)),\"   \",(VLOOKUP($A33,Inscription!$A$12:$G$211,4,FALSE))),\" \")","v":" "},{"$f":"IF(A33>0,(VLOOKUP($A33,Inscription!$A$12:$G$211,5,FALSE)),\" \")","v":" "}]
[null,{"$f":"IF(A34>0,(VLOOKUP($C34,Inscription!$A$12:$G$211,3,FALSE)),\" \")","v":" "},{"$f":"IF(A33>0,(VLOOKUP($A33,Inscription!$A$12:$G$211,7,FALSE)),\" \")","v":" "}]
[null,{"$f":"IF(A35>0,CONCATENATE((VLOOKUP($A35,Inscription!$A$12:$G$211,3,FALSE)),\"   \",(VLOOKUP($A35,Inscription!$A$12:$G$211,4,FALSE))),\" \")","v":" "},{"$f":"IF(A35>0,(VLOOKUP($A35,Inscription!$A$12:$G$211,5,FALSE)),\" \")","v":" "}]
[null,{"$f":"IF(A36>0,(VLOOKUP($C36,Inscription!$A$12:$G$211,3,FALSE)),\" \")","v":" "},{"$f":"IF(A35>0,(VLOOKUP($A35,Inscription!$A$12:$G$211,7,FALSE)),\" \")","v":" "}]
[]
["Les soussignés, Commissaires de Course, Juge à l'arrivée et Chronométreur, certifient la sincérité des résultats mentionnés au tableau ci-contre."]
["A",",","le",null,null,null,null,null,null,null,null,null,"20…"]
["Le Président du Jury:",null,"Les Commissaires:",null,null,null,null,null,null,null,null,null,null,"Le Juge à l'arrivée:","Le Chronométreur:"]

{"sheet":"rapport jury","index":10,"n_rows":112,"n_cols":13,"rows_kept":112,"cut":false,"hidden":false,"merged":[[95,0,95,12],[97,0,97,12],[98,0,98,12],[100,9,100,12],[111,0,111,12],[94,0,94,12],[30,1,30,4],[30,5,30,10],[30,11,30,12],[31,1,31,4],[31,5,31,10],[31,11,31,12],[32,1,32,4],[32,5,32,10],[32,11,32,12],[33,0,33,12],[35,0,35,12],[28,1,28,4],[28,5,28,10],[28,11,28,12],[29,1,29,4],[29,5,29,10],[29,11,29,12],[26,1,26,4],[26,5,26,10],[26,11,26,12],[27,1,27,4],[27,5,27,10],[27,11,27,12],[17,1,17,3],[17,4,17,5],[17,6,17,8],[17,9,17,11],[25,1,25,4],[25,5,25,10],[25,11,25,12],[13,0,13,2],[13,3,13,10],[15,1,15,2],[15,4,15,5],[15,8,15,9],[7,0,7,2],[7,3,7,12],[9,4,9,9],[11,0,11,2],[11,3,11,12],[0,0,0,12],[1,0,1,12],[2,0,2,12],[3,0,3,12],[4,0,4,12]]}
["FEDERATION SPORTIVE ET GYMNIQUE DU TRAVAIL"]
["COMITE DEPARTEMENTAL 29 "]
["-------------------------"]
["RAPPORT DU PRESIDENT DU JURY"]
["-------------------------"]
["Renseignements sur la course :"]
[]
["Dénomination de la course :",null,null,{"$f":"Inscription!$D$1","v":0}]
[]
["Date :",{"$f":"Inscription!$D$4","v":"2024-11-30"},null,"Ville :",{"$f":"Inscription!$D$2","v":"cyclo cross de Créhen"},null,null,null,null,null,null,"Dépt :",{"$f":"Inscription!$G$2","v":0}]
[]
["Club organisateur :",null,null,{"$f":"Inscription!$D$3","v":"EC Créhen"}]
[]
["Catégorie de la course :",null,null,{"$f":"Inscription!$D$5","v":"00:00:00"}]
[]
[null,"Engagés :",null,{"$f":"Inscription!$D$8","v":0},"Partants :",null,{"$f":"Inscription!$F$8","v":0},null,"Classés :",null,null,{"$f":"CLASSEMENT!#REF!","v":{"$error":"#REF!"}}]
[]
[null,"Kilométrage parcouru :  ",null,null,{"$f":"'FEUILLE RESULTATS'!$M$8","v":0},null,"Temps : ",null,null,{"$f":"'FEUILLE RESULTATS'!$N$10","v":{"$error":"#REF!"}}]
[]
["Epreuve en circuit",null,null,null,null,"oui",null,null,"non"]
[null,"Longueur du circuit",null,{"$f":"Inscription!C6","v":0},"km"]
[]
["Epreuve en ligne ",null,null,null,null,"oui",null,null,"non"]
[]
["Collège des arbitres :"]
[null,"Nom - prénom",null,null,null,"Club",null,null,null,null,null,"Qualification"]
["Président du jury",{"$f":"'ETAT RESULT'!$D24","v":0},null,null,null,{"$f":"'ETAT RESULT'!$F24","v":0},null,null,null,null,null,{"$f":"'ETAT RESULT'!$H24","v":0}]
["Commissaire 1",{"$f":"'ETAT RESULT'!$D25","v":0},null,null,null,{"$f":"'ETAT RESULT'!$F25","v":0},null,null,null,null,null,{"$f":"'ETAT RESULT'!$H25","v":0}]
["Commissaire 2",{"$f":"'ETAT RESULT'!$D26","v":0},null,null,null,{"$f":"'ETAT RESULT'!$F26","v":0},null,null,null,null,null,{"$f":"'ETAT RESULT'!$H26","v":0}]
["Juge à l'arrivée",{"$f":"'ETAT RESULT'!$D28","v":0},null,null,null,{"$f":"'ETAT RESULT'!$F28","v":0},null,null,null,null,null,{"$f":"'ETAT RESULT'!$H28","v":0}]
["Moto 1",{"$f":"'ETAT RESULT'!$D29","v":0},null,null,null,{"$f":"'ETAT RESULT'!$F29","v":0},null,null,null,null,null,{"$f":"'ETAT RESULT'!$H29","v":0}]
["Moto 2"]
["Chronométreur",{"$f":"'ETAT RESULT'!$D30","v":0},null,null,null,{"$f":"'ETAT RESULT'!$F30","v":0},null,null,null,null,null,{"$f":"'ETAT RESULT'!$H30","v":0}]
[]
["Les Commissaires étaient-ils identifiables ?",null,null,null,null,"oui",null,null,"non"]
[]
["Organisation :",null,null,null,null,null,null,null,null,"(mettre un x dans la case)"]
["Présentation de l'autorisation préfectorale",null,null,null,null,"oui",null,null,"non"]
[]
["Secrétariat",null,null,null,null,"médiocre",null,null,"moyen",null,null,"bon"]
[]
["Local réservé pour les Commissaires",null,null,null,null,"oui",null,null,"non"]
[]
["Structure de la course :"]
["WC prévus au départ",null,null,null,null,"oui",null,null,"non"]
[]
["Barrières au départ",null,null,null,null,"oui",null,null,"non"]
[]
["Parking suffisant au départ",null,null,null,null,"oui",null,null,"non"]
[]
["Barrières à l'arrivée",null,null,null,null,"oui",null,null,"non"]
[]
["Podium couvert indépendant pour les Commissaires à l'arrivée",null,null,null,null,"oui",null,null,"non"]
[]
["Podium protocolaire situé conformément après la ligne",null,null,null,null,"oui",null,null,"non"]
[]
["Local du contrôle anti-dopage : est-il prévu ?",null,null,null,null,"oui",null,null,"non"]
[]
["                                                        est-il conforme ?",null,null,null,null,"oui",null,null,"non"]
[]
["Médecin dans la course",null,null,null,null,"oui",null,null,"non"]
[]
["Secours présent au départ de l'épreuve",null,null,null,null,"oui",null,null,"non"]
[]
["Véhicule balai",null,null,null,null,"oui",null,null,"non"]
[]
["Véhicules neutres de dépannage",null,null,null,null,"zéro",null,null,1,null,null,2]
[]
["Radio course",null,null,null,null,"oui",null,null,"non"]
[]
["Efficacité",null,null,null,null,"médiocre",null,null,"moyen",null,null,"bon"]
[]
["Photo finish ou numérique",null,null,null,null,"médiocre",null,null,"moyen",null,null,"bon"]
[]
["ou autre moyen vidéo d'arrivée",null,null,null,null,"médiocre",null,null,"moyen",null,null,"bon"]
[]
["Sécurité de la course :"]
["Importance des moyens mis en œuvre",null,null,null,null,"médiocre",null,null,"moyen",null,null,"bon"]
[]
["Nature des moyens"]
["escorte motos (nombre)"]
[]
["signaleurs (nombre)"]
[]
["Efficacité des moyens",null,null,null,null,"médiocre",null,null,"moyen",null,null,"bon"]
[]
["Signalisation course :"]
["Fléchage du parcours (au sol ou sur panneau)",null,null,null,null,"médiocre",null,null,"moyen",null,null,"bon"]
[]
["Banderole au départ",null,null,null,null,"oui",null,null,"non"]
[]
["Banderole à l'arrivée",null,null,null,null,"oui",null,null,"non"]
[]
[]
["Observations complémentaires sur l'organisation et éventuellement suggestions d'améliorations dont vous aurez parlé avec l'organisateur"]
[]
[]
["Appréciation du président du jury"]
[]
[]
[null,null,null,null,null,null,null,null,"Date :",{"$f":"Inscription!D4","v":"2024-11-30"}]
[]
[null,null,null,null,null,null,null,null,"Signature :"]
[]
[]
[]
["Annexes à joindre :","Etat de résultats."]
[null,"Liste pointée des partants."]
[null,"Le récapitulatif des décisions des Commissaires (feuille de pénalité)."]
[null,"Les lettres de réclamation (éventuellement, avec décision notifiée)."]
[]
["Ce rapport doit être adressé dans les 48 heures après la course à la FSGT 29\n "]

{"sheet":"Feuil1","index":11,"n_rows":0,"n_cols":0,"rows_kept":0,"cut":false,"hidden":false,"merged":[]}