{"text_format":"1","workbook":"xlsx","n_sheets":12,"sheets":["Mode Op","Inscription","PRIX D EQUIPE","ENG Dep","EMARGEMENT","CLASSEMENT","CLASS INTERNET","FEUILLE RESULTATS","ETAT RESULT","ETAT RES VERSO","rapport jury","Feuil1"],"not_rendered":{"charts":0,"images":0,"macros":1,"external_links":0,"defined_names":46,"comments":1,"pivot_tables":0},"unopened":[],"bounds":{"document_bytes":16777216,"sheet_cells":100000,"rows_first":2000,"rows_last":500,"rows_between":2000,"halvings":0,"cell_chars":16384,"cell_head_chars":4096},"cells_cut":0,"cells_raw":0,"read":"whole","date_system":"1900"}

{"sheet":"Mode Op","index":0,"n_rows":19,"n_cols":1,"rows_kept":19,"cut":false,"hidden":true,"merged":[]}
["MODE OPERATOIRE FEUILLE DE CLASSEMENT"]
[]
[]
["-                    Améliorations : La moyenne des ex-æquo se calcule automatiquement. Les temps des coureurs figurent sur les feuilles de résultats avec les écarts. Les en-têtes des feuillets « Engagements sur place », « Etats de résultats », « Rapport du Prés. du Jury » se complètent automatiquement. Sur le verso de l’état de résultats, en portant le n° de dossard du coureur pénalisé, son nom, son club, et son n° de licence sont inscrits (dans le cas où le Commissaire est équipé d’une imprimante sur le lieu de la course)."]
["----------"]
["-               Feuillet « INSCRIPTION ». Remplir le feuillet inscription . Pour la distance, remplir la case « circuit de » et «  à parcourir ». Dans le cas d’une course en ligne, distance totale x 1. Ajouter les engagés sur place en respectant l’appellation du club si celui-ci est au Prix d’équipe."]
["-               Feuillet « PRIX D EQUIPE » :  Pour le nom des clubs, faire un « copier-coller » entre le nom entré au premier coureur de l’équipe et les autres coureurs du même club, puis  avec le feuillet « prix d’équipe », si le club est inscrit. Attention, le nom du club doit être strictement le même que celui du feuillet prix d’équipe. Si un coureur est ajouté (engagement sur place) et que d’autres coureurs du même club sont déjà engagés : copier-coller le nom du club. Si un club se rajoute au prix d’équipe, même chose (copier-coller avec feuillet prix d’équipe). Le prix d’équipe ne peut se calculer que si cette procédure est respectée."]
["-               Feuillet « Eng. Sur place » : Porter simplement le numéro du dossard qui correspond à la feuille « inscription », le reste se remplit automatiquement."]
["-               Sur le feuillet « INSCRIPTION », mettre d’office « X » dans la colonne des présents, il suffira de les enlever si les coureurs sont non - partants. Il est possible de mettre EXC. Si les coureurs sont excusés (le nombre de partants n’est comptabilisé qu’à partir des « X »."]
["-               Pour éditer les feuilles, définir la zone d’impression pour éviter d’imprimer les 5 pages.  "]
["-               Feuillet « Emargement » : définir la zone d’impression en s’arrêtant à un bas de page."]
["-               Une fois la course terminée et le classement fait, aller sur le feuillet « classement », saisir seulement les numéros des dossards et le temps du 1er et des autres s’il y a lieu (çà permet de calculer la moyenne de la course). S’il y a des ex-æquo, remplacer, pour tous les coureurs ex-æquo,  les places de la  colonne B par la place du 1er ex-æquo. La moyenne du « trou » se calcule automatiquement. Si un coureur est déjà classé, son numéro apparaît dans la colonne K surligné en jaune. Cliquer sur le rectangle  «prix d’équipe 2 hommes» ou « prix d’équipe 3 hommes » (au temps ou à la place) selon la catégorie de course."]
["-               Il n’y a plus qu’à éditer la feuille de résultats (format A4). Celle-ci est protégée car il n’y a rien à modifier. Dans le cas contraire, il suffit d’ôter la protection."]
["-               Le dernier feuillet (Internet), sert à envoyer les résultats pour mise en ligne sur le site FSGT 29. On peut enlever des lignes, ou en ajouter en insérant des lignes entre la dernière actuelle et le prix d’équipe, puis en faisant une recopie vers le bas de la dernière ligne (qui contient la formule en liaison avec la feuille de classement)."]
["En résumé : bien remplir la liste des engagés, le feuillet prix d’équipe par un copier-coller, et le feuillet classement (colonnes surlignées en vert)."]
[]
["Pour réutiliser le programme, il vaut mieux utiliser un programme vierge (ne pas oublier de l’enregistrer sous un autre nom)."]
[]
["ATTENTION : beaucoup de cellules contiennent des formules. Ne pas supprimer de lignes ou de colonnes, et ne pas modifier les cellules contenant les formules (sauf expert). Toujours faire des essais avec une version du programme enregistrée sous un autre nom."]

{"sheet":"Inscription","index":1,"n_rows":205,"n_cols":9,"rows_kept":205,"cut":false,"hidden":true,"merged":[[4,2,4,3]]}
[null,null,null,"CYCLO CROSS"]
[null,null,null,"HENANSAL"]
[]
["DATE :",null,null,"2023-10-01"]
[]
[1,"x","LEVEQUE ","Nathan","district loudéac","poussin",null,"2017-07-20","m"]
[2,"x","BARS","Gabin","begard vtt gwerun","poussin",407364,"2017-01-11","m"]
[3,"x","BASSET","Evan","vc evron","poussin",null,"2016-02-09","m"]
[4,"x","BANNER","Livia","vtt du lié","poussin",null,"2016-03-22","f"]
[5,"x","MACE","Loukas","vc evron","poussin",996776,"2017-07-10","m"]
[6,"x","BARS","Yvann","begard vtt gwerun","pupille",310008,"2014-07-13","m"]
[7,"x","COLAS","Thibaut","begard vtt gwerun","pupille",330206,"2014-01-11","m"]
[8,"x","LEPERCQ","Batiste","uc plaudren","pupille",391433,"2015-11-18","m"]
[9,"x","CLERET MARECHAL","Loeiz","vtt cotes d'armor hillion","pupille",null,"2014-07-09","m"]
[10,"x","POILVET","Paul","vc evron","benjamin",382428,"2013-05-07","m"]
[11,"x","POILVET","Jules","vc evron","benjamin",382431,"2013-05-07","m"]
[12,"x","LEPERCQ","Clara","uc plaudren","benjamin",467480,"2013-08-02","f"]
[13,"x","BOLORE","Loevan","team bikers","benjamin",376265,"2013-05-26","m"]
[14,"x","BANNER","Rafael","vtt du lié","benjamin",null,"2013-01-15","m"]
[15,"x","BRIAND","Axel","team bikers","benjamin",429219,"2013-09-21","m"]
[16,"x","BOUGEARD HORNAIS","Aymeris","team bikers","benjamin",431285,null,"m"]
[17]
[18]
[19]
[20,"x","BRIEND","Ilhan","accro cycles cotes d'émeraude","minimes",919871,"2010-08-18","m"]
[21,"x","LE BIHAN","Clément ","uc plaudren","minimes",968158,"2011-07-30","m"]
[22,"x","BOLORE","Ewen","team bikers","minimes",376263,"2010-10-13","m"]
[23,"x","ROUILLE","Robin","team bikers","minimes",390947,"2010-07-09","m"]
[24,"x","BASSET","Loris","vc evron","minimes",null,"2011-06-06","m"]
[25,"x","BRIAND","Mathis","team bikers","minimes",431995,"2011-04-20","m"]
[26,"x","BOUGEARD","Margot","team bikers","minimes",431290,"2010-05-18","f"]
[27,"x","GUILMIN","Léo","vc evron","minimes",344464,"2010-10-07","m"]
[28]
[29]
[30,"x","FERTE","Brandon","distric loudéac","cadet",297227,39839]
[31,"x","LEPERCQ","Nathan","uc plaudren","cadet",389000,39962]
[32]
[33]
[34]
[35,"x","HALLET","Baptiste","vc plurien","espoir",136613,2005,"m"]
[36]
[37]
[38]
[39]
[40,"x","KEURMEUR","Romain","team mégrit","1ère cat",363251,"2004-03-16","m"]
[41,"x","BANNER","Mickael","vtt du lié","1ère cat",950036,"1982-01-15","m"]
[42,"x","BOUGEARD","Pierre-Yves","team bickers","1ère cat",376257,"1984-03-20","m"]
[43,"x","BASSET","Emerick","vc evron","1ère cat",371872,"1980-01-18","m"]
[44]
[45,"x","JEUNEU","Gilles","accro cycles cotes d'émeraude","2ème cat",137390,"1967-06-28","m"]
[46,"x","LESNE","Régis","district loudéac","2ème cat",227933,1989,"m"]
[47,"x","BEDEL","Bapiste","district loudéac","2ème cat",13637,2002,"m"]
[48,"x","COLAS","Emmanuel","begard vtt gwerun","2ème cat",386450,"1982-04-28","m"]
[49,"x","COLLEU","Pascal","ccvb","2ème cat",511956,1967,"m"]
[50,"x","MACE","Jérome","vc evron","2ème cat",434904,"1986-10-14","m"]
[51,"x","BRIAND ","Régis","team bickers","2ème cat",429231,"1983-06-19","m"]
[52,"x","MOUTTE","Alexis","team du pays de dinan guinefort","2ème cat",null,"2002-05-08","m"]
[53,"x","MARIVINT","Alexis","vc evron","2ème cat",294510,"1988-05-12","m"]
[54,"x","LECOMTE ","Guillaume","team xc du léguer","2ème cat",998834,"1981-09-04","m"]
[55]
[56]
[57]
[58]
[59]
[60,"x","GOUYA","Noel","team du pays de dinan guinefort","3ème cat",226768,1962,"m"]
[61,"x","GUILLOT","Denis","team du pays de dinan guinefort","3ème cat",844159,1962,"m"]
[62,"x","DURAND","Jacques","team du pays de dinan guinefort","3ème cat",144227,1957,"m"]
[63,"x","COUALAN","Dominique","cc pleven","3ème cat",153631,1970,"m"]
[64,"x","LEMAITRE","Alain","ac vildé guingalan","3ème cat",225454,1954,"m"]
[65,"x","NICOLAS ","Jean Charles","ac vildé guingalan","3ème cat",514101,1951,"m"]
[66,"x","GEORGET","Charles","district loudéac","3ème cat",227931,"1978-02-28","m"]
[67,"x","BEDEL ","Michel","district loudéac","3ème cat",267277,"1965-10-25","m"]
[68,"x","GOUYA","Alain","district loudéac","3ème cat",136125,null,"m"]
[69,"x","GAILLARD","Marcel","cos kerentrech","3ème cat",57243,"1950-04-02","m"]
[70,"x","COLAS ","Roger","vc crehen","3ème cat",227437,1955,"m"]
[71,"x","GOUPIL","Michel","team mégrit","3ème cat",55779611,1959,"m"]
[72,"x","LECELLIER","Raymond","team mégrit","3ème cat",55656150,1954,"m"]
[73,"x","ROPERCH","Bruno","uc plaudren","3ème cat",875266,1962,"m"]
[74]
[75]
[76]
[77]
[78]
[79]
[80]
[81]
[82]
[83]
[84]
[85]
[86]
[87]
[88]
[89]
[90]
[91]
[92]
[93]
[94]
[95]
[96]
[97]
[98]
[99]
[100]
[101]
[102]
[103]
[104]
[105]
[106]
[107]
[108]
[109]
[110]
[111]
[112]
[113]
[114]
[115]
[116]
[117]
[118]
[119]
[120]
[121]
[122]
[123]
[124]
[125]
[126]
[127]
[128]
[129]
[130]
[131]
[132]
[133]
[134]
[135]
[136]
[137]
[138]
[139]
[140]
[141]
[142]
[143]
[144]
[145]
[146]
[147]
[148]
[149]
[150]
[151]
[152]
[153]
[154]
[155]
[156]
[157]
[158]
[159]
[160]
[161]
[162]
[163]
[164]
[165]
[166]
[167]
[168]
[169]
[170]
[171]
[172]
[173]
[174]
[175]
[176]
[177]
[178]
[179]
[180]
[181]
[182]
[183]
[184]
[185]
[186]
[187]
[188]
[189]
[190]
[191]
[192]
[193]
[194]
[195]
[196]
[197]
[198]
[199]
[200]

{"sheet":"PRIX D EQUIPE","index":2,"n_rows":39,"n_cols":1,"rows_kept":39,"cut":false,"hidden":true,"merged":[[1,0,1,1]]}
[]
["PRIX D EQUIPE"]
[]
[]
[1]
[2]
[3]
[4]
[5]
[6]
[7]
[8]
[9]
[10]
[11]
[12]
[13]
[14]
[15]
[16]
[17]
[18]
[19]
[20]
[21]
[22]
[23]
[24]
[25]
[26]
[27]
[28]
[29]
[30]
[31]
[32]
[33]
[34]
[35]

{"sheet":"ENG Dep","index":3,"n_rows":50,"n_cols":7,"rows_kept":50,"cut":false,"hidden":true,"merged":[[48,6,48,8],[8,0,10,0],[8,2,10,3],[8,4,10,4],[8,5,10,5],[48,1,48,3],[48,4,48,5],[8,6,10,6],[39,0,42,3],[39,4,39,6],[40,4,40,6],[41,4,41,6],[42,4,42,6],[0,0,0,8],[8,7,10,7],[8,8,10,8],[3,3,3,6],[1,0,1,8]]}
["Fédération Sportive et Gymnique du Travail"]
["ENGAGEMENTS SUR LA LIGNE"]
[]
["ORGANISATEUR : ",null,null,{"$f":"IF(Inscription!D3=\"\",\"\",Inscription!D3)","v":""}]
["EPREUVE :",null,{"$f":"IF(Inscription!D1=\"\",\"\",Inscription!D1)","v":"CYCLO CROSS"}]
["CAT.:",{"$f":"IF(Inscription!#REF!=\"\",\"\",Inscription!#REF!)","v":{"$error":"#REF!"}},null,null,null,"DATE :",{"$f":"IF(Inscription!D4=\"\",\"\",Inscription!D4)","v":"2023-10-01"}]
["NOMBRE D ENGAGES AU DEPART  :",null,null,null,{"$f":"COUNTA(A12:A39)","v":0}]
[]
["DOSS",null,"NOM  /  PRENOM",null,"ASSOCIATION","CAT","N° licence"]
[]
[]
[null,null,{"$f":"IF(A12>0,CONCATENATE((VLOOKUP($A12,Inscription!$A$6:$G$205,3,FALSE)),\"   \",(VLOOKUP($A12,Inscription!$A$6:$G$205,4,FALSE))),\" \")","v":" "},null,{"$f":"IF($A12>0,(VLOOKUP($A12,Inscription!$A$6:$G$205,5,FALSE)),\" \")","v":" "},{"$f":"IF($A12>0,(VLOOKUP($A12,Inscription!$A$6:$G$205,6,FALSE)),\" \")","v":" "},{"$f":"IF($A12>0,(VLOOKUP($A12,Inscription!$A$6:$G$205,7,FALSE)),\" \")","v":" "}]
[null,null,{"$f":"IF(A13>0,CONCATENATE((VLOOKUP($A13,Inscription!$A$6:$G$205,3,FALSE)),\"   \",(VLOOKUP($A13,Inscription!$A$6:$G$205,4,FALSE))),\" \")","v":" "},null,{"$f":"IF($A13>0,(VLOOKUP($A13,Inscription!$A$6:$G$205,5,FALSE)),\" \")","v":" "},{"$f":"IF($A13>0,(VLOOKUP($A13,Inscription!$A$6:$G$205,6,FALSE)),\" \")","v":" "},{"$f":"IF($A13>0,(VLOOKUP($A13,Inscription!$A$6:$G$205,7,FALSE)),\" \")","v":" "}]
[null,null,{"$f":"IF(A14>0,CONCATENATE((VLOOKUP($A14,Inscription!$A$6:$G$205,3,FALSE)),\"   \",(VLOOKUP($A14,Inscription!$A$6:$G$205,4,FALSE))),\" \")","v":" "},null,{"$f":"IF($A14>0,(VLOOKUP($A14,Inscription!$A$6:$G$205,5,FALSE)),\" \")","v":" "},{"$f":"IF($A14>0,(VLOOKUP($A14,Inscription!$A$6:$G$205,6,FALSE)),\" \")","v":" "},{"$f":"IF($A14>0,(VLOOKUP($A14,Inscription!$A$6:$G$205,7,FALSE)),\" \")","v":" "}]
[null,null,{"$f":"IF(A15>0,CONCATENATE((VLOOKUP($A15,Inscription!$A$6:$G$205,3,FALSE)),\"   \",(VLOOKUP($A15,Inscription!$A$6:$G$205,4,FALSE))),\" \")","v":" "},null,{"$f":"IF($A15>0,(VLOOKUP($A15,Inscription!$A$6:$G$205,5,FALSE)),\" \")","v":" "},{"$f":"IF($A15>0,(VLOOKUP($A15,Inscription!$A$6:$G$205,6,FALSE)),\" \")","v":" "},{"$f":"IF($A15>0,(VLOOKUP($A15,Inscription!$A$6:$G$205,7,FALSE)),\" \")","v":" "}]
[null,null,{"$f":"IF(A16>0,CONCATENATE((VLOOKUP($A16,Inscription!$A$6:$G$205,3,FALSE)),\"   \",(VLOOKUP($A16,Inscription!$A$6:$G$205,4,FALSE))),\" \")","v":" "},null,{"$f":"IF($A16>0,(VLOOKUP($A16,Inscription!$A$6:$G$205,5,FALSE)),\" \")","v":" "},{"$f":"IF($A16>0,(VLOOKUP($A16,Inscription!$A$6:$G$205,6,FALSE)),\" \")","v":" "},{"$f":"IF($A16>0,(VLOOKUP($A16,Inscription!$A$6:$G$205,7,FALSE)),\" \")","v":" "}]
[null,null,{"$f":"IF(A17>0,CONCATENATE((VLOOKUP($A17,Inscription!$A$6:$G$205,3,FALSE)),\"   \",(VLOOKUP($A17,Inscription!$A$6:$G$205,4,FALSE))),\" \")","v":" "},null,{"$f":"IF($A17>0,(VLOOKUP($A17,Inscription!$A$6:$G$205,5,FALSE)),\" \")","v":" "},{"$f":"IF($A17>0,(VLOOKUP($A17,Inscription!$A$6:$G$205,6,FALSE)),\" \")","v":" "},{"$f":"IF($A17>0,(VLOOKUP($A17,Inscription!$A$6:$G$205,7,FALSE)),\" \")","v":" "}]
[null,null,{"$f":"IF(A18>0,CONCATENATE((VLOOKUP($A18,Inscription!$A$6:$G$205,3,FALSE)),\"   \",(VLOOKUP($A18,Inscription!$A$6:$G$205,4,FALSE))),\" \")","v":" "},null,{"$f":"IF($A18>0,(VLOOKUP($A18,Inscription!$A$6:$G$205,5,FALSE)),\" \")","v":" "},{"$f":"IF($A18>0,(VLOOKUP($A18,Inscription!$A$6:$G$205,6,FALSE)),\" \")","v":" "},{"$f":"IF($A18>0,(VLOOKUP($A18,Inscription!$A$6:$G$205,7,FALSE)),\" \")","v":" "}]
[null,null,{"$f":"IF(A19>0,CONCATENATE((VLOOKUP($A19,Inscription!$A$6:$G$205,3,FALSE)),\"   \",(VLOOKUP($A19,Inscription!$A$6:$G$205,4,FALSE))),\" \")","v":" "},null,{"$f":"IF($A19>0,(VLOOKUP($A19,Inscription!$A$6:$G$205,5,FALSE)),\" \")","v":" "},{"$f":"IF($A19>0,(VLOOKUP($A19,Inscription!$A$6:$G$205,6,FALSE)),\" \")","v":" "},{"$f":"IF($A19>0,(VLOOKUP($A19,Inscription!$A$6:$G$205,7,FALSE)),\" \")","v":" "}]
[null,null,{"$f":"IF(A20>0,CONCATENATE((VLOOKUP($A20,Inscription!$A$6:$G$205,3,FALSE)),\"   \",(VLOOKUP($A20,Inscription!$A$6:$G$205,4,FALSE))),\" \")","v":" "},null,{"$f":"IF($A20>0,(VLOOKUP($A20,Inscription!$A$6:$G$205,5,FALSE)),\" \")","v":" "},{"$f":"IF($A20>0,(VLOOKUP($A20,Inscription!$A$6:$G$205,6,FALSE)),\" \")","v":" "},{"$f":"IF($A20>0,(VLOOKUP($A20,Inscription!$A$6:$G$205,7,FALSE)),\" \")","v":" "}]
[null,null,{"$f":"IF(A21>0,CONCATENATE((VLOOKUP($A21,Inscription!$A$6:$G$205,3,FALSE)),\"   \",(VLOOKUP($A21,Inscription!$A$6:$G$205,4,FALSE))),\" \")","v":" "},null,{"$f":"IF($A21>0,(VLOOKUP($A21,Inscription!$A$6:$G$205,5,FALSE)),\" \")","v":" "},{"$f":"IF($A21>0,(VLOOKUP($A21,Inscription!$A$6:$G$205,6,FALSE)),\" \")","v":" "},{"$f":"IF($A21>0,(VLOOKUP($A21,Inscription!$A$6:$G$205,7,FALSE)),\" \")","v":" "}]
[null,null,{"$f":"IF(A22>0,CONCATENATE((VLOOKUP($A22,Inscription!$A$6:$G$205,3,FALSE)),\"   \",(VLOOKUP($A22,Inscription!$A$6:$G$205,4,FALSE))),\" \")","v":" "},null,{"$f":"IF($A22>0,(VLOOKUP($A22,Inscription!$A$6:$G$205,5,FALSE)),\" \")","v":" "},{"$f":"IF($A22>0,(VLOOKUP($A22,Inscription!$A$6:$G$205,6,FALSE)),\" \")","v":" "},{"$f":"IF($A22>0,(VLOOKUP($A22,Inscription!$A$6:$G$205,7,FALSE)),\" \")","v":" "}]
[null,null,{"$f":"IF(A23>0,CONCATENATE((VLOOKUP($A23,Inscription!$A$6:$G$205,3,FALSE)),\"   \",(VLOOKUP($A23,Inscription!$A$6:$G$205,4,FALSE))),\" \")","v":" "},null,{"$f":"IF($A23>0,(VLOOKUP($A23,Inscription!$A$6:$G$205,5,FALSE)),\" \")","v":" "},{"$f":"IF($A23>0,(VLOOKUP($A23,Inscription!$A$6:$G$205,6,FALSE)),\" \")","v":" "},{"$f":"IF($A23>0,(VLOOKUP($A23,Inscription!$A$6:$G$205,7,FALSE)),\" \")","v":" "}]
[null,null,{"$f":"IF(A24>0,CONCATENATE((VLOOKUP($A24,Inscription!$A$6:$G$205,3,FALSE)),\"   \",(VLOOKUP($A24,Inscription!$A$6:$G$205,4,FALSE))),\" \")","v":" "},null,{"$f":"IF($A24>0,(VLOOKUP($A24,Inscription!$A$6:$G$205,5,FALSE)),\" \")","v":" "},{"$f":"IF($A24>0,(VLOOKUP($A24,Inscription!$A$6:$G$205,6,FALSE)),\" \")","v":" "},{"$f":"IF($A24>0,(VLOOKUP($A24,Inscription!$A$6:$G$205,7,FALSE)),\" \")","v":" "}]
[null,null,{"$f":"IF(A25>0,CONCATENATE((VLOOKUP($A25,Inscription!$A$6:$G$205,3,FALSE)),\"   \",(VLOOKUP($A25,Inscription!$A$6:$G$205,4,FALSE))),\" \")","v":" "},null,{"$f":"IF($A25>0,(VLOOKUP($A25,Inscription!$A$6:$G$205,5,FALSE)),\" \")","v":" "},{"$f":"IF($A25>0,(VLOOKUP($A25,Inscription!$A$6:$G$205,6,FALSE)),\" \")","v":" "},{"$f":"IF($A25>0,(VLOOKUP($A25,Inscription!$A$6:$G$205,7,FALSE)),\" \")","v":" "}]
[null,null,{"$f":"IF(A26>0,CONCATENATE((VLOOKUP($A26,Inscription!$A$6:$G$205,3,FALSE)),\"   \",(VLOOKUP($A26,Inscription!$A$6:$G$205,4,FALSE))),\" \")","v":" "},null,{"$f":"IF($A26>0,(VLOOKUP($A26,Inscription!$A$6:$G$205,5,FALSE)),\" \")","v":" "},{"$f":"IF($A26>0,(VLOOKUP($A26,Inscription!$A$6:$G$205,6,FALSE)),\" \")","v":" "},{"$f":"IF($A26>0,(VLOOKUP($A26,Inscription!$A$6:$G$205,7,FALSE)),\" \")","v":" "}]
[null,null,{"$f":"IF(A27>0,CONCATENATE((VLOOKUP($A27,Inscription!$A$6:$G$205,3,FALSE)),\"   \",(VLOOKUP($A27,Inscription!$A$6:$G$205,4,FALSE))),\" \")","v":" "},null,{"$f":"IF($A27>0,(VLOOKUP($A27,Inscription!$A$6:$G$205,5,FALSE)),\" \")","v":" "},{"$f":"IF($A27>0,(VLOOKUP($A27,Inscription!$A$6:$G$205,6,FALSE)),\" \")","v":" "},{"$f":"IF($A27>0,(VLOOKUP($A27,Inscription!$A$6:$G$205,7,FALSE)),\" \")","v":" "}]
[null,null,{"$f":"IF(A28>0,CONCATENATE((VLOOKUP($A28,Inscription!$A$6:$G$205,3,FALSE)),\"   \",(VLOOKUP($A28,Inscription!$A$6:$G$205,4,FALSE))),\" \")","v":" "},null,{"$f":"IF($A28>0,(VLOOKUP($A28,Inscription!$A$6:$G$205,5,FALSE)),\" \")","v":" "},{"$f":"IF($A28>0,(VLOOKUP($A28,Inscription!$A$6:$G$205,6,FALSE)),\" \")","v":" "},{"$f":"IF($A28>0,(VLOOKUP($A28,Inscription!$A$6:$G$205,7,FALSE)),\" \")","v":" "}]
[null,null,{"$f":"IF(A29>0,CONCATENATE((VLOOKUP($A29,Inscription!$A$6:$G$205,3,FALSE)),\"   \",(VLOOKUP($A29,Inscription!$A$6:$G$205,4,FALSE))),\" \")","v":" "},null,{"$f":"IF($A29>0,(VLOOKUP($A29,Inscription!$A$6:$G$205,5,FALSE)),\" \")","v":" "},{"$f":"IF($A29>0,(VLOOKUP($A29,Inscription!$A$6:$G$205,6,FALSE)),\" \")","v":" "},{"$f":"IF($A29>0,(VLOOKUP($A29,Inscription!$A$6:$G$205,7,FALSE)),\" \")","v":" "}]
[null,null,{"$f":"IF(A30>0,CONCATENATE((VLOOKUP($A30,Inscription!$A$6:$G$205,3,FALSE)),\"   \",(VLOOKUP($A30,Inscription!$A$6:$G$205,4,FALSE))),\" \")","v":" "},null,{"$f":"IF($A30>0,(VLOOKUP($A30,Inscription!$A$6:$G$205,5,FALSE)),\" \")","v":" "},{"$f":"IF($A30>0,(VLOOKUP($A30,Inscription!$A$6:$G$205,6,FALSE)),\" \")","v":" "},{"$f":"IF($A30>0,(VLOOKUP($A30,Inscription!$A$6:$G$205,7,FALSE)),\" \")","v":" "}]
[null,null,{"$f":"IF(A31>0,CONCATENATE((VLOOKUP($A31,Inscription!$A$6:$G$205,3,FALSE)),\"   \",(VLOOKUP($A31,Inscription!$A$6:$G$205,4,FALSE))),\" \")","v":" "},null,{"$f":"IF($A31>0,(VLOOKUP($A31,Inscription!$A$6:$G$205,5,FALSE)),\" \")","v":" "},{"$f":"IF($A31>0,(VLOOKUP($A31,Inscription!$A$6:$G$205,6,FALSE)),\" \")","v":" "},{"$f":"IF($A31>0,(VLOOKUP($A31,Inscription!$A$6:$G$205,7,FALSE)),\" \")","v":" "}]
[null,null,{"$f":"IF(A32>0,CONCATENATE((VLOOKUP($A32,Inscription!$A$6:$G$205,3,FALSE)),\"   \",(VLOOKUP($A32,Inscription!$A$6:$G$205,4,FALSE))),\" \")","v":" "},null,{"$f":"IF($A32>0,(VLOOKUP($A32,Inscription!$A$6:$G$205,5,FALSE)),\" \")","v":" "},{"$f":"IF($A32>0,(VLOOKUP($A32,Inscription!$A$6:$G$205,6,FALSE)),\" \")","v":" "},{"$f":"IF($A32>0,(VLOOKUP($A32,Inscription!$A$6:$G$205,7,FALSE)),\" \")","v":" "}]
[null,null,{"$f":"IF(A33>0,CONCATENATE((VLOOKUP($A33,Inscription!$A$6:$G$205,3,FALSE)),\"   \",(VLOOKUP($A33,Inscription!$A$6:$G$205,4,FALSE))),\" \")","v":" "},null,{"$f":"IF($A33>0,(VLOOKUP($A33,Inscription!$A$6:$G$205,5,FALSE)),\" \")","v":" "},{"$f":"IF($A33>0,(VLOOKUP($A33,Inscription!$A$6:$G$205,6,FALSE)),\" \")","v":" "},{"$f":"IF($A33>0,(VLOOKUP($A33,Inscription!$A$6:$G$205,7,FALSE)),\" \")","v":" "}]
[null,null,{"$f":"IF(A34>0,CONCATENATE((VLOOKUP($A34,Inscription!$A$6:$G$205,3,FALSE)),\"   \",(VLOOKUP($A34,Inscription!$A$6:$G$205,4,FALSE))),\" \")","v":" "},null,{"$f":"IF($A34>0,(VLOOKUP($A34,Inscription!$A$6:$G$205,5,FALSE)),\" \")","v":" "},{"$f":"IF($A34>0,(VLOOKUP($A34,Inscription!$A$6:$G$205,6,FALSE)),\" \")","v":" "},{"$f":"IF($A34>0,(VLOOKUP($A34,Inscription!$A$6:$G$205,7,FALSE)),\" \")","v":" "}]
[null,null,{"$f":"IF(A35>0,CONCATENATE((VLOOKUP($A35,Inscription!$A$6:$G$205,3,FALSE)),\"   \",(VLOOKUP($A35,Inscription!$A$6:$G$205,4,FALSE))),\" \")","v":" "},null,{"$f":"IF($A35>0,(VLOOKUP($A35,Inscription!$A$6:$G$205,5,FALSE)),\" \")","v":" "},{"$f":"IF($A35>0,(VLOOKUP($A35,Inscription!$A$6:$G$205,6,FALSE)),\" \")","v":" "},{"$f":"IF($A35>0,(VLOOKUP($A35,Inscription!$A$6:$G$205,7,FALSE)),\" \")","v":" "}]
[null,null,{"$f":"IF(A36>0,CONCATENATE((VLOOKUP($A36,Inscription!$A$6:$G$205,3,FALSE)),\"   \",(VLOOKUP($A36,Inscription!$A$6:$G$205,4,FALSE))),\" \")","v":" "},null,{"$f":"IF($A36>0,(VLOOKUP($A36,Inscription!$A$6:$G$205,5,FALSE)),\" \")","v":" "},{"$f":"IF($A36>0,(VLOOKUP($A36,Inscription!$A$6:$G$205,6,FALSE)),\" \")","v":" "},{"$f":"IF($A36>0,(VLOOKUP($A36,Inscription!$A$6:$G$205,7,FALSE)),\" \")","v":" "}]
[null,null,{"$f":"IF(A37>0,CONCATENATE((VLOOKUP($A37,Inscription!$A$6:$G$205,3,FALSE)),\"   \",(VLOOKUP($A37,Inscription!$A$6:$G$205,4,FALSE))),\" \")","v":" "},null,{"$f":"IF($A37>0,(VLOOKUP($A37,Inscription!$A$6:$G$205,5,FALSE)),\" \")","v":" "},{"$f":"IF($A37>0,(VLOOKUP($A37,Inscription!$A$6:$G$205,6,FALSE)),\" \")","v":" "},{"$f":"IF($A37>0,(VLOOKUP($A37,Inscription!$A$6:$G$205,7,FALSE)),\" \")","v":" "}]
[null,null,{"$f":"IF(A38>0,CONCATENATE((VLOOKUP($A38,Inscription!$A$6:$G$205,3,FALSE)),\"   \",(VLOOKUP($A38,Inscription!$A$6:$G$205,4,FALSE))),\" \")","v":" "},null,{"$f":"IF($A38>0,(VLOOKUP($A38,Inscription!$A$6:$G$205,5,FALSE)),\" \")","v":" "},{"$f":"IF($A38>0,(VLOOKUP($A38,Inscription!$A$6:$G$205,6,FALSE)),\" \")","v":" "},{"$f":"IF($A38>0,(VLOOKUP($A38,Inscription!$A$6:$G$205,7,FALSE)),\" \")","v":" "}]
[null,null,{"$f":"IF(A39>0,CONCATENATE((VLOOKUP($A39,Inscription!$A$6:$G$205,3,FALSE)),\"   \",(VLOOKUP($A39,Inscription!$A$6:$G$205,4,FALSE))),\" \")","v":" "},null,{"$f":"IF($A39>0,(VLOOKUP($A39,Inscription!$A$6:$G$205,5,FALSE)),\" \")","v":" "},{"$f":"IF($A39>0,(VLOOKUP($A39,Inscription!$A$6:$G$205,6,FALSE)),\" \")","v":" "},{"$f":"IF($A39>0,(VLOOKUP($A39,Inscription!$A$6:$G$205,7,FALSE)),\" \")","v":" "}]
["ENGAGEMENTS SUR PLACE AU PRIX D EQUIPE (Nom de l'association)"]
[]
[]
[]
[]
[]
[null,null,null,null,{"$f":"COUNTA(E40:G43)","v":0}]
[null,null,null,null,{"$f":"$E$7","v":0}]
[]
[null,"Le Commissaire :\nNOM :\nSIGNATURE :",null,null,"LE CLUB ORGANISATEUR :\nNOM :\nSIGNATURE :",null,"VISA COMPTABILITE :\n\nDATE :"]
["IMPRIME A JOINDRE AVEC L'ETAT DE RESULTAT. "]

{"sheet":"EMARGEMENT","index":4,"n_rows":202,"n_cols":6,"rows_kept":202,"cut":false,"hidden":true,"merged":[[0,0,0,5]]}
["FEUILLE D EMARGEMENT"]
["DOSS.","NOM PRENOM","CLUB","CATEGORIE","LICENCE N°","SIGNATURE"]
[{"$f":"Inscription!A6","v":1},{"$f":"CONCATENATE(Inscription!C6,\"  \",Inscription!D6)","v":"LEVEQUE   Nathan"},{"$f":"Inscription!E6","v":"district loudéac"},{"$f":"Inscription!F6","v":"poussin"},{"$f":"Inscription!G6","v":0}]
[{"$f":"Inscription!A7","v":2},{"$f":"CONCATENATE(Inscription!C7,\"  \",Inscription!D7)","v":"BARS  Gabin"},{"$f":"Inscription!E7","v":"begard vtt gwerun"},{"$f":"Inscription!F7","v":"poussin"},{"$f":"Inscription!G7","v":407364}]
[{"$f":"Inscription!A8","v":3},{"$f":"CONCATENATE(Inscription!C8,\"  \",Inscription!D8)","v":"BASSET  Evan"},{"$f":"Inscription!E8","v":"vc evron"},{"$f":"Inscription!F8","v":"poussin"},{"$f":"Inscription!G8","v":0}]
[{"$f":"Inscription!A9","v":4},{"$f":"CONCATENATE(Inscription!C9,\"  \",Inscription!D9)","v":"BANNER  Livia"},{"$f":"Inscription!E9","v":"vtt du lié"},{"$f":"Inscription!F9","v":"poussin"},{"$f":"Inscription!G9","v":0}]
[{"$f":"Inscription!A10","v":5},{"$f":"CONCATENATE(Inscription!C10,\"  \",Inscription!D10)","v":"MACE  Loukas"},{"$f":"Inscription!E10","v":"vc evron"},{"$f":"Inscription!F10","v":"poussin"},{"$f":"Inscription!G10","v":996776}]
[{"$f":"Inscription!A11","v":6},{"$f":"CONCATENATE(Inscription!C11,\"  \",Inscription!D11)","v":"BARS  Yvann"},{"$f":"Inscription!E11","v":"begard vtt gwerun"},{"$f":"Inscription!F11","v":"pupille"},{"$f":"Inscription!G11","v":310008}]
[{"$f":"Inscription!A12","v":7},{"$f":"CONCATENATE(Inscription!C12,\"  \",Inscription!D12)","v":"COLAS  Thibaut"},{"$f":"Inscription!E12","v":"begard vtt gwerun"},{"$f":"Inscription!F12","v":"pupille"},{"$f":"Inscription!G12","v":330206}]
[{"$f":"Inscription!A13","v":8},{"$f":"CONCATENATE(Inscription!C13,\"  \",Inscription!D13)","v":"LEPERCQ  Batiste"},{"$f":"Inscription!E13","v":"uc plaudren"},{"$f":"Inscription!F13","v":"pupille"},{"$f":"Inscription!G13","v":391433}]
[{"$f":"Inscription!A14","v":9},{"$f":"CONCATENATE(Inscription!C14,\"  \",Inscription!D14)","v":"CLERET MARECHAL  Loeiz"},{"$f":"Inscription!E14","v":"vtt cotes d'armor hillion"},{"$f":"Inscription!F14","v":"pupille"},{"$f":"Inscription!G14","v":0}]
[{"$f":"Inscription!A15","v":10},{"$f":"CONCATENATE(Inscription!C15,\"  \",Inscription!D15)","v":"POILVET  Paul"},{"$f":"Inscription!E15","v":"vc evron"},{"$f":"Inscription!F15","v":"benjamin"},{"$f":"Inscription!G15","v":382428}]
[{"$f":"Inscription!A16","v":11},{"$f":"CONCATENATE(Inscription!C16,\"  \",Inscription!D16)","v":"POILVET  Jules"},{"$f":"Inscription!E16","v":"vc evron"},{"$f":"Inscription!F16","v":"benjamin"},{"$f":"Inscription!G16","v":382431}]
[{"$f":"Inscription!A17","v":12},{"$f":"CONCATENATE(Inscription!C17,\"  \",Inscription!D17)","v":"LEPERCQ  Clara"},{"$f":"Inscription!E17","v":"uc plaudren"},{"$f":"Inscription!F17","v":"benjamin"},{"$f":"Inscription!G17","v":467480}]
[{"$f":"Inscription!A18","v":13},{"$f":"CONCATENATE(Inscription!C18,\"  \",Inscription!D18)","v":"BOLORE  Loevan"},{"$f":"Inscription!E18","v":"team bikers"},{"$f":"Inscription!F18","v":"benjamin"},{"$f":"Inscription!G18","v":376265}]
[{"$f":"Inscription!A19","v":14},{"$f":"CONCATENATE(Inscription!C19,\"  \",Inscription!D19)","v":"BANNER  Rafael"},{"$f":"Inscription!E19","v":"vtt du lié"},{"$f":"Inscription!F19","v":"benjamin"},{"$f":"Inscription!G19","v":0}]
[{"$f":"Inscription!A20","v":15},{"$f":"CONCATENATE(Inscription!C20,\"  \",Inscription!D20)","v":"BRIAND  Axel"},{"$f":"Inscription!E20","v":"team bikers"},{"$f":"Inscription!F20","v":"benjamin"},{"$f":"Inscription!G20","v":429219}]
[{"$f":"Inscription!A21","v":16},{"$f":"CONCATENATE(Inscription!C21,\"  \",Inscription!D21)","v":"BOUGEARD HORNAIS  Aymeris"},{"$f":"Inscription!E21","v":"team bikers"},{"$f":"Inscription!F21","v":"benjamin"},{"$f":"Inscription!G21","v":431285}]
[{"$f":"Inscription!A22","v":17},{"$f":"CONCATENATE(Inscription!C22,\"  \",Inscription!D22)","v":"  "},{"$f":"Inscription!E22","v":0},{"$f":"Inscription!F22","v":0},{"$f":"Inscription!G22","v":0}]
[{"$f":"Inscription!A23","v":18},{"$f":"CONCATENATE(Inscription!C23,\"  \",Inscription!D23)","v":"  "},{"$f":"Inscription!E23","v":0},{"$f":"Inscription!F23","v":0},{"$f":"Inscription!G23","v":0}]
[{"$f":"Inscription!A24","v":19},{"$f":"CONCATENATE(Inscription!C24,\"  \",Inscription!D24)","v":"  "},{"$f":"Inscription!E24","v":0},{"$f":"Inscription!F24","v":0},{"$f":"Inscription!G24","v":0}]
[{"$f":"Inscription!A25","v":20},{"$f":"CONCATENATE(Inscription!C25,\"  \",Inscription!D25)","v":"BRIEND  Ilhan"},{"$f":"Inscription!E25","v":"accro cycles cotes d'émeraude"},{"$f":"Inscription!F25","v":"minimes"},{"$f":"Inscription!G25","v":919871}]
[{"$f":"Inscription!A26","v":21},{"$f":"CONCATENATE(Inscription!C26,\"  \",Inscription!D26)","v":"LE BIHAN  Clément "},{"$f":"Inscription!E26","v":"uc plaudren"},{"$f":"Inscription!F26","v":"minimes"},{"$f":"Inscription!G26","v":968158}]
[{"$f":"Inscription!A27","v":22},{"$f":"CONCATENATE(Inscription!C27,\"  \",Inscription!D27)","v":"BOLORE  Ewen"},{"$f":"Inscription!E27","v":"team bikers"},{"$f":"Inscription!F27","v":"minimes"},{"$f":"Inscription!G27","v":376263}]
[{"$f":"Inscription!A28","v":23},{"$f":"CONCATENATE(Inscription!C28,\"  \",Inscription!D28)","v":"ROUILLE  Robin"},{"$f":"Inscription!E28","v":"team bikers"},{"$f":"Inscription!F28","v":"minimes"},{"$f":"Inscription!G28","v":390947}]
[{"$f":"Inscription!A29","v":24},{"$f":"CONCATENATE(Inscription!C29,\"  \",Inscription!D29)","v":"BASSET  Loris"},{"$f":"Inscription!E29","v":"vc evron"},{"$f":"Inscription!F29","v":"minimes"},{"$f":"Inscription!G29","v":0}]
[{"$f":"Inscription!A30","v":25},{"$f":"CONCATENATE(Inscription!C30,\"  \",Inscription!D30)","v":"BRIAND  Mathis"},{"$f":"Inscription!E30","v":"team bikers"},{"$f":"Inscription!F30","v":"minimes"},{"$f":"Inscription!G30","v":431995}]
[{"$f":"Inscription!A31","v":26},{"$f":"CONCATENATE(Inscription!C31,\"  \",Inscription!D31)","v":"BOUGEARD  Margot"},{"$f":"Inscription!E31","v":"team bikers"},{"$f":"Inscription!F31","v":"minimes"},{"$f":"Inscription!G31","v":431290}]
[{"$f":"Inscription!A32","v":27},{"$f":"CONCATENATE(Inscription!C32,\"  \",Inscription!D32)","v":"GUILMIN  Léo"},{"$f":"Inscription!E32","v":"vc evron"},{"$f":"Inscription!F32","v":"minimes"},{"$f":"Inscription!G32","v":344464}]
[{"$f":"Inscription!A33","v":28},{"$f":"CONCATENATE(Inscription!C33,\"  \",Inscription!D33)","v":"  "},{"$f":"Inscription!E33","v":0},{"$f":"Inscription!F33","v":0},{"$f":"Inscription!G33","v":0}]
[{"$f":"Inscription!A34","v":29},{"$f":"CONCATENATE(Inscription!C34,\"  \",Inscription!D34)","v":"  "},{"$f":"Inscription!E34","v":0},{"$f":"Inscription!F34","v":0},{"$f":"Inscription!G34","v":0}]
[{"$f":"Inscription!A35","v":30},{"$f":"CONCATENATE(Inscription!C35,\"  \",Inscription!D35)","v":"FERTE  Brandon"},{"$f":"Inscription!E35","v":"distric loudéac"},{"$f":"Inscription!F35","v":"cadet"},{"$f":"Inscription!G35","v":297227}]
[{"$f":"Inscription!A36","v":31},{"$f":"CONCATENATE(Inscription!C36,\"  \",Inscription!D36)","v":"LEPERCQ  Nathan"},{"$f":"Inscription!E36","v":"uc plaudren"},{"$f":"Inscription!F36","v":"cadet"},{"$f":"Inscription!G36","v":389000}]
[{"$f":"Inscription!A37","v":32},{"$f":"CONCATENATE(Inscription!C37,\"  \",Inscription!D37)","v":"  "},{"$f":"Inscription!E37","v":0},{"$f":"Inscription!F37","v":0},{"$f":"Inscription!G37","v":0}]
[{"$f":"Inscription!A38","v":33},{"$f":"CONCATENATE(Inscription!C38,\"  \",Inscription!D38)","v":"  "},{"$f":"Inscription!E38","v":0},{"$f":"Inscription!#REF!","v":{"$error":"#REF!"}},{"$f":"Inscription!#REF!","v":{"$error":"#REF!"}}]
[{"$f":"Inscription!A39","v":34},{"$f":"CONCATENATE(Inscription!C39,\"  \",Inscription!D39)","v":"  "},{"$f":"Inscription!E39","v":0},{"$f":"Inscription!F39","v":0},{"$f":"Inscription!G39","v":0}]
[{"$f":"Inscription!A40","v":35},{"$f":"CONCATENATE(Inscription!C40,\"  \",Inscription!D40)","v":"HALLET  Baptiste"},{"$f":"Inscription!E40","v":"vc plurien"},{"$f":"Inscription!F40","v":"espoir"},{"$f":"Inscription!G40","v":136613}]
[{"$f":"Inscription!A41","v":36},{"$f":"CONCATENATE(Inscription!C41,\"  \",Inscription!D41)","v":"  "},{"$f":"Inscription!E41","v":0},{"$f":"Inscription!F41","v":0},{"$f":"Inscription!G41","v":0}]
[{"$f":"Inscription!A42","v":37},{"$f":"CONCATENATE(Inscription!C42,\"  \",Inscription!D42)","v":"  "},{"$f":"Inscription!E42","v":0},{"$f":"Inscription!F42","v":0},{"$f":"Inscription!G42","v":0}]
[{"$f":"Inscription!A43","v":38},{"$f":"CONCATENATE(Inscription!C43,\"  \",Inscription!D43)","v":"  "},{"$f":"Inscription!E43","v":0},{"$f":"Inscription!F43","v":0},{"$f":"Inscription!G43","v":0}]
[{"$f":"Inscription!A44","v":39},{"$f":"CONCATENATE(Inscription!C44,\"  \",Inscription!D44)","v":"  "},{"$f":"Inscription!E44","v":0},{"$f":"Inscription!F44","v":0},{"$f":"Inscription!G44","v":0}]
[{"$f":"Inscription!A45","v":40},{"$f":"CONCATENATE(Inscription!C45,\"  \",Inscription!D45)","v":"KEURMEUR  Romain"},{"$f":"Inscription!E45","v":"team mégrit"},{"$f":"Inscription!F45","v":"1ère cat"},{"$f":"Inscription!G45","v":363251}]
[{"$f":"Inscription!A46","v":41},{"$f":"CONCATENATE(Inscription!C46,\"  \",Inscription!D46)","v":"BANNER  Mickael"},{"$f":"Inscription!E46","v":"vtt du lié"},"vtt du lié","1ère cat"]
[{"$f":"Inscription!A47","v":42},{"$f":"CONCATENATE(Inscription!C47,\"  \",Inscription!D47)","v":"BOUGEARD  Pierre-Yves"},{"$f":"Inscription!E47","v":"team bickers"},{"$f":"Inscription!F47","v":"1ère cat"},{"$f":"Inscription!G47","v":376257}]
[{"$f":"Inscription!A48","v":43},{"$f":"CONCATENATE(Inscription!C48,\"  \",Inscription!D48)","v":"BASSET  Emerick"},{"$f":"Inscription!E48","v":"vc evron"},{"$f":"Inscription!F48","v":"1ère cat"},{"$f":"Inscription!G48","v":371872}]
[{"$f":"Inscription!A49","v":44},{"$f":"CONCATENATE(Inscription!C49,\"  \",Inscription!D49)","v":"  "},{"$f":"Inscription!E49","v":0},{"$f":"Inscription!F49","v":0},{"$f":"Inscription!G49","v":0}]
[{"$f":"Inscription!A50","v":45},{"$f":"CONCATENATE(Inscription!C50,\"  \",Inscription!D50)","v":"JEUNEU  Gilles"},{"$f":"Inscription!E50","v":"accro cycles cotes d'émeraude"},{"$f":"Inscription!F50","v":"2ème cat"},{"$f":"Inscription!G50","v":137390}]
[{"$f":"Inscription!A51","v":46},{"$f":"CONCATENATE(Inscription!C51,\"  \",Inscription!D51)","v":"LESNE  Régis"},{"$f":"Inscription!E51","v":"district loudéac"},{"$f":"Inscription!F51","v":"2ème cat"},{"$f":"Inscription!G51","v":227933}]
[{"$f":"Inscription!A52","v":47},{"$f":"CONCATENATE(Inscription!C52,\"  \",Inscription!D52)","v":"BEDEL  Bapiste"},{"$f":"Inscription!E52","v":"district loudéac"},{"$f":"Inscription!F52","v":"2ème cat"},{"$f":"Inscription!G52","v":13637}]
[{"$f":"Inscription!A53","v":48},{"$f":"CONCATENATE(Inscription!C53,\"  \",Inscription!D53)","v":"COLAS  Emmanuel"},{"$f":"Inscription!E53","v":"begard vtt gwerun"},{"$f":"Inscription!F53","v":"2ème cat"},{"$f":"Inscription!G53","v":386450}]
[{"$f":"Inscription!A54","v":49},{"$f":"CONCATENATE(Inscription!C54,\"  \",Inscription!D54)","v":"COLLEU  Pascal"},{"$f":"Inscription!E54","v":"ccvb"},{"$f":"Inscription!F54","v":"2ème cat"},{"$f":"Inscription!G54","v":511956}]
[{"$f":"Inscription!A55","v":50},{"$f":"CONCATENATE(Inscription!C55,\"  \",Inscription!D55)","v":"MACE  Jérome"},{"$f":"Inscription!E55","v":"vc evron"},{"$f":"Inscription!F55","v":"2ème cat"},{"$f":"Inscription!G55","v":434904}]
[{"$f":"Inscription!A56","v":51},{"$f":"CONCATENATE(Inscription!C56,\"  \",Inscription!D56)","v":"BRIAND   Régis"},{"$f":"Inscription!E56","v":"team bickers"},{"$f":"Inscription!F56","v":"2ème cat"},{"$f":"Inscription!G56","v":429231}]
[{"$f":"Inscription!A57","v":52},{"$f":"CONCATENATE(Inscription!C57,\"  \",Inscription!D57)","v":"MOUTTE  Alexis"},{"$f":"Inscription!E57","v":"team du pays de dinan guinefort"},{"$f":"Inscription!F57","v":"2ème cat"},{"$f":"Inscription!G57","v":0}]
[{"$f":"Inscription!A58","v":53},{"$f":"CONCATENATE(Inscription!C58,\"  \",Inscription!D58)","v":"MARIVINT  Alexis"},{"$f":"Inscription!E58","v":"vc evron"},{"$f":"Inscription!F58","v":"2ème cat"},{"$f":"Inscription!G58","v":294510}]
[{"$f":"Inscription!A59","v":54},{"$f":"CONCATENATE(Inscription!C59,\"  \",Inscription!D59)","v":"LECOMTE   Guillaume"},{"$f":"Inscription!E59","v":"team xc du léguer"},{"$f":"Inscription!F59","v":"2ème cat"},{"$f":"Inscription!G59","v":998834}]
[{"$f":"Inscription!A60","v":55},{"$f":"CONCATENATE(Inscription!C60,\"  \",Inscription!D60)","v":"  "},{"$f":"Inscription!E60","v":0},{"$f":"Inscription!F60","v":0},{"$f":"Inscription!G60","v":0}]
[{"$f":"Inscription!A61","v":56},{"$f":"CONCATENATE(Inscription!C61,\"  \",Inscription!D61)","v":"  "},{"$f":"Inscription!E61","v":0},{"$f":"Inscription!F61","v":0},{"$f":"Inscription!G61","v":0}]
[{"$f":"Inscription!A62","v":57},{"$f":"CONCATENATE(Inscription!C62,\"  \",Inscription!D62)","v":"  "},{"$f":"Inscription!E62","v":0},{"$f":"Inscription!F62","v":0},{"$f":"Inscription!G62","v":0}]
[{"$f":"Inscription!A63","v":58},{"$f":"CONCATENATE(Inscription!C63,\"  \",Inscription!D63)","v":"  "},{"$f":"Inscription!E63","v":0},{"$f":"Inscription!F63","v":0},{"$f":"Inscription!G63","v":0}]
[{"$f":"Inscription!A64","v":59},{"$f":"CONCATENATE(Inscription!C64,\"  \",Inscription!D64)","v":"  "},{"$f":"Inscription!E64","v":0},{"$f":"Inscription!F64","v":0},{"$f":"Inscription!G64","v":0}]
[{"$f":"Inscription!A65","v":60},{"$f":"CONCATENATE(Inscription!C65,\"  \",Inscription!D65)","v":"GOUYA  Noel"},{"$f":"Inscription!E65","v":"team du pays de dinan guinefort"},{"$f":"Inscription!F65","v":"3ème cat"},{"$f":"Inscription!G65","v":226768}]
[{"$f":"Inscription!A66","v":61},{"$f":"CONCATENATE(Inscription!C66,\"  \",Inscription!D66)","v":"GUILLOT  Denis"},{"$f":"Inscription!E66","v":"team du pays de dinan guinefort"},{"$f":"Inscription!F66","v":"3ème cat"},{"$f":"Inscription!G66","v":844159}]
[{"$f":"Inscription!A67","v":62},{"$f":"CONCATENATE(Inscription!C67,\"  \",Inscription!D67)","v":"DURAND  Jacques"},{"$f":"Inscription!E67","v":"team du pays de dinan guinefort"},{"$f":"Inscription!F67","v":"3ème cat"},{"$f":"Inscription!G67","v":144227}]
[{"$f":"Inscription!A68","v":63},{"$f":"CONCATENATE(Inscription!C68,\"  \",Inscription!D68)","v":"COUALAN  Dominique"},{"$f":"Inscription!E68","v":"cc pleven"},{"$f":"Inscription!F68","v":"3ème cat"},{"$f":"Inscription!G68","v":153631}]
[{"$f":"Inscription!A69","v":64},{"$f":"CONCATENATE(Inscription!C69,\"  \",Inscription!D69)","v":"LEMAITRE  Alain"},{"$f":"Inscription!E69","v":"ac vildé guingalan"},{"$f":"Inscription!F69","v":"3ème cat"},{"$f":"Inscription!G69","v":225454}]
[{"$f":"Inscription!A70","v":65},{"$f":"CONCATENATE(Inscription!C70,\"  \",Inscription!D70)","v":"NICOLAS   Jean Charles"},{"$f":"Inscription!E70","v":"ac vildé guingalan"},{"$f":"Inscription!F70","v":"3ème cat"},{"$f":"Inscription!G70","v":514101}]
[{"$f":"Inscription!A71","v":66},{"$f":"CONCATENATE(Inscription!C71,\"  \",Inscription!D71)","v":"GEORGET  Charles"},{"$f":"Inscription!E71","v":"district loudéac"},{"$f":"Inscription!F71","v":"3ème cat"},{"$f":"Inscription!G71","v":227931}]
[{"$f":"Inscription!A72","v":67},{"$f":"CONCATENATE(Inscription!C72,\"  \",Inscription!D72)","v":"BEDEL   Michel"},{"$f":"Inscription!E72","v":"district loudéac"},{"$f":"Inscription!F72","v":"3ème cat"},{"$f":"Inscription!G72","v":267277}]
[{"$f":"Inscription!A73","v":68},{"$f":"CONCATENATE(Inscription!C73,\"  \",Inscription!D73)","v":"GOUYA  Alain"},{"$f":"Inscription!E73","v":"district loudéac"},{"$f":"Inscription!F73","v":"3ème cat"},{"$f":"Inscription!G73","v":136125}]
[{"$f":"Inscription!A74","v":69},{"$f":"CONCATENATE(Inscription!C74,\"  \",Inscription!D74)","v":"GAILLARD  Marcel"},{"$f":"Inscription!E74","v":"cos kerentrech"},{"$f":"Inscription!F74","v":"3ème cat"},{"$f":"Inscription!G74","v":57243}]
[{"$f":"Inscription!A75","v":70},{"$f":"CONCATENATE(Inscription!C75,\"  \",Inscription!D75)","v":"COLAS   Roger"},{"$f":"Inscription!E75","v":"vc crehen"},{"$f":"Inscription!F75","v":"3ème cat"},{"$f":"Inscription!G75","v":227437}]
[{"$f":"Inscription!A76","v":71},{"$f":"CONCATENATE(Inscription!C76,\"  \",Inscription!D76)","v":"GOUPIL  Michel"},{"$f":"Inscription!E76","v":"team mégrit"},{"$f":"Inscription!F76","v":"3ème cat"},{"$f":"Inscription!G76","v":55779611}]
[{"$f":"Inscription!A77","v":72},{"$f":"CONCATENATE(Inscription!C77,\"  \",Inscription!D77)","v":"LECELLIER  Raymond"},{"$f":"Inscription!E77","v":"team mégrit"},{"$f":"Inscription!F77","v":"3ème cat"},{"$f":"Inscription!G77","v":55656150}]
[{"$f":"Inscription!A78","v":73},{"$f":"CONCATENATE(Inscription!C78,\"  \",Inscription!D78)","v":"ROPERCH  Bruno"},{"$f":"Inscription!E78","v":"uc plaudren"},{"$f":"Inscription!F78","v":"3ème cat"},{"$f":"Inscription!G78","v":875266}]
[{"$f":"Inscription!A79","v":74},{"$f":"CONCATENATE(Inscription!C79,\"  \",Inscription!D79)","v":"  "},{"$f":"Inscription!E79","v":0},{"$f":"Inscription!F79","v":0},{"$f":"Inscription!G79","v":0}]
[{"$f":"Inscription!A80","v":75},{"$f":"CONCATENATE(Inscription!C80,\"  \",Inscription!D80)","v":"  "},{"$f":"Inscription!E80","v":0},{"$f":"Inscription!F80","v":0},{"$f":"Inscription!G80","v":0}]
[{"$f":"Inscription!A81","v":76},{"$f":"CONCATENATE(Inscription!C81,\"  \",Inscription!D81)","v":"  "},{"$f":"Inscription!E81","v":0},{"$f":"Inscription!F81","v":0},{"$f":"Inscription!G81","v":0}]
[{"$f":"Inscription!A82","v":77},{"$f":"CONCATENATE(Inscription!C82,\"  \",Inscription!D82)","v":"  "},{"$f":"Inscription!E82","v":0},{"$f":"Inscription!F82","v":0},{"$f":"Inscription!G82","v":0}]
[{"$f":"Inscription!A83","v":78},{"$f":"CONCATENATE(Inscription!C83,\"  \",Inscription!D83)","v":"  "},{"$f":"Inscription!E83","v":0},{"$f":"Inscription!F83","v":0},{"$f":"Inscription!G83","v":0}]
[{"$f":"Inscription!A84","v":79},{"$f":"CONCATENATE(Inscription!C84,\"  \",Inscription!D84)","v":"  "},{"$f":"Inscription!E84","v":0},{"$f":"Inscription!F84","v":0},{"$f":"Inscription!G84","v":0}]
[{"$f":"Inscription!A85","v":80},{"$f":"CONCATENATE(Inscription!C85,\"  \",Inscription!D85)","v":"  "},{"$f":"Inscription!E85","v":0},{"$f":"Inscription!F85","v":0},{"$f":"Inscription!G85","v":0}]
[{"$f":"Inscription!A86","v":81},{"$f":"CONCATENATE(Inscription!C86,\"  \",Inscription!D86)","v":"  "},{"$f":"Inscription!E86","v":0},{"$f":"Inscription!F86","v":0},{"$f":"Inscription!G86","v":0}]
[{"$f":"Inscription!A87","v":82},{"$f":"CONCATENATE(Inscription!C87,\"  \",Inscription!D87)","v":"  "},{"$f":"Inscription!E87","v":0},{"$f":"Inscription!F87","v":0},{"$f":"Inscription!G87","v":0}]
[{"$f":"Inscription!A88","v":83},{"$f":"CONCATENATE(Inscription!C88,\"  \",Inscription!D88)","v":"  "},{"$f":"Inscription!E88","v":0},{"$f":"Inscription!F88","v":0},{"$f":"Inscription!G88","v":0}]
[{"$f":"Inscription!A89","v":84},{"$f":"CONCATENATE(Inscription!C89,\"  \",Inscription!D89)","v":"  "},{"$f":"Inscription!E89","v":0},{"$f":"Inscription!F89","v":0},{"$f":"Inscription!G89","v":0}]
[{"$f":"Inscription!A90","v":85},{"$f":"CONCATENATE(Inscription!C90,\"  \",Inscription!D90)","v":"  "},{"$f":"Inscription!E90","v":0},{"$f":"Inscription!F90","v":0},{"$f":"Inscription!G90","v":0}]
[{"$f":"Inscription!A91","v":86},{"$f":"CONCATENATE(Inscription!C91,\"  \",Inscription!D91)","v":"  "},{"$f":"Inscription!E91","v":0},{"$f":"Inscription!F91","v":0},{"$f":"Inscription!G91","v":0}]
[{"$f":"Inscription!A92","v":87},{"$f":"CONCATENATE(Inscription!C92,\"  \",Inscription!D92)","v":"  "},{"$f":"Inscription!E92","v":0},{"$f":"Inscription!F92","v":0},{"$f":"Inscription!G92","v":0}]
[{"$f":"Inscription!A93","v":88},{"$f":"CONCATENATE(Inscription!C93,\"  \",Inscription!D93)","v":"  "},{"$f":"Inscription!E93","v":0},{"$f":"Inscription!F93","v":0},{"$f":"Inscription!G93","v":0}]
[{"$f":"Inscription!A94","v":89},{"$f":"CONCATENATE(Inscription!C94,\"  \",Inscription!D94)","v":"  "},{"$f":"Inscription!E94","v":0},{"$f":"Inscription!F94","v":0},{"$f":"Inscription!G94","v":0}]
[{"$f":"Inscription!A95","v":90},{"$f":"CONCATENATE(Inscription!C95,\"  \",Inscription!D95)","v":"  "},{"$f":"Inscription!E95","v":0},{"$f":"Inscription!F95","v":0},{"$f":"Inscription!G95","v":0}]
[{"$f":"Inscription!A96","v":91},{"$f":"CONCATENATE(Inscription!C96,\"  \",Inscription!D96)","v":"  "},{"$f":"Inscription!E96","v":0},{"$f":"Inscription!F96","v":0},{"$f":"Inscription!G96","v":0}]
[{"$f":"Inscription!A97","v":92},{"$f":"CONCATENATE(Inscription!C97,\"  \",Inscription!D97)","v":"  "},{"$f":"Inscription!E97","v":0},{"$f":"Inscription!F97","v":0},{"$f":"Inscription!G97","v":0}]
[{"$f":"Inscription!A98","v":93},{"$f":"CONCATENATE(Inscription!C98,\"  \",Inscription!D98)","v":"  "},{"$f":"Inscription!E98","v":0},{"$f":"Inscription!F98","v":0},{"$f":"Inscription!G98","v":0}]
[{"$f":"Inscription!A99","v":94},{"$f":"CONCATENATE(Inscription!C99,\"  \",Inscription!D99)","v":"  "},{"$f":"Inscription!E99","v":0},{"$f":"Inscription!F99","v":0},{"$f":"Inscription!G99","v":0}]
[{"$f":"Inscription!A100","v":95},{"$f":"CONCATENATE(Inscription!C100,\"  \",Inscription!D100)","v":"  "},{"$f":"Inscription!E100","v":0},{"$f":"Inscription!F100","v":0},{"$f":"Inscription!G100","v":0}]
[{"$f":"Inscription!A101","v":96},{"$f":"CONCATENATE(Inscription!C101,\"  \",Inscription!D101)","v":"  "},{"$f":"Inscription!E101","v":0},{"$f":"Inscription!F101","v":0},{"$f":"Inscription!G101","v":0}]
[{"$f":"Inscription!A102","v":97},{"$f":"CONCATENATE(Inscription!C102,\"  \",Inscription!D102)","v":"  "},{"$f":"Inscription!E102","v":0},{"$f":"Inscription!F102","v":0},{"$f":"Inscription!G102","v":0}]
[{"$f":"Inscription!A103","v":98},{"$f":"CONCATENATE(Inscription!C103,\"  \",Inscription!D103)","v":"  "},{"$f":"Inscription!E103","v":0},{"$f":"Inscription!F103","v":0},{"$f":"Inscription!G103","v":0}]
[{"$f":"Inscription!A104","v":99},{"$f":"CONCATENATE(Inscription!C104,\"  \",Inscription!D104)","v":"  "},{"$f":"Inscription!E104","v":0},{"$f":"Inscription!F104","v":0},{"$f":"Inscription!G104","v":0}]
[{"$f":"Inscription!A105","v":100},{"$f":"CONCATENATE(Inscription!C105,\"  \",Inscription!D105)","v":"  "},{"$f":"Inscription!E105","v":0},{"$f":"Inscription!F105","v":0},{"$f":"Inscription!G105","v":0}]
[{"$f":"Inscription!A106","v":101},{"$f":"CONCATENATE(Inscription!C106,\"  \",Inscription!D106)","v":"  "},{"$f":"Inscription!E106","v":0},{"$f":"Inscription!F106","v":0},{"$f":"Inscription!G106","v":0}]
[{"$f":"Inscription!A107","v":102},{"$f":"CONCATENATE(Inscription!C107,\"  \",Inscription!D107)","v":"  "},{"$f":"Inscription!E107","v":0},{"$f":"Inscription!F107","v":0},{"$f":"Inscription!G107","v":0}]
[{"$f":"Inscription!A108","v":103},{"$f":"CONCATENATE(Inscription!C108,\"  \",Inscription!D108)","v":"  "},{"$f":"Inscription!E108","v":0},{"$f":"Inscription!F108","v":0},{"$f":"Inscription!G108","v":0}]
[{"$f":"Inscription!A109","v":104},{"$f":"CONCATENATE(Inscription!C109,\"  \",Inscription!D109)","v":"  "},{"$f":"Inscription!E109","v":0},{"$f":"Inscription!F109","v":0},{"$f":"Inscription!G109","v":0}]
[{"$f":"Inscription!A110","v":105},{"$f":"CONCATENATE(Inscription!C110,\"  \",Inscription!D110)","v":"  "},{"$f":"Inscription!E110","v":0},{"$f":"Inscription!F110","v":0},{"$f":"Inscription!G110","v":0}]
[{"$f":"Inscription!A111","v":106},{"$f":"CONCATENATE(Inscription!C111,\"  \",Inscription!D111)","v":"  "},{"$f":"Inscription!E111","v":0},{"$f":"Inscription!F111","v":0},{"$f":"Inscription!G111","v":0}]
[{"$f":"Inscription!A112","v":107},{"$f":"CONCATENATE(Inscription!C112,\"  \",Inscription!D112)","v":"  "},{"$f":"Inscription!E112","v":0},{"$f":"Inscription!F112","v":0},{"$f":"Inscription!G112","v":0}]
[{"$f":"Inscription!A113","v":108},{"$f":"CONCATENATE(Inscription!C113,\"  \",Inscription!D113)","v":"  "},{"$f":"Inscription!E113","v":0},{"$f":"Inscription!F113","v":0},{"$f":"Inscription!G113","v":0}]
[{"$f":"Inscription!A114","v":109},{"$f":"CONCATENATE(Inscription!C114,\"  \",Inscription!D114)","v":"  "},{"$f":"Inscription!E114","v":0},{"$f":"Inscription!F114","v":0},{"$f":"Inscription!G114","v":0}]
[{"$f":"Inscription!A115","v":110},{"$f":"CONCATENATE(Inscription!C115,\"  \",Inscription!D115)","v":"  "},{"$f":"Inscription!E115","v":0},{"$f":"Inscription!F115","v":0},{"$f":"Inscription!G115","v":0}]
[{"$f":"Inscription!A116","v":111},{"$f":"CONCATENATE(Inscription!C116,\"  \",Inscription!D116)","v":"  "},{"$f":"Inscription!E116","v":0},{"$f":"Inscription!F116","v":0},{"$f":"Inscription!G116","v":0}]
[{"$f":"Inscription!A117","v":112},{"$f":"CONCATENATE(Inscription!C117,\"  \",Inscription!D117)","v":"  "},{"$f":"Inscription!E117","v":0},{"$f":"Inscription!F117","v":0},{"$f":"Inscription!G117","v":0}]
[{"$f":"Inscription!A118","v":113},{"$f":"CONCATENATE(Inscription!C118,\"  \",Inscription!D118)","v":"  "},{"$f":"Inscription!E118","v":0},{"$f":"Inscription!F118","v":0},{"$f":"Inscription!G118","v":0}]
[{"$f":"Inscription!A119","v":114},{"$f":"CONCATENATE(Inscription!C119,\"  \",Inscription!D119)","v":"  "},{"$f":"Inscription!E119","v":0},{"$f":"Inscription!F119","v":0},{"$f":"Inscription!G119","v":0}]
[{"$f":"Inscription!A120","v":115},{"$f":"CONCATENATE(Inscription!C120,\"  \",Inscription!D120)","v":"  "},{"$f":"Inscription!E120","v":0},{"$f":"Inscription!F120","v":0},{"$f":"Inscription!G120","v":0}]
[{"$f":"Inscription!A121","v":116},{"$f":"CONCATENATE(Inscription!C121,\"  \",Inscription!D121)","v":"  "},{"$f":"Inscription!E121","v":0},{"$f":"Inscription!F121","v":0},{"$f":"Inscription!G121","v":0}]
[{"$f":"Inscription!A122","v":117},{"$f":"CONCATENATE(Inscription!C122,\"  \",Inscription!D122)","v":"  "},{"$f":"Inscription!E122","v":0},{"$f":"Inscription!F122","v":0},{"$f":"Inscription!G122","v":0}]
[{"$f":"Inscription!A123","v":118},{"$f":"CONCATENATE(Inscription!C123,\"  \",Inscription!D123)","v":"  "},{"$f":"Inscription!E123","v":0},{"$f":"Inscription!F123","v":0},{"$f":"Inscription!G123","v":0}]
[{"$f":"Inscription!A124","v":119},{"$f":"CONCATENATE(Inscription!C124,\"  \",Inscription!D124)","v":"  "},{"$f":"Inscription!E124","v":0},{"$f":"Inscription!F124","v":0},{"$f":"Inscription!G124","v":0}]
[{"$f":"Inscription!A125","v":120},{"$f":"CONCATENATE(Inscription!C125,\"  \",Inscription!D125)","v":"  "},{"$f":"Inscription!E125","v":0},{"$f":"Inscription!F125","v":0},{"$f":"Inscription!G125","v":0}]
[{"$f":"Inscription!A126","v":121},{"$f":"CONCATENATE(Inscription!C126,\"  \",Inscription!D126)","v":"  "},{"$f":"Inscription!E126","v":0},{"$f":"Inscription!F126","v":0},{"$f":"Inscription!G126","v":0}]
[{"$f":"Inscription!A127","v":122},{"$f":"CONCATENATE(Inscription!C127,\"  \",Inscription!D127)","v":"  "},{"$f":"Inscription!E127","v":0},{"$f":"Inscription!F127","v":0},{"$f":"Inscription!G127","v":0}]
[{"$f":"Inscription!A128","v":123},{"$f":"CONCATENATE(Inscription!C128,\"  \",Inscription!D128)","v":"  "},{"$f":"Inscription!E128","v":0},{"$f":"Inscription!F128","v":0},{"$f":"Inscription!G128","v":0}]
[{"$f":"Inscription!A129","v":124},{"$f":"CONCATENATE(Inscription!C129,\"  \",Inscription!D129)","v":"  "},{"$f":"Inscription!E129","v":0},{"$f":"Inscription!F129","v":0},{"$f":"Inscription!G129","v":0}]
[{"$f":"Inscription!A130","v":125},{"$f":"CONCATENATE(Inscription!C130,\"  \",Inscription!D130)","v":"  "},{"$f":"Inscription!E130","v":0},{"$f":"Inscription!F130","v":0},{"$f":"Inscription!G130","v":0}]
[{"$f":"Inscription!A131","v":126},{"$f":"CONCATENATE(Inscription!C131,\"  \",Inscription!D131)","v":"  "},{"$f":"Inscription!E131","v":0},{"$f":"Inscription!F131","v":0},{"$f":"Inscription!G131","v":0}]
[{"$f":"Inscription!A132","v":127},{"$f":"CONCATENATE(Inscription!C132,\"  \",Inscription!D132)","v":"  "},{"$f":"Inscription!E132","v":0},{"$f":"Inscription!F132","v":0},{"$f":"Inscription!G132","v":0}]
[{"$f":"Inscription!A133","v":128},{"$f":"CONCATENATE(Inscription!C133,\"  \",Inscription!D133)","v":"  "},{"$f":"Inscription!E133","v":0},{"$f":"Inscription!F133","v":0},{"$f":"Inscription!G133","v":0}]
[{"$f":"Inscription!A134","v":129},{"$f":"CONCATENATE(Inscription!C134,\"  \",Inscription!D134)","v":"  "},{"$f":"Inscription!E134","v":0},{"$f":"Inscription!F134","v":0},{"$f":"Inscription!G134","v":0}]
[{"$f":"Inscription!A135","v":130},{"$f":"CONCATENATE(Inscription!C135,\"  \",Inscription!D135)","v":"  "},{"$f":"Inscription!E135","v":0},{"$f":"Inscription!F135","v":0},{"$f":"Inscription!G135","v":0}]
[{"$f":"Inscription!A136","v":131},{"$f":"CONCATENATE(Inscription!C136,\"  \",Inscription!D136)","v":"  "},{"$f":"Inscription!E136","v":0},{"$f":"Inscription!F136","v":0},{"$f":"Inscription!G136","v":0}]
[{"$f":"Inscription!A137","v":132},{"$f":"CONCATENATE(Inscription!C137,\"  \",Inscription!D137)","v":"  "},{"$f":"Inscription!E137","v":0},{"$f":"Inscription!F137","v":0},{"$f":"Inscription!G137","v":0}]
[{"$f":"Inscription!A138","v":133},{"$f":"CONCATENATE(Inscription!C138,\"  \",Inscription!D138)","v":"  "},{"$f":"Inscription!E138","v":0},{"$f":"Inscription!F138","v":0},{"$f":"Inscription!G138","v":0}]
[{"$f":"Inscription!A139","v":134},{"$f":"CONCATENATE(Inscription!C139,\"  \",Inscription!D139)","v":"  "},{"$f":"Inscription!E139","v":0},{"$f":"Inscription!F139","v":0},{"$f":"Inscription!G139","v":0}]
[{"$f":"Inscription!A140","v":135},{"$f":"CONCATENATE(Inscription!C140,\"  \",Inscription!D140)","v":"  "},{"$f":"Inscription!E140","v":0},{"$f":"Inscription!F140","v":0},{"$f":"Inscription!G140","v":0}]
[{"$f":"Inscription!A141","v":136},{"$f":"CONCATENATE(Inscription!C141,\"  \",Inscription!D141)","v":"  "},{"$f":"Inscription!E141","v":0},{"$f":"Inscription!F141","v":0},{"$f":"Inscription!G141","v":0}]
[{"$f":"Inscription!A142","v":137},{"$f":"CONCATENATE(Inscription!C142,\"  \",Inscription!D142)","v":"  "},{"$f":"Inscription!E142","v":0},{"$f":"Inscription!F142","v":0},{"$f":"Inscription!G142","v":0}]
[{"$f":"Inscription!A143","v":138},{"$f":"CONCATENATE(Inscription!C143,\"  \",Inscription!D143)","v":"  "},{"$f":"Inscription!E143","v":0},{"$f":"Inscription!F143","v":0},{"$f":"Inscription!G143","v":0}]
[{"$f":"Inscription!A144","v":139},{"$f":"CONCATENATE(Inscription!C144,\"  \",Inscription!D144)","v":"  "},{"$f":"Inscription!E144","v":0},{"$f":"Inscription!F144","v":0},{"$f":"Inscription!G144","v":0}]
[{"$f":"Inscription!A145","v":140},{"$f":"CONCATENATE(Inscription!C145,\"  \",Inscription!D145)","v":"  "},{"$f":"Inscription!E145","v":0},{"$f":"Inscription!F145","v":0},{"$f":"Inscription!G145","v":0}]
[{"$f":"Inscription!A146","v":141},{"$f":"CONCATENATE(Inscription!C146,\"  \",Inscription!D146)","v":"  "},{"$f":"Inscription!E146","v":0},{"$f":"Inscription!F146","v":0},{"$f":"Inscription!G146","v":0}]
[{"$f":"Inscription!A147","v":142},{"$f":"CONCATENATE(Inscription!C147,\"  \",Inscription!D147)","v":"  "},{"$f":"Inscription!E147","v":0},{"$f":"Inscription!F147","v":0},{"$f":"Inscription!G147","v":0}]
[{"$f":"Inscription!A148","v":143},{"$f":"CONCATENATE(Inscription!C148,\"  \",Inscription!D148)","v":"  "},{"$f":"Inscription!E148","v":0},{"$f":"Inscription!F148","v":0},{"$f":"Inscription!G148","v":0}]
[{"$f":"Inscription!A149","v":144},{"$f":"CONCATENATE(Inscription!C149,\"  \",Inscription!D149)","v":"  "},{"$f":"Inscription!E149","v":0},{"$f":"Inscription!F149","v":0},{"$f":"Inscription!G149","v":0}]
[{"$f":"Inscription!A150","v":145},{"$f":"CONCATENATE(Inscription!C150,\"  \",Inscription!D150)","v":"  "},{"$f":"Inscription!E150","v":0},{"$f":"Inscription!F150","v":0},{"$f":"Inscription!G150","v":0}]
[{"$f":"Inscription!A151","v":146},{"$f":"CONCATENATE(Inscription!C151,\"  \",Inscription!D151)","v":"  "},{"$f":"Inscription!E151","v":0},{"$f":"Inscription!F151","v":0},{"$f":"Inscription!G151","v":0}]
[{"$f":"Inscription!A152","v":147},{"$f":"CONCATENATE(Inscription!C152,\"  \",Inscription!D152)","v":"  "},{"$f":"Inscription!E152","v":0},{"$f":"Inscription!F152","v":0},{"$f":"Inscription!G152","v":0}]
[{"$f":"Inscription!A153","v":148},{"$f":"CONCATENATE(Inscription!C153,\"  \",Inscription!D153)","v":"  "},{"$f":"Inscription!E153","v":0},{"$f":"Inscription!F153","v":0},{"$f":"Inscription!G153","v":0}]
[{"$f":"Inscription!A154","v":149},{"$f":"CONCATENATE(Inscription!C154,\"  \",Inscription!D154)","v":"  "},{"$f":"Inscription!E154","v":0},{"$f":"Inscription!F154","v":0},{"$f":"Inscription!G154","v":0}]
[{"$f":"Inscription!A155","v":150},{"$f":"CONCATENATE(Inscription!C155,\"  \",Inscription!D155)","v":"  "},{"$f":"Inscription!E155","v":0},{"$f":"Inscription!F155","v":0},{"$f":"Inscription!G155","v":0}]
[{"$f":"Inscription!A156","v":151},{"$f":"CONCATENATE(Inscription!C156,\"  \",Inscription!D156)","v":"  "},{"$f":"Inscription!E156","v":0},{"$f":"Inscription!F156","v":0},{"$f":"Inscription!G156","v":0}]
[{"$f":"Inscription!A157","v":152},{"$f":"CONCATENATE(Inscription!C157,\"  \",Inscription!D157)","v":"  "},{"$f":"Inscription!E157","v":0},{"$f":"Inscription!F157","v":0},{"$f":"Inscription!G157","v":0}]
[{"$f":"Inscription!A158","v":153},{"$f":"CONCATENATE(Inscription!C158,\"  \",Inscription!D158)","v":"  "},{"$f":"Inscription!E158","v":0},{"$f":"Inscription!F158","v":0},{"$f":"Inscription!G158","v":0}]
[{"$f":"Inscription!A159","v":154},{"$f":"CONCATENATE(Inscription!C159,\"  \",Inscription!D159)","v":"  "},{"$f":"Inscription!E159","v":0},{"$f":"Inscription!F159","v":0},{"$f":"Inscription!G159","v":0}]
[{"$f":"Inscription!A160","v":155},{"$f":"CONCATENATE(Inscription!C160,\"  \",Inscription!D160)","v":"  "},{"$f":"Inscription!E160","v":0},{"$f":"Inscription!F160","v":0},{"$f":"Inscription!G160","v":0}]
[{"$f":"Inscription!A161","v":156},{"$f":"CONCATENATE(Inscription!C161,\"  \",Inscription!D161)","v":"  "},{"$f":"Inscription!E161","v":0},{"$f":"Inscription!F161","v":0},{"$f":"Inscription!G161","v":0}]
[{"$f":"Inscription!A162","v":157},{"$f":"CONCATENATE(Inscription!C162,\"  \",Inscription!D162)","v":"  "},{"$f":"Inscription!E162","v":0},{"$f":"Inscription!F162","v":0},{"$f":"Inscription!G162","v":0}]
[{"$f":"Inscription!A163","v":158},{"$f":"CONCATENATE(Inscription!C163,\"  \",Inscription!D163)","v":"  "},{"$f":"Inscription!E163","v":0},{"$f":"Inscription!F163","v":0},{"$f":"Inscription!G163","v":0}]
[{"$f":"Inscription!A164","v":159},{"$f":"CONCATENATE(Inscription!C164,\"  \",Inscription!D164)","v":"  "},{"$f":"Inscription!E164","v":0},{"$f":"Inscription!F164","v":0},{"$f":"Inscription!G164","v":0}]
[{"$f":"Inscription!A165","v":160},{"$f":"CONCATENATE(Inscription!C165,\"  \",Inscription!D165)","v":"  "},{"$f":"Inscription!E165","v":0},{"$f":"Inscription!F165","v":0},{"$f":"Inscription!G165","v":0}]
[{"$f":"Inscription!A166","v":161},{"$f":"CONCATENATE(Inscription!C166,\"  \",Inscription!D166)","v":"  "},{"$f":"Inscription!E166","v":0},{"$f":"Inscription!F166","v":0},{"$f":"Inscription!G166","v":0}]
[{"$f":"Inscription!A167","v":162},{"$f":"CONCATENATE(Inscription!C167,\"  \",Inscription!D167)","v":"  "},{"$f":"Inscription!E167","v":0},{"$f":"Inscription!F167","v":0},{"$f":"Inscription!G167","v":0}]
[{"$f":"Inscription!A168","v":163},{"$f":"CONCATENATE(Inscription!C168,\"  \",Inscription!D168)","v":"  "},{"$f":"Inscription!E168","v":0},{"$f":"Inscription!F168","v":0},{"$f":"Inscription!G168","v":0}]
[{"$f":"Inscription!A169","v":164},{"$f":"CONCATENATE(Inscription!C169,\"  \",Inscription!D169)","v":"  "},{"$f":"Inscription!E169","v":0},{"$f":"Inscription!F169","v":0},{"$f":"Inscription!G169","v":0}]
[{"$f":"Inscription!A170","v":165},{"$f":"CONCATENATE(Inscription!C170,\"  \",Inscription!D170)","v":"  "},{"$f":"Inscription!E170","v":0},{"$f":"Inscription!F170","v":0},{"$f":"Inscription!G170","v":0}]
[{"$f":"Inscription!A171","v":166},{"$f":"CONCATENATE(Inscription!C171,\"  \",Inscription!D171)","v":"  "},{"$f":"Inscription!E171","v":0},{"$f":"Inscription!F171","v":0},{"$f":"Inscription!G171","v":0}]
[{"$f":"Inscription!A172","v":167},{"$f":"CONCATENATE(Inscription!C172,\"  \",Inscription!D172)","v":"  "},{"$f":"Inscription!E172","v":0},{"$f":"Inscription!F172","v":0},{"$f":"Inscription!G172","v":0}]
[{"$f":"Inscription!A173","v":168},{"$f":"CONCATENATE(Inscription!C173,\"  \",Inscription!D173)","v":"  "},{"$f":"Inscription!E173","v":0},{"$f":"Inscription!F173","v":0},{"$f":"Inscription!G173","v":0}]
[{"$f":"Inscription!A174","v":169},{"$f":"CONCATENATE(Inscription!C174,\"  \",Inscription!D174)","v":"  "},{"$f":"Inscription!E174","v":0},{"$f":"Inscription!F174","v":0},{"$f":"Inscription!G174","v":0}]
[{"$f":"Inscription!A175","v":170},{"$f":"CONCATENATE(Inscription!C175,\"  \",Inscription!D175)","v":"  "},{"$f":"Inscription!E175","v":0},{"$f":"Inscription!F175","v":0},{"$f":"Inscription!G175","v":0}]
[{"$f":"Inscription!A176","v":171},{"$f":"CONCATENATE(Inscription!C176,\"  \",Inscription!D176)","v":"  "},{"$f":"Inscription!E176","v":0},{"$f":"Inscription!F176","v":0},{"$f":"Inscription!G176","v":0}]
[{"$f":"Inscription!A177","v":172},{"$f":"CONCATENATE(Inscription!C177,\"  \",Inscription!D177)","v":"  "},{"$f":"Inscription!E177","v":0},{"$f":"Inscription!F177","v":0},{"$f":"Inscription!G177","v":0}]
[{"$f":"Inscription!A178","v":173},{"$f":"CONCATENATE(Inscription!C178,\"  \",Inscription!D178)","v":"  "},{"$f":"Inscription!E178","v":0},{"$f":"Inscription!F178","v":0},{"$f":"Inscription!G178","v":0}]
[{"$f":"Inscription!A179","v":174},{"$f":"CONCATENATE(Inscription!C179,\"  \",Inscription!D179)","v":"  "},{"$f":"Inscription!E179","v":0},{"$f":"Inscription!F179","v":0},{"$f":"Inscription!G179","v":0}]
[{"$f":"Inscription!A180","v":175},{"$f":"CONCATENATE(Inscription!C180,\"  \",Inscription!D180)","v":"  "},{"$f":"Inscription!E180","v":0},{"$f":"Inscription!F180","v":0},{"$f":"Inscription!G180","v":0}]
[{"$f":"Inscription!A181","v":176},{"$f":"CONCATENATE(Inscription!C181,\"  \",Inscription!D181)","v":"  "},{"$f":"Inscription!E181","v":0},{"$f":"Inscription!F181","v":0},{"$f":"Inscription!G181","v":0}]
[{"$f":"Inscription!A182","v":177},{"$f":"CONCATENATE(Inscription!C182,\"  \",Inscription!D182)","v":"  "},{"$f":"Inscription!E182","v":0},{"$f":"Inscription!F182","v":0},{"$f":"Inscription!G182","v":0}]
[{"$f":"Inscription!A183","v":178},{"$f":"CONCATENATE(Inscription!C183,\"  \",Inscription!D183)","v":"  "},{"$f":"Inscription!E183","v":0},{"$f":"Inscription!F183","v":0},{"$f":"Inscription!G183","v":0}]
[{"$f":"Inscription!A184","v":179},{"$f":"CONCATENATE(Inscription!C184,\"  \",Inscription!D184)","v":"  "},{"$f":"Inscription!E184","v":0},{"$f":"Inscription!F184","v":0},{"$f":"Inscription!G184","v":0}]
[{"$f":"Inscription!A185","v":180},{"$f":"CONCATENATE(Inscription!C185,\"  \",Inscription!D185)","v":"  "},{"$f":"Inscription!E185","v":0},{"$f":"Inscription!F185","v":0},{"$f":"Inscription!G185","v":0}]
[{"$f":"Inscription!A186","v":181},{"$f":"CONCATENATE(Inscription!C186,\"  \",Inscription!D186)","v":"  "},{"$f":"Inscription!E186","v":0},{"$f":"Inscription!F186","v":0},{"$f":"Inscription!G186","v":0}]
[{"$f":"Inscription!A187","v":182},{"$f":"CONCATENATE(Inscription!C187,\"  \",Inscription!D187)","v":"  "},{"$f":"Inscription!E187","v":0},{"$f":"Inscription!F187","v":0},{"$f":"Inscription!G187","v":0}]
[{"$f":"Inscription!A188","v":183},{"$f":"CONCATENATE(Inscription!C188,\"  \",Inscription!D188)","v":"  "},{"$f":"Inscription!E188","v":0},{"$f":"Inscription!F188","v":0},{"$f":"Inscription!G188","v":0}]
[{"$f":"Inscription!A189","v":184},{"$f":"CONCATENATE(Inscription!C189,\"  \",Inscription!D189)","v":"  "},{"$f":"Inscription!E189","v":0},{"$f":"Inscription!F189","v":0},{"$f":"Inscription!G189","v":0}]
[{"$f":"Inscription!A190","v":185},{"$f":"CONCATENATE(Inscription!C190,\"  \",Inscription!D190)","v":"  "},{"$f":"Inscription!E190","v":0},{"$f":"Inscription!F190","v":0},{"$f":"Inscription!G190","v":0}]
[{"$f":"Inscription!A191","v":186},{"$f":"CONCATENATE(Inscription!C191,\"  \",Inscription!D191)","v":"  "},{"$f":"Inscription!E191","v":0},{"$f":"Inscription!F191","v":0},{"$f":"Inscription!G191","v":0}]
[{"$f":"Inscription!A192","v":187},{"$f":"CONCATENATE(Inscription!C192,\"  \",Inscription!D192)","v":"  "},{"$f":"Inscription!E192","v":0},{"$f":"Inscription!F192","v":0},{"$f":"Inscription!G192","v":0}]
[{"$f":"Inscription!A193","v":188},{"$f":"CONCATENATE(Inscription!C193,\"  \",Inscription!D193)","v":"  "},{"$f":"Inscription!E193","v":0},{"$f":"Inscription!F193","v":0},{"$f":"Inscription!G193","v":0}]
[{"$f":"Inscription!A194","v":189},{"$f":"CONCATENATE(Inscription!C194,\"  \",Inscription!D194)","v":"  "},{"$f":"Inscription!E194","v":0},{"$f":"Inscription!F194","v":0},{"$f":"Inscription!G194","v":0}]
[{"$f":"Inscription!A195","v":190},{"$f":"CONCATENATE(Inscription!C195,\"  \",Inscription!D195)","v":"  "},{"$f":"Inscription!E195","v":0},{"$f":"Inscription!F195","v":0},{"$f":"Inscription!G195","v":0}]
[{"$f":"Inscription!A196","v":191},{"$f":"CONCATENATE(Inscription!C196,\"  \",Inscription!D196)","v":"  "},{"$f":"Inscription!E196","v":0},{"$f":"Inscription!F196","v":0},{"$f":"Inscription!G196","v":0}]
[{"$f":"Inscription!A197","v":192},{"$f":"CONCATENATE(Inscription!C197,\"  \",Inscription!D197)","v":"  "},{"$f":"Inscription!E197","v":0},{"$f":"Inscription!F197","v":0},{"$f":"Inscription!G197","v":0}]
[{"$f":"Inscription!A198","v":193},{"$f":"CONCATENATE(Inscription!C198,\"  \",Inscription!D198)","v":"  "},{"$f":"Inscription!E198","v":0},{"$f":"Inscription!F198","v":0},{"$f":"Inscription!G198","v":0}]
[{"$f":"Inscription!A199","v":194},{"$f":"CONCATENATE(Inscription!C199,\"  \",Inscription!D199)","v":"  "},{"$f":"Inscription!E199","v":0},{"$f":"Inscription!F199","v":0},{"$f":"Inscription!G199","v":0}]
[{"$f":"Inscription!A200","v":195},{"$f":"CONCATENATE(Inscription!C200,\"  \",Inscription!D200)","v":"  "},{"$f":"Inscription!E200","v":0},{"$f":"Inscription!F200","v":0},{"$f":"Inscription!G200","v":0}]
[{"$f":"Inscription!A201","v":196},{"$f":"CONCATENATE(Inscription!C201,\"  \",Inscription!D201)","v":"  "},{"$f":"Inscription!E201","v":0},{"$f":"Inscription!F201","v":0},{"$f":"Inscription!G201","v":0}]
[{"$f":"Inscription!A202","v":197},{"$f":"CONCATENATE(Inscription!C202,\"  \",Inscription!D202)","v":"  "},{"$f":"Inscription!E202","v":0},{"$f":"Inscription!F202","v":0},{"$f":"Inscription!G202","v":0}]
[{"$f":"Inscription!A203","v":198},{"$f":"CONCATENATE(Inscription!C203,\"  \",Inscription!D203)","v":"  "},{"$f":"Inscription!E203","v":0},{"$f":"Inscription!F203","v":0},{"$f":"Inscription!G203","v":0}]
[{"$f":"Inscription!A204","v":199},{"$f":"CONCATENATE(Inscription!C204,\"  \",Inscription!D204)","v":"  "},{"$f":"Inscription!E204","v":0},{"$f":"Inscription!F204","v":0},{"$f":"Inscription!G204","v":0}]
[{"$f":"Inscription!A205","v":200},{"$f":"CONCATENATE(Inscription!C205,\"  \",Inscription!D205)","v":"  "},{"$f":"Inscription!E205","v":0},{"$f":"Inscription!F205","v":0},{"$f":"Inscription!G205","v":0}]

{"sheet":"CLASSEMENT","index":5,"n_rows":203,"n_cols":39,"rows_kept":203,"cut":false,"hidden":true,"merged":[[2,3,2,4],[0,6,0,8],[0,0,0,1],[1,0,1,1],[1,2,1,4],[0,2,0,5]]}
[null,null,{"$f":"CONCATENATE(Inscription!D2,\"  \",Inscription!G2)","v":"HENANSAL  "},null,null,null,{"$f":"IF(Inscription!$D$4>0,\"DATE :  \"&TEXT(Inscription!D$4,\"jj mmmm aaaa\"),\"\")","v":"DATE :  01 octobre 2023"}]
["CATEGORIE",null,{"$f":"Inscription!#REF!","v":{"$error":"#REF!"}},null,null,"PARTANTS",{"$f":"Inscription!#REF!","v":{"$error":"#REF!"}},"CLASSES",{"$f":"COUNTA(C4:C203)","v":55}]
["Pts\n PE","Place","Doss","NOM et PRENOM",null,"ASSOCIATION","N° LICENCE","CAT.","TEMPS",null,"PLACE","TPS"]
[{"$f":"IF(B4<1,1000,(IF(AA4=B4,B4,(20100-SUM($AA$4:$AA$203))/(COUNTIF($AA$4:$AA$203,\"T\")))))","v":59.509803921568626},1,3,{"$f":"IF(C4>0,CONCATENATE((VLOOKUP($C4,Inscription!$A$6:$G$205,3,FALSE)),\"   \",(VLOOKUP($C4,Inscription!$A$6:$G$205,4,FALSE))),\" \")","v":"BASSET   Evan"},null,{"$f":"IF(C4>0,(VLOOKUP($C4,Inscription!$A$6:$G$205,5,FALSE)),\" \")","v":"vc evron"},{"$f":"IF(C4>0,(VLOOKUP($C4,Inscription!$A$6:$G$205,7,FALSE)),\" \")","v":0},{"$f":"LEFT(IF(C4>0,(VLOOKUP($C4,Inscription!$A$6:$G$205,6,FALSE)),\" \"),8)","v":"poussin"},null,{"$f":"IF(COUNTIF($F4:$F$4,$F4)<2,$F4,\" \")","v":"vc evron"},{"$f":"IF(J4=F4,A4,\"\")","v":59.509803921568626},{"$f":"IF(J4=F4,I4,\"\")","v":0},{"$f":"IF(COUNTIF($F4:$F$4,$F4)<3,$F4,\" \")","v":"vc evron"},{"$f":"IF(M4=$F4,$A4,\"\")","v":59.509803921568626},{"$f":"IF(M4=$F4,$I4,\"\")","v":0},{"$f":"IF(M4=J4,\"\",M4)","v":""},{"$f":"IF(P4=$F4,$A4,1000)","v":1000},{"$f":"IF(P4=$F4,$I4,1000)","v":1000},{"$f":"IF(COUNTIF($F4:$F$4,J4)<4,$F4,\" \")","v":"vc evron"},{"$f":"IF(S4=$F4,$A4,\"\")","v":59.509803921568626},{"$f":"IF(S4=$F4,$I4,\"\")","v":0},{"$f":"IF(S4=J4,\"\",S4)","v":""},{"$f":"IF(V4=P4,\"\",S4)","v":""},{"$f":"IF(W4=$F4,$A4,\"\")","v":""},{"$f":"IF(W4=$F4,$I4,\"\")","v":""},{"$f":"IF(COUNTIF($C$4:$C$203,C4)>1,\"X\",\" \")","v":" "},{"$f":"IF(COUNTIF($B$4:$B$203,B4)>1,\"T\",B4)","v":"T"}]
[59.509803921568626,2,4,{"$f":"IF(C5>0,CONCATENATE((VLOOKUP($C5,Inscription!$A$6:$G$205,3,FALSE)),\"   \",(VLOOKUP($C5,Inscription!$A$6:$G$205,4,FALSE))),\" \")","v":"BANNER   Livia"},null,{"$f":"IF(C5>0,(VLOOKUP($C5,Inscription!$A$6:$G$205,5,FALSE)),\" \")","v":"vtt du lié"},{"$f":"IF(C5>0,(VLOOKUP($C5,Inscription!$A$6:$G$205,7,FALSE)),\" \")","v":0},{"$f":"LEFT(IF(C5>0,(VLOOKUP($C5,Inscription!$A$6:$G$205,6,FALSE)),\" \"),8)","v":"poussin"},{"$f":"I4","v":0},{"$f":"IF(COUNTIF($F$4:$F5,$F5)<2,$F5,\" \")","v":"vtt du lié"},{"$f":"IF(J5=F5,A5,\"\")","v":59.509803921568626},{"$f":"IF(J5=F5,I5,\"\")","v":0},{"$f":"IF(COUNTIF($F$4:$F5,$F5)<3,$F5,\" \")","v":"vtt du lié"},{"$f":"IF(M5=$F5,$A5,\"\")","v":59.509803921568626},{"$f":"IF(M5=$F5,$I5,\"\")","v":0},{"$f":"IF(M5=J5,\"\",M5)","v":""},{"$f":"IF(P5=$F5,$A5,1000)","v":1000},{"$f":"IF(P5=$F5,$I5,1000)","v":1000},{"$f":"IF(COUNTIF($F$4:$F5,J5)<4,$F5,\" \")","v":"vtt du lié"},{"$f":"IF(S5=$F5,$A5,\"\")","v":59.509803921568626},{"$f":"IF(S5=$F5,$I5,\"\")","v":0},{"$f":"IF(S5=J5,\"\",S5)","v":""},{"$f":"IF(V5=P5,\"\",S5)","v":""},{"$f":"IF(W5=$F5,$A5,\"\")","v":""},{"$f":"IF(W5=$F5,$I5,\"\")","v":""}," ","T",1,{"$f":"'PRIX D EQUIPE'!B5","v":0},{"$f":"IF($AC5=\"\",1000,(IF(ISNA(VLOOKUP($AC5,$J$4:$M$203,2,FALSE)),1000,VLOOKUP($AC5,$J$4:$M$203,2,FALSE))))","v":1000},{"$f":"IF($AC5=\"\",1000,(IF(ISNA(VLOOKUP($AC5,$J$4:$M$203,3,FALSE)),1000,VLOOKUP($AC5,$J$4:$M$203,3,FALSE))))","v":1000},{"$f":"IF($AC5=\"\",1000,(IF(ISNA(VLOOKUP($AC5,$P$4:$R$203,2,FALSE)),1000,VLOOKUP($AC5,$P$4:$R$203,2,FALSE))))","v":1000},{"$f":"IF($AC5=\"\",1000,(IF(ISNA(VLOOKUP($AC5,$P$4:$R$203,3,FALSE)),1000,VLOOKUP($AC5,$P$4:$R$203,3,FALSE))))","v":1000},{"$f":"IF($AC5=\"\",1000,(IF(ISNA(VLOOKUP($AC5,$W$4:$Y$203,2,FALSE)),1000,VLOOKUP($AC5,$W$4:$Y$203,2,FALSE))))","v":1000},{"$f":"IF($AC5=\"\",1000,(IF(ISNA(VLOOKUP($AC5,$W$4:$Y$203,3,FALSE)),1000,VLOOKUP($AC5,$W$4:$Y$203,3,FALSE))))","v":1000},{"$f":"IF(AC5=\" \",\" \",IF($AC5>0,SUM(AD5+AF5+AH5),\" \"))","v":" "},{"$f":"IF(AC5=\" \",\" \",IF($AC5>0,SUM(AE5+AG5+AI5),\" \"))","v":" "}]
[59.509803921568626,3,2,{"$f":"IF(C6>0,CONCATENATE((VLOOKUP($C6,Inscription!$A$6:$G$205,3,FALSE)),\"   \",(VLOOKUP($C6,Inscription!$A$6:$G$205,4,FALSE))),\" \")","v":"BARS   Gabin"},null,{"$f":"IF(C6>0,(VLOOKUP($C6,Inscription!$A$6:$G$205,5,FALSE)),\" \")","v":"begard vtt gwerun"},{"$f":"IF(C6>0,(VLOOKUP($C6,Inscription!$A$6:$G$205,7,FALSE)),\" \")","v":407364},{"$f":"LEFT(IF(C6>0,(VLOOKUP($C6,Inscription!$A$6:$G$205,6,FALSE)),\" \"),8)","v":"poussin"},0,{"$f":"IF(COUNTIF($F$4:$F6,$F6)<2,$F6,\" \")","v":"begard vtt gwerun"},59.509803921568626,0,{"$f":"IF(COUNTIF($F$4:$F6,$F6)<3,$F6,\" \")","v":"begard vtt gwerun"},59.509803921568626,0,"",1000,1000,{"$f":"IF(COUNTIF($F$4:$F6,J6)<4,$F6,\" \")","v":"begard vtt gwerun"},59.509803921568626,0,"","","",""," ","T",2,{"$f":"'PRIX D EQUIPE'!B6","v":0},1000,1000,1000,1000,1000,1000," "," "]
[59.509803921568626,4,5,{"$f":"IF(C7>0,CONCATENATE((VLOOKUP($C7,Inscription!$A$6:$G$205,3,FALSE)),\"   \",(VLOOKUP($C7,Inscription!$A$6:$G$205,4,FALSE))),\" \")","v":"MACE   Loukas"},null,{"$f":"IF(C7>0,(VLOOKUP($C7,Inscription!$A$6:$G$205,5,FALSE)),\" \")","v":"vc evron"},{"$f":"IF(C7>0,(VLOOKUP($C7,Inscription!$A$6:$G$205,7,FALSE)),\" \")","v":996776},{"$f":"LEFT(IF(C7>0,(VLOOKUP($C7,Inscription!$A$6:$G$205,6,FALSE)),\" \"),8)","v":"poussin"},0,{"$f":"IF(COUNTIF($F$4:$F7,$F7)<2,$F7,\" \")","v":" "},"","",{"$f":"IF(COUNTIF($F$4:$F7,$F7)<3,$F7,\" \")","v":"vc evron"},59.509803921568626,0,"vc evron",59.509803921568626,0,{"$f":"IF(COUNTIF($F$4:$F7,J7)<4,$F7,\" \")","v":"vc evron"},59.509803921568626,0,"vc evron","","",""," ","T",3,{"$f":"'PRIX D EQUIPE'!B7","v":0},1000,1000,1000,1000,1000,1000," "," "]
[59.509803921568626,5,1,{"$f":"IF(C8>0,CONCATENATE((VLOOKUP($C8,Inscription!$A$6:$G$205,3,FALSE)),\"   \",(VLOOKUP($C8,Inscription!$A$6:$G$205,4,FALSE))),\" \")","v":"LEVEQUE    Nathan"},null,{"$f":"IF(C8>0,(VLOOKUP($C8,Inscription!$A$6:$G$205,5,FALSE)),\" \")","v":"district loudéac"},{"$f":"IF(C8>0,(VLOOKUP($C8,Inscription!$A$6:$G$205,7,FALSE)),\" \")","v":0},{"$f":"LEFT(IF(C8>0,(VLOOKUP($C8,Inscription!$A$6:$G$205,6,FALSE)),\" \"),8)","v":"poussin"},0,{"$f":"IF(COUNTIF($F$4:$F8,$F8)<2,$F8,\" \")","v":"district loudéac"},59.509803921568626,0,{"$f":"IF(COUNTIF($F$4:$F8,$F8)<3,$F8,\" \")","v":"district loudéac"},59.509803921568626,0,"",1000,1000,{"$f":"IF(COUNTIF($F$4:$F8,J8)<4,$F8,\" \")","v":"district loudéac"},59.509803921568626,0,"","","",""," ","T",4,{"$f":"'PRIX D EQUIPE'!B8","v":0},1000,1000,1000,1000,1000,1000," "," "]
[1000,null,null,{"$f":"IF(C9>0,CONCATENATE((VLOOKUP($C9,Inscription!$A$6:$G$205,3,FALSE)),\"   \",(VLOOKUP($C9,Inscription!$A$6:$G$205,4,FALSE))),\" \")","v":" "},null,{"$f":"IF(C9>0,(VLOOKUP($C9,Inscription!$A$6:$G$205,5,FALSE)),\" \")","v":" "},{"$f":"IF(C9>0,(VLOOKUP($C9,Inscription!$A$6:$G$205,7,FALSE)),\" \")","v":" "},{"$f":"LEFT(IF(C9>0,(VLOOKUP($C9,Inscription!$A$6:$G$205,6,FALSE)),\" \"),8)","v":" "},0,{"$f":"IF(COUNTIF($F$4:$F9,$F9)<2,$F9,\" \")","v":" "},1000,0,{"$f":"IF(COUNTIF($F$4:$F9,$F9)<3,$F9,\" \")","v":" "},1000,0,"",1000,1000,{"$f":"IF(COUNTIF($F$4:$F9,J9)<4,$F9,\" \")","v":" "},1000,0,"","","",""," ",0,5,{"$f":"'PRIX D EQUIPE'!B9","v":0},1000,1000,1000,1000,1000,1000," "," "]
[59.509803921568626,1,6,{"$f":"IF(C10>0,CONCATENATE((VLOOKUP($C10,Inscription!$A$6:$G$205,3,FALSE)),\"   \",(VLOOKUP($C10,Inscription!$A$6:$G$205,4,FALSE))),\" \")","v":"BARS   Yvann"},"Yvann",{"$f":"IF(C10>0,(VLOOKUP($C10,Inscription!$A$6:$G$205,5,FALSE)),\" \")","v":"begard vtt gwerun"},{"$f":"IF(C10>0,(VLOOKUP($C10,Inscription!$A$6:$G$205,7,FALSE)),\" \")","v":310008},{"$f":"LEFT(IF(C10>0,(VLOOKUP($C10,Inscription!$A$6:$G$205,6,FALSE)),\" \"),8)","v":"pupille"},null,"m","","",{"$f":"IF(COUNTIF($F$4:$F10,$F10)<3,$F10,\" \")","v":"begard vtt gwerun"},59.509803921568626,0,"begard vtt gwerun",59.509803921568626,0,{"$f":"IF(COUNTIF($F$4:$F10,J10)<4,$F10,\" \")","v":"begard vtt gwerun"},59.509803921568626,0,"begard vtt gwerun","","",""," ","T",6,{"$f":"'PRIX D EQUIPE'!B10","v":0},1000,1000,1000,1000,1000,1000," "," "]
[59.509803921568626,2,8,{"$f":"IF(C11>0,CONCATENATE((VLOOKUP($C11,Inscription!$A$6:$G$205,3,FALSE)),\"   \",(VLOOKUP($C11,Inscription!$A$6:$G$205,4,FALSE))),\" \")","v":"LEPERCQ   Batiste"},"Thibaut",{"$f":"IF(C11>0,(VLOOKUP($C11,Inscription!$A$6:$G$205,5,FALSE)),\" \")","v":"uc plaudren"},{"$f":"IF(C11>0,(VLOOKUP($C11,Inscription!$A$6:$G$205,7,FALSE)),\" \")","v":391433},{"$f":"LEFT(IF(C11>0,(VLOOKUP($C11,Inscription!$A$6:$G$205,6,FALSE)),\" \"),8)","v":"pupille"},null,"m","","",{"$f":"IF(COUNTIF($F$4:$F11,$F11)<3,$F11,\" \")","v":"uc plaudren"},59.509803921568626,0,"uc plaudren",59.509803921568626,0,{"$f":"IF(COUNTIF($F$4:$F11,J11)<4,$F11,\" \")","v":"uc plaudren"},59.509803921568626,0,"uc plaudren","","",""," ","T",7,{"$f":"'PRIX D EQUIPE'!B11","v":0},1000,1000,1000,1000,1000,1000," "," "]
[59.509803921568626,3,7,{"$f":"IF(C12>0,CONCATENATE((VLOOKUP($C12,Inscription!$A$6:$G$205,3,FALSE)),\"   \",(VLOOKUP($C12,Inscription!$A$6:$G$205,4,FALSE))),\" \")","v":"COLAS   Thibaut"},"Batiste",{"$f":"IF(C12>0,(VLOOKUP($C12,Inscription!$A$6:$G$205,5,FALSE)),\" \")","v":"begard vtt gwerun"},{"$f":"IF(C12>0,(VLOOKUP($C12,Inscription!$A$6:$G$205,7,FALSE)),\" \")","v":330206},{"$f":"LEFT(IF(C12>0,(VLOOKUP($C12,Inscription!$A$6:$G$205,6,FALSE)),\" \"),8)","v":"pupille"},null,"m","","",{"$f":"IF(COUNTIF($F$4:$F12,$F12)<3,$F12,\" \")","v":" "},"",""," ",1000,1000,{"$f":"IF(COUNTIF($F$4:$F12,J12)<4,$F12,\" \")","v":"begard vtt gwerun"},59.509803921568626,0,"begard vtt gwerun","begard vtt gwerun",59.509803921568626,0," ","T",8,{"$f":"'PRIX D EQUIPE'!B12","v":0},1000,1000,1000,1000,1000,1000," "," "]
[59.509803921568626,4,9,{"$f":"IF(C13>0,CONCATENATE((VLOOKUP($C13,Inscription!$A$6:$G$205,3,FALSE)),\"   \",(VLOOKUP($C13,Inscription!$A$6:$G$205,4,FALSE))),\" \")","v":"CLERET MARECHAL   Loeiz"},"Loeiz",{"$f":"IF(C13>0,(VLOOKUP($C13,Inscription!$A$6:$G$205,5,FALSE)),\" \")","v":"vtt cotes d'armor hillion"},{"$f":"IF(C13>0,(VLOOKUP($C13,Inscription!$A$6:$G$205,7,FALSE)),\" \")","v":0},{"$f":"LEFT(IF(C13>0,(VLOOKUP($C13,Inscription!$A$6:$G$205,6,FALSE)),\" \"),8)","v":"pupille"},null,"m","","",{"$f":"IF(COUNTIF($F$4:$F13,$F13)<3,$F13,\" \")","v":"vtt cotes d'armor hillion"},59.509803921568626,0,"vtt cotes d'armor hillion",59.509803921568626,0,{"$f":"IF(COUNTIF($F$4:$F13,J13)<4,$F13,\" \")","v":"vtt cotes d'armor hillion"},59.509803921568626,0,"vtt cotes d'armor hillion","","",""," ","T",9,{"$f":"'PRIX D EQUIPE'!B13","v":0},1000,1000,1000,1000,1000,1000," "," "]
[1000,null,null,{"$f":"IF(C14>0,CONCATENATE((VLOOKUP($C14,Inscription!$A$6:$G$205,3,FALSE)),\"   \",(VLOOKUP($C14,Inscription!$A$6:$G$205,4,FALSE))),\" \")","v":" "},null,{"$f":"IF(C14>0,(VLOOKUP($C14,Inscription!$A$6:$G$205,5,FALSE)),\" \")","v":" "},{"$f":"IF(C14>0,(VLOOKUP($C14,Inscription!$A$6:$G$205,7,FALSE)),\" \")","v":" "},{"$f":"LEFT(IF(C14>0,(VLOOKUP($C14,Inscription!$A$6:$G$205,6,FALSE)),\" \"),8)","v":" "},0,{"$f":"IF(COUNTIF($F$4:$F14,$F14)<2,$F14,\" \")","v":" "},1000,0,{"$f":"IF(COUNTIF($F$4:$F14,$F14)<3,$F14,\" \")","v":" "},1000,0,"",1000,1000,{"$f":"IF(COUNTIF($F$4:$F14,J14)<4,$F14,\" \")","v":" "},1000,0,"","","",""," ",0,10,{"$f":"'PRIX D EQUIPE'!B14","v":0},1000,1000,1000,1000,1000,1000," "," "]
[59.509803921568626,1,11,{"$f":"IF(C15>0,CONCATENATE((VLOOKUP($C15,Inscription!$A$6:$G$205,3,FALSE)),\"   \",(VLOOKUP($C15,Inscription!$A$6:$G$205,4,FALSE))),\" \")","v":"POILVET   Jules"},null,{"$f":"IF(C15>0,(VLOOKUP($C15,Inscription!$A$6:$G$205,5,FALSE)),\" \")","v":"vc evron"},{"$f":"IF(C15>0,(VLOOKUP($C15,Inscription!$A$6:$G$205,7,FALSE)),\" \")","v":382431},{"$f":"LEFT(IF(C15>0,(VLOOKUP($C15,Inscription!$A$6:$G$205,6,FALSE)),\" \"),8)","v":"benjamin"},0,{"$f":"IF(COUNTIF($F$4:$F15,$F15)<2,$F15,\" \")","v":" "},"","",{"$f":"IF(COUNTIF($F$4:$F15,$F15)<3,$F15,\" \")","v":" "},"","","",1000,1000,{"$f":"IF(COUNTIF($F$4:$F15,J15)<4,$F15,\" \")","v":"vc evron"},59.509803921568626,0,"vc evron","vc evron",59.509803921568626,0," ","T",11,{"$f":"'PRIX D EQUIPE'!B15","v":0},1000,1000,1000,1000,1000,1000," "," "]
[59.509803921568626,2,14,{"$f":"IF(C16>0,CONCATENATE((VLOOKUP($C16,Inscription!$A$6:$G$205,3,FALSE)),\"   \",(VLOOKUP($C16,Inscription!$A$6:$G$205,4,FALSE))),\" \")","v":"BANNER   Rafael"},null,{"$f":"IF(C16>0,(VLOOKUP($C16,Inscription!$A$6:$G$205,5,FALSE)),\" \")","v":"vtt du lié"},{"$f":"IF(C16>0,(VLOOKUP($C16,Inscription!$A$6:$G$205,7,FALSE)),\" \")","v":0},{"$f":"LEFT(IF(C16>0,(VLOOKUP($C16,Inscription!$A$6:$G$205,6,FALSE)),\" \"),8)","v":"benjamin"},0,{"$f":"IF(COUNTIF($F$4:$F16,$F16)<2,$F16,\" \")","v":" "},"","",{"$f":"IF(COUNTIF($F$4:$F16,$F16)<3,$F16,\" \")","v":"vtt du lié"},59.509803921568626,0,"vtt du lié",59.509803921568626,0,{"$f":"IF(COUNTIF($F$4:$F16,J16)<4,$F16,\" \")","v":"vtt du lié"},59.509803921568626,0,"vtt du lié","","",""," ","T",12,{"$f":"'PRIX D EQUIPE'!B16","v":0},1000,1000,1000,1000,1000,1000," "," "]
[59.509803921568626,3,16,{"$f":"IF(C17>0,CONCATENATE((VLOOKUP($C17,Inscription!$A$6:$G$205,3,FALSE)),\"   \",(VLOOKUP($C17,Inscription!$A$6:$G$205,4,FALSE))),\" \")","v":"BOUGEARD HORNAIS   Aymeris"},null,{"$f":"IF(C17>0,(VLOOKUP($C17,Inscription!$A$6:$G$205,5,FALSE)),\" \")","v":"team bikers"},{"$f":"IF(C17>0,(VLOOKUP($C17,Inscription!$A$6:$G$205,7,FALSE)),\" \")","v":431285},{"$f":"LEFT(IF(C17>0,(VLOOKUP($C17,Inscription!$A$6:$G$205,6,FALSE)),\" \"),8)","v":"benjamin"},0,{"$f":"IF(COUNTIF($F$4:$F17,$F17)<2,$F17,\" \")","v":"team bikers"},59.509803921568626,0,{"$f":"IF(COUNTIF($F$4:$F17,$F17)<3,$F17,\" \")","v":"team bikers"},59.509803921568626,0,"",1000,1000,{"$f":"IF(COUNTIF($F$4:$F17,J17)<4,$F17,\" \")","v":"team bikers"},59.509803921568626,0,"","","",""," ","T",13,{"$f":"'PRIX D EQUIPE'!B17","v":0},1000,1000,1000,1000,1000,1000," "," "]
[59.509803921568626,4,15,{"$f":"IF(C18>0,CONCATENATE((VLOOKUP($C18,Inscription!$A$6:$G$205,3,FALSE)),\"   \",(VLOOKUP($C18,Inscription!$A$6:$G$205,4,FALSE))),\" \")","v":"BRIAND   Axel"},null,{"$f":"IF(C18>0,(VLOOKUP($C18,Inscription!$A$6:$G$205,5,FALSE)),\" \")","v":"team bikers"},{"$f":"IF(C18>0,(VLOOKUP($C18,Inscription!$A$6:$G$205,7,FALSE)),\" \")","v":429219},{"$f":"LEFT(IF(C18>0,(VLOOKUP($C18,Inscription!$A$6:$G$205,6,FALSE)),\" \"),8)","v":"benjamin"},0,{"$f":"IF(COUNTIF($F$4:$F18,$F18)<2,$F18,\" \")","v":" "},"","",{"$f":"IF(COUNTIF($F$4:$F18,$F18)<3,$F18,\" \")","v":"team bikers"},59.509803921568626,0,"team bikers",59.509803921568626,0,{"$f":"IF(COUNTIF($F$4:$F18,J18)<4,$F18,\" \")","v":"team bikers"},59.509803921568626,0,"team bikers","","",""," ","T",14,{"$f":"'PRIX D EQUIPE'!B18","v":0},1000,1000,1000,1000,1000,1000," "," "]
[59.509803921568626,5,10,{"$f":"IF(C19>0,CONCATENATE((VLOOKUP($C19,Inscription!$A$6:$G$205,3,FALSE)),\"   \",(VLOOKUP($C19,Inscription!$A$6:$G$205,4,FALSE))),\" \")","v":"POILVET   Paul"},null,{"$f":"IF(C19>0,(VLOOKUP($C19,Inscription!$A$6:$G$205,5,FALSE)),\" \")","v":"vc evron"},{"$f":"IF(C19>0,(VLOOKUP($C19,Inscription!$A$6:$G$205,7,FALSE)),\" \")","v":382428},{"$f":"LEFT(IF(C19>0,(VLOOKUP($C19,Inscription!$A$6:$G$205,6,FALSE)),\" \"),8)","v":"benjamin"},0,{"$f":"IF(COUNTIF($F$4:$F19,$F19)<2,$F19,\" \")","v":" "},"","",{"$f":"IF(COUNTIF($F$4:$F19,$F19)<3,$F19,\" \")","v":" "},"","","",1000,1000,{"$f":"IF(COUNTIF($F$4:$F19,J19)<4,$F19,\" \")","v":"vc evron"},59.509803921568626,0,"vc evron","vc evron",59.509803921568626,0," ","T",15,{"$f":"'PRIX D EQUIPE'!B19","v":0},1000,1000,1000,1000,1000,1000," "," "]
[59.509803921568626,6,13,{"$f":"IF(C20>0,CONCATENATE((VLOOKUP($C20,Inscription!$A$6:$G$205,3,FALSE)),\"   \",(VLOOKUP($C20,Inscription!$A$6:$G$205,4,FALSE))),\" \")","v":"BOLORE   Loevan"},null,{"$f":"IF(C20>0,(VLOOKUP($C20,Inscription!$A$6:$G$205,5,FALSE)),\" \")","v":"team bikers"},{"$f":"IF(C20>0,(VLOOKUP($C20,Inscription!$A$6:$G$205,7,FALSE)),\" \")","v":376265},{"$f":"LEFT(IF(C20>0,(VLOOKUP($C20,Inscription!$A$6:$G$205,6,FALSE)),\" \"),8)","v":"benjamin"},0,{"$f":"IF(COUNTIF($F$4:$F20,$F20)<2,$F20,\" \")","v":" "},"","",{"$f":"IF(COUNTIF($F$4:$F20,$F20)<3,$F20,\" \")","v":" "},"","","",1000,1000,{"$f":"IF(COUNTIF($F$4:$F20,J20)<4,$F20,\" \")","v":"team bikers"},59.509803921568626,0,"team bikers","team bikers",59.509803921568626,0," ","T",16,{"$f":"'PRIX D EQUIPE'!B20","v":0},1000,1000,1000,1000,1000,1000," "," "]
[59.509803921568626,7,12,{"$f":"IF(C21>0,CONCATENATE((VLOOKUP($C21,Inscription!$A$6:$G$205,3,FALSE)),\"   \",(VLOOKUP($C21,Inscription!$A$6:$G$205,4,FALSE))),\" \")","v":"LEPERCQ   Clara"},null,{"$f":"IF(C21>0,(VLOOKUP($C21,Inscription!$A$6:$G$205,5,FALSE)),\" \")","v":"uc plaudren"},{"$f":"IF(C21>0,(VLOOKUP($C21,Inscription!$A$6:$G$205,7,FALSE)),\" \")","v":467480},{"$f":"LEFT(IF(C21>0,(VLOOKUP($C21,Inscription!$A$6:$G$205,6,FALSE)),\" \"),8)","v":"benjamin"},0,{"$f":"IF(COUNTIF($F$4:$F21,$F21)<2,$F21,\" \")","v":" "},"","",{"$f":"IF(COUNTIF($F$4:$F21,$F21)<3,$F21,\" \")","v":"uc plaudren"},59.509803921568626,0,"uc plaudren",59.509803921568626,0,{"$f":"IF(COUNTIF($F$4:$F21,J21)<4,$F21,\" \")","v":"uc plaudren"},59.509803921568626,0,"uc plaudren","","",""," ","T",17,{"$f":"'PRIX D EQUIPE'!B21","v":0},1000,1000,1000,1000,1000,1000," "," "]
[1000,null,null,{"$f":"IF(C22>0,CONCATENATE((VLOOKUP($C22,Inscription!$A$6:$G$205,3,FALSE)),\"   \",(VLOOKUP($C22,Inscription!$A$6:$G$205,4,FALSE))),\" \")","v":" "},null,{"$f":"IF(C22>0,(VLOOKUP($C22,Inscription!$A$6:$G$205,5,FALSE)),\" \")","v":" "},{"$f":"IF(C22>0,(VLOOKUP($C22,Inscription!$A$6:$G$205,7,FALSE)),\" \")","v":" "},{"$f":"LEFT(IF(C22>0,(VLOOKUP($C22,Inscription!$A$6:$G$205,6,FALSE)),\" \"),8)","v":" "},0,{"$f":"IF(COUNTIF($F$4:$F22,$F22)<2,$F22,\" \")","v":" "},1000,0,{"$f":"IF(COUNTIF($F$4:$F22,$F22)<3,$F22,\" \")","v":" "},1000,0,"",1000,1000,{"$f":"IF(COUNTIF($F$4:$F22,J22)<4,$F22,\" \")","v":" "},1000,0,"","","",""," ",0,18,{"$f":"'PRIX D EQUIPE'!B22","v":0},1000,1000,1000,1000,1000,1000," "," "]
[59.509803921568626,1,27,{"$f":"IF(C23>0,CONCATENATE((VLOOKUP($C23,Inscription!$A$6:$G$205,3,FALSE)),\"   \",(VLOOKUP($C23,Inscription!$A$6:$G$205,4,FALSE))),\" \")","v":"GUILMIN   Léo"},null,{"$f":"IF(C23>0,(VLOOKUP($C23,Inscription!$A$6:$G$205,5,FALSE)),\" \")","v":"vc evron"},{"$f":"IF(C23>0,(VLOOKUP($C23,Inscription!$A$6:$G$205,7,FALSE)),\" \")","v":344464},{"$f":"LEFT(IF(C23>0,(VLOOKUP($C23,Inscription!$A$6:$G$205,6,FALSE)),\" \"),8)","v":"minimes"},0,{"$f":"IF(COUNTIF($F$4:$F23,$F23)<2,$F23,\" \")","v":" "},"","",{"$f":"IF(COUNTIF($F$4:$F23,$F23)<3,$F23,\" \")","v":" "},"","","",1000,1000,{"$f":"IF(COUNTIF($F$4:$F23,J23)<4,$F23,\" \")","v":"vc evron"},59.509803921568626,0,"vc evron","vc evron",59.509803921568626,0," ","T",19,{"$f":"'PRIX D EQUIPE'!B23","v":0},1000,1000,1000,1000,1000,1000," "," "]
[59.509803921568626,2,24,{"$f":"IF(C24>0,CONCATENATE((VLOOKUP($C24,Inscription!$A$6:$G$205,3,FALSE)),\"   \",(VLOOKUP($C24,Inscription!$A$6:$G$205,4,FALSE))),\" \")","v":"BASSET   Loris"},null,{"$f":"IF(C24>0,(VLOOKUP($C24,Inscription!$A$6:$G$205,5,FALSE)),\" \")","v":"vc evron"},{"$f":"IF(C24>0,(VLOOKUP($C24,Inscription!$A$6:$G$205,7,FALSE)),\" \")","v":0},{"$f":"LEFT(IF(C24>0,(VLOOKUP($C24,Inscription!$A$6:$G$205,6,FALSE)),\" \"),8)","v":"minimes"},0,{"$f":"IF(COUNTIF($F$4:$F24,$F24)<2,$F24,\" \")","v":" "},"","",{"$f":"IF(COUNTIF($F$4:$F24,$F24)<3,$F24,\" \")","v":" "},"","","",1000,1000,{"$f":"IF(COUNTIF($F$4:$F24,J24)<4,$F24,\" \")","v":"vc evron"},59.509803921568626,0,"vc evron","vc evron",59.509803921568626,0," ","T",20,{"$f":"'PRIX D EQUIPE'!B24","v":0},1000,1000,1000,1000,1000,1000," "," "]
[59.509803921568626,3,20,{"$f":"IF(C25>0,CONCATENATE((VLOOKUP($C25,Inscription!$A$6:$G$205,3,FALSE)),\"   \",(VLOOKUP($C25,Inscription!$A$6:$G$205,4,FALSE))),\" \")","v":"BRIEND   Ilhan"},null,{"$f":"IF(C25>0,(VLOOKUP($C25,Inscription!$A$6:$G$205,5,FALSE)),\" \")","v":"accro cycles cotes d'émeraude"},{"$f":"IF(C25>0,(VLOOKUP($C25,Inscription!$A$6:$G$205,7,FALSE)),\" \")","v":919871},{"$f":"LEFT(IF(C25>0,(VLOOKUP($C25,Inscription!$A$6:$G$205,6,FALSE)),\" \"),8)","v":"minimes"},0,{"$f":"IF(COUNTIF($F$4:$F25,$F25)<2,$F25,\" \")","v":"accro cycles cotes d'émeraude"},59.509803921568626,0,{"$f":"IF(COUNTIF($F$4:$F25,$F25)<3,$F25,\" \")","v":"accro cycles cotes d'émeraude"},59.509803921568626,0,"",1000,1000,{"$f":"IF(COUNTIF($F$4:$F25,J25)<4,$F25,\" \")","v":"accro cycles cotes d'émeraude"},59.509803921568626,0,"","","",""," ","T",21,{"$f":"'PRIX D EQUIPE'!B25","v":0},1000,1000,1000,1000,1000,1000," "," "]
[59.509803921568626,4,21,{"$f":"IF(C26>0,CONCATENATE((VLOOKUP($C26,Inscription!$A$6:$G$205,3,FALSE)),\"   \",(VLOOKUP($C26,Inscription!$A$6:$G$205,4,FALSE))),\" \")","v":"LE BIHAN   Clément "},null,{"$f":"IF(C26>0,(VLOOKUP($C26,Inscription!$A$6:$G$205,5,FALSE)),\" \")","v":"uc plaudren"},{"$f":"IF(C26>0,(VLOOKUP($C26,Inscription!$A$6:$G$205,7,FALSE)),\" \")","v":968158},{"$f":"LEFT(IF(C26>0,(VLOOKUP($C26,Inscription!$A$6:$G$205,6,FALSE)),\" \"),8)","v":"minimes"},0,{"$f":"IF(COUNTIF($F$4:$F26,$F26)<2,$F26,\" \")","v":" "},"","",{"$f":"IF(COUNTIF($F$4:$F26,$F26)<3,$F26,\" \")","v":" "},"","","",1000,1000,{"$f":"IF(COUNTIF($F$4:$F26,J26)<4,$F26,\" \")","v":"uc plaudren"},59.509803921568626,0,"uc plaudren","uc plaudren",59.509803921568626,0," ","T",22,{"$f":"'PRIX D EQUIPE'!B26","v":0},1000,1000,1000,1000,1000,1000," "," "]
[59.509803921568626,5,26,{"$f":"IF(C27>0,CONCATENATE((VLOOKUP($C27,Inscription!$A$6:$G$205,3,FALSE)),\"   \",(VLOOKUP($C27,Inscription!$A$6:$G$205,4,FALSE))),\" \")","v":"BOUGEARD   Margot"},null,{"$f":"IF(C27>0,(VLOOKUP($C27,Inscription!$A$6:$G$205,5,FALSE)),\" \")","v":"team bikers"},{"$f":"IF(C27>0,(VLOOKUP($C27,Inscription!$A$6:$G$205,7,FALSE)),\" \")","v":431290},{"$f":"LEFT(IF(C27>0,(VLOOKUP($C27,Inscription!$A$6:$G$205,6,FALSE)),\" \"),8)","v":"minimes"},0,{"$f":"IF(COUNTIF($F$4:$F27,$F27)<2,$F27,\" \")","v":" "},"","",{"$f":"IF(COUNTIF($F$4:$F27,$F27)<3,$F27,\" \")","v":" "},"","","",1000,1000,{"$f":"IF(COUNTIF($F$4:$F27,J27)<4,$F27,\" \")","v":"team bikers"},59.509803921568626,0,"team bikers","team bikers",59.509803921568626,0," ","T",23,{"$f":"'PRIX D EQUIPE'!B27","v":0},1000,1000,1000,1000,1000,1000," "," "]
[59.509803921568626,6,23,{"$f":"IF(C28>0,CONCATENATE((VLOOKUP($C28,Inscription!$A$6:$G$205,3,FALSE)),\"   \",(VLOOKUP($C28,Inscription!$A$6:$G$205,4,FALSE))),\" \")","v":"ROUILLE   Robin"},null,{"$f":"IF(C28>0,(VLOOKUP($C28,Inscription!$A$6:$G$205,5,FALSE)),\" \")","v":"team bikers"},{"$f":"IF(C28>0,(VLOOKUP($C28,Inscription!$A$6:$G$205,7,FALSE)),\" \")","v":390947},{"$f":"LEFT(IF(C28>0,(VLOOKUP($C28,Inscription!$A$6:$G$205,6,FALSE)),\" \"),8)","v":"minimes"},0,{"$f":"IF(COUNTIF($F$4:$F28,$F28)<2,$F28,\" \")","v":" "},"","",{"$f":"IF(COUNTIF($F$4:$F28,$F28)<3,$F28,\" \")","v":" "},"","","",1000,1000,{"$f":"IF(COUNTIF($F$4:$F28,J28)<4,$F28,\" \")","v":"team bikers"},59.509803921568626,0,"team bikers","team bikers",59.509803921568626,0," ","T",24,{"$f":"'PRIX D EQUIPE'!B28","v":0},1000,1000,1000,1000,1000,1000," "," "]
[59.509803921568626,7,25,{"$f":"IF(C29>0,CONCATENATE((VLOOKUP($C29,Inscription!$A$6:$G$205,3,FALSE)),\"   \",(VLOOKUP($C29,Inscription!$A$6:$G$205,4,FALSE))),\" \")","v":"BRIAND   Mathis"},null,{"$f":"IF(C29>0,(VLOOKUP($C29,Inscription!$A$6:$G$205,5,FALSE)),\" \")","v":"team bikers"},{"$f":"IF(C29>0,(VLOOKUP($C29,Inscription!$A$6:$G$205,7,FALSE)),\" \")","v":431995},{"$f":"LEFT(IF(C29>0,(VLOOKUP($C29,Inscription!$A$6:$G$205,6,FALSE)),\" \"),8)","v":"minimes"},0,{"$f":"IF(COUNTIF($F$4:$F29,$F29)<2,$F29,\" \")","v":" "},"","",{"$f":"IF(COUNTIF($F$4:$F29,$F29)<3,$F29,\" \")","v":" "},"","","",1000,1000,{"$f":"IF(COUNTIF($F$4:$F29,J29)<4,$F29,\" \")","v":"team bikers"},59.509803921568626,0,"team bikers","team bikers",59.509803921568626,0," ","T",25,{"$f":"'PRIX D EQUIPE'!B29","v":0},1000,1000,1000,1000,1000,1000," "," "]
[59.509803921568626,8,22,{"$f":"IF(C30>0,CONCATENATE((VLOOKUP($C30,Inscription!$A$6:$G$205,3,FALSE)),\"   \",(VLOOKUP($C30,Inscription!$A$6:$G$205,4,FALSE))),\" \")","v":"BOLORE   Ewen"},null,{"$f":"IF(C30>0,(VLOOKUP($C30,Inscription!$A$6:$G$205,5,FALSE)),\" \")","v":"team bikers"},{"$f":"IF(C30>0,(VLOOKUP($C30,Inscription!$A$6:$G$205,7,FALSE)),\" \")","v":376263},{"$f":"LEFT(IF(C30>0,(VLOOKUP($C30,Inscription!$A$6:$G$205,6,FALSE)),\" \"),8)","v":"minimes"},0,{"$f":"IF(COUNTIF($F$4:$F30,$F30)<2,$F30,\" \")","v":" "},"","",{"$f":"IF(COUNTIF($F$4:$F30,$F30)<3,$F30,\" \")","v":" "},"","","",1000,1000,{"$f":"IF(COUNTIF($F$4:$F30,J30)<4,$F30,\" \")","v":"team bikers"},59.509803921568626,0,"team bikers","team bikers",59.509803921568626,0," ","T",26,{"$f":"'PRIX D EQUIPE'!B30","v":0},1000,1000,1000,1000,1000,1000,{"$f":"IF(AC30=\" \",\" \",IF($AC30>0,SUM(AD30+AF30+AH30),\" \"))","v":" "},{"$f":"IF(AC30=\" \",\" \",IF($AC30>0,SUM(AE30+AG30+AI30),\" \"))","v":" "}]
[1000,null,null,{"$f":"IF(C31>0,CONCATENATE((VLOOKUP($C31,Inscription!$A$6:$G$205,3,FALSE)),\"   \",(VLOOKUP($C31,Inscription!$A$6:$G$205,4,FALSE))),\" \")","v":" "},null,{"$f":"IF(C31>0,(VLOOKUP($C31,Inscription!$A$6:$G$205,5,FALSE)),\" \")","v":" "},{"$f":"IF(C31>0,(VLOOKUP($C31,Inscription!$A$6:$G$205,7,FALSE)),\" \")","v":" "},{"$f":"LEFT(IF(C31>0,(VLOOKUP($C31,Inscription!$A$6:$G$205,6,FALSE)),\" \"),8)","v":" "},0,{"$f":"IF(COUNTIF($F$4:$F31,$F31)<2,$F31,\" \")","v":" "},1000,0,{"$f":"IF(COUNTIF($F$4:$F31,$F31)<3,$F31,\" \")","v":" "},1000,0,"",1000,1000,{"$f":"IF(COUNTIF($F$4:$F31,J31)<4,$F31,\" \")","v":" "},1000,0,"","","",""," ",0,27,{"$f":"'PRIX D EQUIPE'!B31","v":0},1000,1000,1000,1000,1000,1000," "," ",null,5]
[59.509803921568626,1,30,{"$f":"IF(C32>0,CONCATENATE((VLOOKUP($C32,Inscription!$A$6:$G$205,3,FALSE)),\"   \",(VLOOKUP($C32,Inscription!$A$6:$G$205,4,FALSE))),\" \")","v":"FERTE   Brandon"},null,{"$f":"IF(C32>0,(VLOOKUP($C32,Inscription!$A$6:$G$205,5,FALSE)),\" \")","v":"distric loudéac"},{"$f":"IF(C32>0,(VLOOKUP($C32,Inscription!$A$6:$G$205,7,FALSE)),\" \")","v":297227},{"$f":"LEFT(IF(C32>0,(VLOOKUP($C32,Inscription!$A$6:$G$205,6,FALSE)),\" \"),8)","v":"cadet"},0,{"$f":"IF(COUNTIF($F$4:$F32,$F32)<2,$F32,\" \")","v":"distric loudéac"},59.509803921568626,0,{"$f":"IF(COUNTIF($F$4:$F32,$F32)<3,$F32,\" \")","v":"distric loudéac"},59.509803921568626,0,"",1000,1000,{"$f":"IF(COUNTIF($F$4:$F32,J32)<4,$F32,\" \")","v":"distric loudéac"},59.509803921568626,0,"","","",""," ","T",28,{"$f":"'PRIX D EQUIPE'!B32","v":0},1000,1000,1000,1000,1000,1000," "," "]
[59.509803921568626,2,31,{"$f":"IF(C33>0,CONCATENATE((VLOOKUP($C33,Inscription!$A$6:$G$205,3,FALSE)),\"   \",(VLOOKUP($C33,Inscription!$A$6:$G$205,4,FALSE))),\" \")","v":"LEPERCQ   Nathan"},null,{"$f":"IF(C33>0,(VLOOKUP($C33,Inscription!$A$6:$G$205,5,FALSE)),\" \")","v":"uc plaudren"},{"$f":"IF(C33>0,(VLOOKUP($C33,Inscription!$A$6:$G$205,7,FALSE)),\" \")","v":389000},{"$f":"LEFT(IF(C33>0,(VLOOKUP($C33,Inscription!$A$6:$G$205,6,FALSE)),\" \"),8)","v":"cadet"},0,{"$f":"IF(COUNTIF($F$4:$F33,$F33)<2,$F33,\" \")","v":" "},"","",{"$f":"IF(COUNTIF($F$4:$F33,$F33)<3,$F33,\" \")","v":" "},"","","",1000,1000,{"$f":"IF(COUNTIF($F$4:$F33,J33)<4,$F33,\" \")","v":" "},"","","","","",""," ","T",29,{"$f":"'PRIX D EQUIPE'!B33","v":0},1000,1000,1000,1000,1000,1000," "," "]
[1000,null,null,{"$f":"IF(C34>0,CONCATENATE((VLOOKUP($C34,Inscription!$A$6:$G$205,3,FALSE)),\"   \",(VLOOKUP($C34,Inscription!$A$6:$G$205,4,FALSE))),\" \")","v":" "},null,{"$f":"IF(C34>0,(VLOOKUP($C34,Inscription!$A$6:$G$205,5,FALSE)),\" \")","v":" "},{"$f":"IF(C34>0,(VLOOKUP($C34,Inscription!$A$6:$G$205,7,FALSE)),\" \")","v":" "},{"$f":"LEFT(IF(C34>0,(VLOOKUP($C34,Inscription!$A$6:$G$205,6,FALSE)),\" \"),8)","v":" "},0,{"$f":"IF(COUNTIF($F$4:$F34,$F34)<2,$F34,\" \")","v":" "},1000,0,{"$f":"IF(COUNTIF($F$4:$F34,$F34)<3,$F34,\" \")","v":" "},1000,0,"",1000,1000,{"$f":"IF(COUNTIF($F$4:$F34,J34)<4,$F34,\" \")","v":" "},1000,0,"","","",""," ",0,30,{"$f":"'PRIX D EQUIPE'!B34","v":0},1000,1000,1000,1000,1000,1000," "," "]
[59.509803921568626,1,35,{"$f":"IF(C35>0,CONCATENATE((VLOOKUP($C35,Inscription!$A$6:$G$205,3,FALSE)),\"   \",(VLOOKUP($C35,Inscription!$A$6:$G$205,4,FALSE))),\" \")","v":"HALLET   Baptiste"},null,{"$f":"IF(C35>0,(VLOOKUP($C35,Inscription!$A$6:$G$205,5,FALSE)),\" \")","v":"vc plurien"},{"$f":"IF(C35>0,(VLOOKUP($C35,Inscription!$A$6:$G$205,7,FALSE)),\" \")","v":136613},{"$f":"LEFT(IF(C35>0,(VLOOKUP($C35,Inscription!$A$6:$G$205,6,FALSE)),\" \"),8)","v":"espoir"},0,{"$f":"IF(COUNTIF($F$4:$F35,$F35)<2,$F35,\" \")","v":"vc plurien"},59.509803921568626,0,{"$f":"IF(COUNTIF($F$4:$F35,$F35)<3,$F35,\" \")","v":"vc plurien"},59.509803921568626,0,"",1000,1000,{"$f":"IF(COUNTIF($F$4:$F35,J35)<4,$F35,\" \")","v":"vc plurien"},59.509803921568626,0,"","","",""," ","T",31,{"$f":"'PRIX D EQUIPE'!B35","v":0},1000,1000,1000,1000,1000,1000," "," "]
[1000,null,null,{"$f":"IF(C36>0,CONCATENATE((VLOOKUP($C36,Inscription!$A$6:$G$205,3,FALSE)),\"   \",(VLOOKUP($C36,Inscription!$A$6:$G$205,4,FALSE))),\" \")","v":" "},null,{"$f":"IF(C36>0,(VLOOKUP($C36,Inscription!$A$6:$G$205,5,FALSE)),\" \")","v":" "},{"$f":"IF(C36>0,(VLOOKUP($C36,Inscription!$A$6:$G$205,7,FALSE)),\" \")","v":" "},{"$f":"LEFT(IF(C36>0,(VLOOKUP($C36,Inscription!$A$6:$G$205,6,FALSE)),\" \"),8)","v":" "},0,{"$f":"IF(COUNTIF($F$4:$F36,$F36)<2,$F36,\" \")","v":" "},1000,0,{"$f":"IF(COUNTIF($F$4:$F36,$F36)<3,$F36,\" \")","v":" "},1000,0,"",1000,1000,{"$f":"IF(COUNTIF($F$4:$F36,J36)<4,$F36,\" \")","v":" "},1000,0,"","","","",{"$f":"IF(COUNTIF($C$4:$C$203,C36)>1,\"X\",\" \")","v":" "},{"$f":"IF(COUNTIF($B$4:$B$203,B36)>1,\"T\",B36)","v":0},32,{"$f":"'PRIX D EQUIPE'!B36","v":0},1000,1000,1000,1000,1000,1000," "," "]
[59.509803921568626,1,42,{"$f":"IF(C37>0,CONCATENATE((VLOOKUP($C37,Inscription!$A$6:$G$205,3,FALSE)),\"   \",(VLOOKUP($C37,Inscription!$A$6:$G$205,4,FALSE))),\" \")","v":"BOUGEARD   Pierre-Yves"},null,{"$f":"IF(C37>0,(VLOOKUP($C37,Inscription!$A$6:$G$205,5,FALSE)),\" \")","v":"team bickers"},{"$f":"IF(C37>0,(VLOOKUP($C37,Inscription!$A$6:$G$205,7,FALSE)),\" \")","v":376257},{"$f":"LEFT(IF(C37>0,(VLOOKUP($C37,Inscription!$A$6:$G$205,6,FALSE)),\" \"),8)","v":"1ère cat"},0,{"$f":"IF(COUNTIF($F$4:$F37,$F37)<2,$F37,\" \")","v":"team bickers"},59.509803921568626,0,{"$f":"IF(COUNTIF($F$4:$F37,$F37)<3,$F37,\" \")","v":"team bickers"},59.509803921568626,0,"",1000,1000,{"$f":"IF(COUNTIF($F$4:$F37,J37)<4,$F37,\" \")","v":"team bickers"},59.509803921568626,0,"","","",""," ","T",33,{"$f":"'PRIX D EQUIPE'!B37","v":0},1000,1000,1000,1000,1000,1000," "," "]
[59.509803921568626,2,43,{"$f":"IF(C38>0,CONCATENATE((VLOOKUP($C38,Inscription!$A$6:$G$205,3,FALSE)),\"   \",(VLOOKUP($C38,Inscription!$A$6:$G$205,4,FALSE))),\" \")","v":"BASSET   Emerick"},null,{"$f":"IF(C38>0,(VLOOKUP($C38,Inscription!$A$6:$G$205,5,FALSE)),\" \")","v":"vc evron"},{"$f":"IF(C38>0,(VLOOKUP($C38,Inscription!$A$6:$G$205,7,FALSE)),\" \")","v":371872},{"$f":"LEFT(IF(C38>0,(VLOOKUP($C38,Inscription!$A$6:$G$205,6,FALSE)),\" \"),8)","v":"1ère cat"},0,{"$f":"IF(COUNTIF($F$4:$F38,$F38)<2,$F38,\" \")","v":" "},"","",{"$f":"IF(COUNTIF($F$4:$F38,$F38)<3,$F38,\" \")","v":" "},"","","",1000,1000,{"$f":"IF(COUNTIF($F$4:$F38,J38)<4,$F38,\" \")","v":" "},"","","","","",""," ","T",34,{"$f":"'PRIX D EQUIPE'!B38","v":0},1000,1000,1000,1000,1000,1000," "," "]
[59.509803921568626,3,40,{"$f":"IF(C39>0,CONCATENATE((VLOOKUP($C39,Inscription!$A$6:$G$205,3,FALSE)),\"   \",(VLOOKUP($C39,Inscription!$A$6:$G$205,4,FALSE))),\" \")","v":"KEURMEUR   Romain"},null,{"$f":"IF(C39>0,(VLOOKUP($C39,Inscription!$A$6:$G$205,5,FALSE)),\" \")","v":"team mégrit"},{"$f":"IF(C39>0,(VLOOKUP($C39,Inscription!$A$6:$G$205,7,FALSE)),\" \")","v":363251},{"$f":"LEFT(IF(C39>0,(VLOOKUP($C39,Inscription!$A$6:$G$205,6,FALSE)),\" \"),8)","v":"1ère cat"},0,{"$f":"IF(COUNTIF($F$4:$F39,$F39)<2,$F39,\" \")","v":"team mégrit"},59.509803921568626,0,{"$f":"IF(COUNTIF($F$4:$F39,$F39)<3,$F39,\" \")","v":"team mégrit"},59.509803921568626,0,"",1000,1000,{"$f":"IF(COUNTIF($F$4:$F39,J39)<4,$F39,\" \")","v":"team mégrit"},59.509803921568626,0,"","","",""," ","T",35,{"$f":"'PRIX D EQUIPE'!B39","v":0},1000,1000,1000,1000,1000,1000," "," "]
[59.509803921568626,4,41,{"$f":"IF(C40>0,CONCATENATE((VLOOKUP($C40,Inscription!$A$6:$G$205,3,FALSE)),\"   \",(VLOOKUP($C40,Inscription!$A$6:$G$205,4,FALSE))),\" \")","v":"BANNER   Mickael"},null,{"$f":"IF(C40>0,(VLOOKUP($C40,Inscription!$A$6:$G$205,5,FALSE)),\" \")","v":"vtt du lié"},{"$f":"IF(C40>0,(VLOOKUP($C40,Inscription!$A$6:$G$205,7,FALSE)),\" \")","v":950036},{"$f":"LEFT(IF(C40>0,(VLOOKUP($C40,Inscription!$A$6:$G$205,6,FALSE)),\" \"),8)","v":"1ère cat"},0,{"$f":"IF(COUNTIF($F$4:$F40,$F40)<2,$F40,\" \")","v":" "},"","",{"$f":"IF(COUNTIF($F$4:$F40,$F40)<3,$F40,\" \")","v":" "},"","","",1000,1000,{"$f":"IF(COUNTIF($F$4:$F40,J40)<4,$F40,\" \")","v":" "},"","","","","",""," ","T"]
[1000,null,null,{"$f":"IF(C41>0,CONCATENATE((VLOOKUP($C41,Inscription!$A$6:$G$205,3,FALSE)),\"   \",(VLOOKUP($C41,Inscription!$A$6:$G$205,4,FALSE))),\" \")","v":" "},null,{"$f":"IF(C41>0,(VLOOKUP($C41,Inscription!$A$6:$G$205,5,FALSE)),\" \")","v":" "},{"$f":"IF(C41>0,(VLOOKUP($C41,Inscription!$A$6:$G$205,7,FALSE)),\" \")","v":" "},{"$f":"LEFT(IF(C41>0,(VLOOKUP($C41,Inscription!$A$6:$G$205,6,FALSE)),\" \"),8)","v":" "},0,{"$f":"IF(COUNTIF($F$4:$F41,$F41)<2,$F41,\" \")","v":" "},1000,0,{"$f":"IF(COUNTIF($F$4:$F41,$F41)<3,$F41,\" \")","v":" "},1000,0,"",1000,1000,{"$f":"IF(COUNTIF($F$4:$F41,J41)<4,$F41,\" \")","v":" "},1000,0,"","","",""," ",0]
[59.509803921568626,1,48,{"$f":"IF(C42>0,CONCATENATE((VLOOKUP($C42,Inscription!$A$6:$G$205,3,FALSE)),\"   \",(VLOOKUP($C42,Inscription!$A$6:$G$205,4,FALSE))),\" \")","v":"COLAS   Emmanuel"},null,{"$f":"IF(C42>0,(VLOOKUP($C42,Inscription!$A$6:$G$205,5,FALSE)),\" \")","v":"begard vtt gwerun"},{"$f":"IF(C42>0,(VLOOKUP($C42,Inscription!$A$6:$G$205,7,FALSE)),\" \")","v":386450},{"$f":"LEFT(IF(C42>0,(VLOOKUP($C42,Inscription!$A$6:$G$205,6,FALSE)),\" \"),8)","v":"2ème cat"},0,{"$f":"IF(COUNTIF($F$4:$F42,$F42)<2,$F42,\" \")","v":" "},"","",{"$f":"IF(COUNTIF($F$4:$F42,$F42)<3,$F42,\" \")","v":" "},"","","",1000,1000,{"$f":"IF(COUNTIF($F$4:$F42,J42)<4,$F42,\" \")","v":" "},"","","","","",""," ","T",null,null,"PRIX D EQUIPE"]
[59.509803921568626,2,54,{"$f":"IF(C43>0,CONCATENATE((VLOOKUP($C43,Inscription!$A$6:$G$205,3,FALSE)),\"   \",(VLOOKUP($C43,Inscription!$A$6:$G$205,4,FALSE))),\" \")","v":"LECOMTE    Guillaume"},null,{"$f":"IF(C43>0,(VLOOKUP($C43,Inscription!$A$6:$G$205,5,FALSE)),\" \")","v":"team xc du léguer"},{"$f":"IF(C43>0,(VLOOKUP($C43,Inscription!$A$6:$G$205,7,FALSE)),\" \")","v":998834},{"$f":"LEFT(IF(C43>0,(VLOOKUP($C43,Inscription!$A$6:$G$205,6,FALSE)),\" \"),8)","v":"2ème cat"},0,{"$f":"IF(COUNTIF($F$4:$F43,$F43)<2,$F43,\" \")","v":"team xc du léguer"},59.509803921568626,0,{"$f":"IF(COUNTIF($F$4:$F43,$F43)<3,$F43,\" \")","v":"team xc du léguer"},59.509803921568626,0,"",1000,1000,{"$f":"IF(COUNTIF($F$4:$F43,J43)<4,$F43,\" \")","v":"team xc du léguer"},59.509803921568626,0,"","","",""," ","T"]
[59.509803921568626,3,53,{"$f":"IF(C44>0,CONCATENATE((VLOOKUP($C44,Inscription!$A$6:$G$205,3,FALSE)),\"   \",(VLOOKUP($C44,Inscription!$A$6:$G$205,4,FALSE))),\" \")","v":"MARIVINT   Alexis"},null,{"$f":"IF(C44>0,(VLOOKUP($C44,Inscription!$A$6:$G$205,5,FALSE)),\" \")","v":"vc evron"},{"$f":"IF(C44>0,(VLOOKUP($C44,Inscription!$A$6:$G$205,7,FALSE)),\" \")","v":294510},{"$f":"LEFT(IF(C44>0,(VLOOKUP($C44,Inscription!$A$6:$G$205,6,FALSE)),\" \"),8)","v":"2ème cat"},0,{"$f":"IF(COUNTIF($F$4:$F44,$F44)<2,$F44,\" \")","v":" "},"","",{"$f":"IF(COUNTIF($F$4:$F44,$F44)<3,$F44,\" \")","v":" "},"","","",1000,1000,{"$f":"IF(COUNTIF($F$4:$F44,J44)<4,$F44,\" \")","v":" "},"","","","","",""," ","T"]
[59.509803921568626,4,50,{"$f":"IF(C45>0,CONCATENATE((VLOOKUP($C45,Inscription!$A$6:$G$205,3,FALSE)),\"   \",(VLOOKUP($C45,Inscription!$A$6:$G$205,4,FALSE))),\" \")","v":"MACE   Jérome"},null,{"$f":"IF(C45>0,(VLOOKUP($C45,Inscription!$A$6:$G$205,5,FALSE)),\" \")","v":"vc evron"},{"$f":"IF(C45>0,(VLOOKUP($C45,Inscription!$A$6:$G$205,7,FALSE)),\" \")","v":434904},{"$f":"LEFT(IF(C45>0,(VLOOKUP($C45,Inscription!$A$6:$G$205,6,FALSE)),\" \"),8)","v":"2ème cat"},0,{"$f":"IF(COUNTIF($F$4:$F45,$F45)<2,$F45,\" \")","v":" "},"","",{"$f":"IF(COUNTIF($F$4:$F45,$F45)<3,$F45,\" \")","v":" "},"","","",1000,1000,{"$f":"IF(COUNTIF($F$4:$F45,J45)<4,$F45,\" \")","v":" "},"","","","","",""," ","T",1,0,1000,1000,1000,1000,1000,1000,{"$f":"IF(AC45=\" \",\" \",IF($AC45>0,SUM(AD45+AF45+AH45),\" \"))","v":" "},{"$f":"IF(AC45=\" \",\" \",IF($AC45>0,SUM(AE45+AG45+AI45),\" \"))","v":" "}]
[59.509803921568626,5,49,{"$f":"IF(C46>0,CONCATENATE((VLOOKUP($C46,Inscription!$A$6:$G$205,3,FALSE)),\"   \",(VLOOKUP($C46,Inscription!$A$6:$G$205,4,FALSE))),\" \")","v":"COLLEU   Pascal"},null,{"$f":"IF(C46>0,(VLOOKUP($C46,Inscription!$A$6:$G$205,5,FALSE)),\" \")","v":"ccvb"},{"$f":"IF(C46>0,(VLOOKUP($C46,Inscription!$A$6:$G$205,7,FALSE)),\" \")","v":511956},{"$f":"LEFT(IF(C46>0,(VLOOKUP($C46,Inscription!$A$6:$G$205,6,FALSE)),\" \"),8)","v":"2ème cat"},0,{"$f":"IF(COUNTIF($F$4:$F46,$F46)<2,$F46,\" \")","v":"ccvb"},59.509803921568626,0,{"$f":"IF(COUNTIF($F$4:$F46,$F46)<3,$F46,\" \")","v":"ccvb"},59.509803921568626,0,"",1000,1000,{"$f":"IF(COUNTIF($F$4:$F46,J46)<4,$F46,\" \")","v":"ccvb"},59.509803921568626,0,"","","",""," ","T",2,0,1000,1000,1000,1000,1000,1000," "," "]
[59.509803921568626,6,51,{"$f":"IF(C47>0,CONCATENATE((VLOOKUP($C47,Inscription!$A$6:$G$205,3,FALSE)),\"   \",(VLOOKUP($C47,Inscription!$A$6:$G$205,4,FALSE))),\" \")","v":"BRIAND    Régis"},null,{"$f":"IF(C47>0,(VLOOKUP($C47,Inscription!$A$6:$G$205,5,FALSE)),\" \")","v":"team bickers"},{"$f":"IF(C47>0,(VLOOKUP($C47,Inscription!$A$6:$G$205,7,FALSE)),\" \")","v":429231},{"$f":"LEFT(IF(C47>0,(VLOOKUP($C47,Inscription!$A$6:$G$205,6,FALSE)),\" \"),8)","v":"2ème cat"},0,{"$f":"IF(COUNTIF($F$4:$F47,$F47)<2,$F47,\" \")","v":" "},"","",{"$f":"IF(COUNTIF($F$4:$F47,$F47)<3,$F47,\" \")","v":"team bickers"},59.509803921568626,0,"team bickers",59.509803921568626,0,{"$f":"IF(COUNTIF($F$4:$F47,J47)<4,$F47,\" \")","v":" "},"","",""," ","",""," ","T",3,0,1000,1000,1000,1000,1000,1000," "," "]
[59.509803921568626,7,45,{"$f":"IF(C48>0,CONCATENATE((VLOOKUP($C48,Inscription!$A$6:$G$205,3,FALSE)),\"   \",(VLOOKUP($C48,Inscription!$A$6:$G$205,4,FALSE))),\" \")","v":"JEUNEU   Gilles"},null,{"$f":"IF(C48>0,(VLOOKUP($C48,Inscription!$A$6:$G$205,5,FALSE)),\" \")","v":"accro cycles cotes d'émeraude"},{"$f":"IF(C48>0,(VLOOKUP($C48,Inscription!$A$6:$G$205,7,FALSE)),\" \")","v":137390},{"$f":"LEFT(IF(C48>0,(VLOOKUP($C48,Inscription!$A$6:$G$205,6,FALSE)),\" \"),8)","v":"2ème cat"},0,{"$f":"IF(COUNTIF($F$4:$F48,$F48)<2,$F48,\" \")","v":" "},"","",{"$f":"IF(COUNTIF($F$4:$F48,$F48)<3,$F48,\" \")","v":"accro cycles cotes d'émeraude"},59.509803921568626,0,"accro cycles cotes d'émeraude",59.509803921568626,0,{"$f":"IF(COUNTIF($F$4:$F48,J48)<4,$F48,\" \")","v":" "},"","",""," ","",""," ","T",4,0,1000,1000,1000,1000,1000,1000," "," "]
[59.509803921568626,8,46,{"$f":"IF(C49>0,CONCATENATE((VLOOKUP($C49,Inscription!$A$6:$G$205,3,FALSE)),\"   \",(VLOOKUP($C49,Inscription!$A$6:$G$205,4,FALSE))),\" \")","v":"LESNE   Régis"},null,{"$f":"IF(C49>0,(VLOOKUP($C49,Inscription!$A$6:$G$205,5,FALSE)),\" \")","v":"district loudéac"},{"$f":"IF(C49>0,(VLOOKUP($C49,Inscription!$A$6:$G$205,7,FALSE)),\" \")","v":227933},{"$f":"LEFT(IF(C49>0,(VLOOKUP($C49,Inscription!$A$6:$G$205,6,FALSE)),\" \"),8)","v":"2ème cat"},0,{"$f":"IF(COUNTIF($F$4:$F49,$F49)<2,$F49,\" \")","v":" "},"","",{"$f":"IF(COUNTIF($F$4:$F49,$F49)<3,$F49,\" \")","v":"district loudéac"},59.509803921568626,0,"district loudéac",59.509803921568626,0,{"$f":"IF(COUNTIF($F$4:$F49,J49)<4,$F49,\" \")","v":" "},"","",""," ","",""," ","T",5,0,1000,1000,1000,1000,1000,1000," "," "]
[59.509803921568626,9,47,{"$f":"IF(C50>0,CONCATENATE((VLOOKUP($C50,Inscription!$A$6:$G$205,3,FALSE)),\"   \",(VLOOKUP($C50,Inscription!$A$6:$G$205,4,FALSE))),\" \")","v":"BEDEL   Bapiste"},null,{"$f":"IF(C50>0,(VLOOKUP($C50,Inscription!$A$6:$G$205,5,FALSE)),\" \")","v":"district loudéac"},{"$f":"IF(C50>0,(VLOOKUP($C50,Inscription!$A$6:$G$205,7,FALSE)),\" \")","v":13637},{"$f":"LEFT(IF(C50>0,(VLOOKUP($C50,Inscription!$A$6:$G$205,6,FALSE)),\" \"),8)","v":"2ème cat"},0,{"$f":"IF(COUNTIF($F$4:$F50,$F50)<2,$F50,\" \")","v":" "},"","",{"$f":"IF(COUNTIF($F$4:$F50,$F50)<3,$F50,\" \")","v":" "},"","","",1000,1000,{"$f":"IF(COUNTIF($F$4:$F50,J50)<4,$F50,\" \")","v":" "},"","","","","",""," ","T",6,0,1000,1000,1000,1000,1000,1000," "," "]
[59.509803921568626,"DNF",52,{"$f":"IF(C51>0,CONCATENATE((VLOOKUP($C51,Inscription!$A$6:$G$205,3,FALSE)),\"   \",(VLOOKUP($C51,Inscription!$A$6:$G$205,4,FALSE))),\" \")","v":"MOUTTE   Alexis"},null,{"$f":"IF(C51>0,(VLOOKUP($C51,Inscription!$A$6:$G$205,5,FALSE)),\" \")","v":"team du pays de dinan guinefort"},{"$f":"IF(C51>0,(VLOOKUP($C51,Inscription!$A$6:$G$205,7,FALSE)),\" \")","v":0},{"$f":"LEFT(IF(C51>0,(VLOOKUP($C51,Inscription!$A$6:$G$205,6,FALSE)),\" \"),8)","v":"2ème cat"},0,{"$f":"IF(COUNTIF($F$4:$F51,$F51)<2,$F51,\" \")","v":"team du pays de dinan guinefort"},59.509803921568626,0,{"$f":"IF(COUNTIF($F$4:$F51,$F51)<3,$F51,\" \")","v":"team du pays de dinan guinefort"},59.509803921568626,0,"",1000,1000,{"$f":"IF(COUNTIF($F$4:$F51,J51)<4,$F51,\" \")","v":"team du pays de dinan guinefort"},59.509803921568626,0,"","","",""," ","T",7,0,1000,1000,1000,1000,1000,1000," "," "]
[1000,null,null,{"$f":"IF(C52>0,CONCATENATE((VLOOKUP($C52,Inscription!$A$6:$G$205,3,FALSE)),\"   \",(VLOOKUP($C52,Inscription!$A$6:$G$205,4,FALSE))),\" \")","v":" "},null,{"$f":"IF(C52>0,(VLOOKUP($C52,Inscription!$A$6:$G$205,5,FALSE)),\" \")","v":" "},{"$f":"IF(C52>0,(VLOOKUP($C52,Inscription!$A$6:$G$205,7,FALSE)),\" \")","v":" "},{"$f":"LEFT(IF(C52>0,(VLOOKUP($C52,Inscription!$A$6:$G$205,6,FALSE)),\" \"),8)","v":" "},0,{"$f":"IF(COUNTIF($F$4:$F52,$F52)<2,$F52,\" \")","v":" "},1000,0,{"$f":"IF(COUNTIF($F$4:$F52,$F52)<3,$F52,\" \")","v":" "},1000,0,"",1000,1000,{"$f":"IF(COUNTIF($F$4:$F52,J52)<4,$F52,\" \")","v":" "},1000,0,"","","",""," ",0,8,0,1000,1000,1000,1000,1000,1000," "," "]
[59.509803921568626,1,72,{"$f":"IF(C53>0,CONCATENATE((VLOOKUP($C53,Inscription!$A$6:$G$205,3,FALSE)),\"   \",(VLOOKUP($C53,Inscription!$A$6:$G$205,4,FALSE))),\" \")","v":"LECELLIER   Raymond"},null,{"$f":"IF(C53>0,(VLOOKUP($C53,Inscription!$A$6:$G$205,5,FALSE)),\" \")","v":"team mégrit"},{"$f":"IF(C53>0,(VLOOKUP($C53,Inscription!$A$6:$G$205,7,FALSE)),\" \")","v":55656150},{"$f":"LEFT(IF(C53>0,(VLOOKUP($C53,Inscription!$A$6:$G$205,6,FALSE)),\" \"),8)","v":"3ème cat"},0,{"$f":"IF(COUNTIF($F$4:$F53,$F53)<2,$F53,\" \")","v":" "},"","",{"$f":"IF(COUNTIF($F$4:$F53,$F53)<3,$F53,\" \")","v":"team mégrit"},59.509803921568626,0,"team mégrit",59.509803921568626,0,{"$f":"IF(COUNTIF($F$4:$F53,J53)<4,$F53,\" \")","v":" "},"","",""," ","",""," ","T",9,0,1000,1000,1000,1000,1000,1000," "," "]
[59.509803921568626,2,65,{"$f":"IF(C54>0,CONCATENATE((VLOOKUP($C54,Inscription!$A$6:$G$205,3,FALSE)),\"   \",(VLOOKUP($C54,Inscription!$A$6:$G$205,4,FALSE))),\" \")","v":"NICOLAS    Jean Charles"},null,{"$f":"IF(C54>0,(VLOOKUP($C54,Inscription!$A$6:$G$205,5,FALSE)),\" \")","v":"ac vildé guingalan"},{"$f":"IF(C54>0,(VLOOKUP($C54,Inscription!$A$6:$G$205,7,FALSE)),\" \")","v":514101},{"$f":"LEFT(IF(C54>0,(VLOOKUP($C54,Inscription!$A$6:$G$205,6,FALSE)),\" \"),8)","v":"3ème cat"},0,{"$f":"IF(COUNTIF($F$4:$F54,$F54)<2,$F54,\" \")","v":"ac vildé guingalan"},59.509803921568626,0,{"$f":"IF(COUNTIF($F$4:$F54,$F54)<3,$F54,\" \")","v":"ac vildé guingalan"},59.509803921568626,0,"",1000,1000,{"$f":"IF(COUNTIF($F$4:$F54,J54)<4,$F54,\" \")","v":"ac vildé guingalan"},59.509803921568626,0,"","","",""," ","T",10,0,1000,1000,1000,1000,1000,1000," "," "]
[59.509803921568626,3,64,{"$f":"IF(C55>0,CONCATENATE((VLOOKUP($C55,Inscription!$A$6:$G$205,3,FALSE)),\"   \",(VLOOKUP($C55,Inscription!$A$6:$G$205,4,FALSE))),\" \")","v":"LEMAITRE   Alain"},null,{"$f":"IF(C55>0,(VLOOKUP($C55,Inscription!$A$6:$G$205,5,FALSE)),\" \")","v":"ac vildé guingalan"},{"$f":"IF(C55>0,(VLOOKUP($C55,Inscription!$A$6:$G$205,7,FALSE)),\" \")","v":225454},{"$f":"LEFT(IF(C55>0,(VLOOKUP($C55,Inscription!$A$6:$G$205,6,FALSE)),\" \"),8)","v":"3ème cat"},0,{"$f":"IF(COUNTIF($F$4:$F55,$F55)<2,$F55,\" \")","v":" "},"","",{"$f":"IF(COUNTIF($F$4:$F55,$F55)<3,$F55,\" \")","v":"ac vildé guingalan"},59.509803921568626,0,"ac vildé guingalan",59.509803921568626,0,{"$f":"IF(COUNTIF($F$4:$F55,J55)<4,$F55,\" \")","v":" "},"","",""," ","",""," ","T",11,0,1000,1000,1000,1000,1000,1000," "," "]
[59.509803921568626,4,73,{"$f":"IF(C56>0,CONCATENATE((VLOOKUP($C56,Inscription!$A$6:$G$205,3,FALSE)),\"   \",(VLOOKUP($C56,Inscription!$A$6:$G$205,4,FALSE))),\" \")","v":"ROPERCH   Bruno"},null,{"$f":"IF(C56>0,(VLOOKUP($C56,Inscription!$A$6:$G$205,5,FALSE)),\" \")","v":"uc plaudren"},{"$f":"IF(C56>0,(VLOOKUP($C56,Inscription!$A$6:$G$205,7,FALSE)),\" \")","v":875266},{"$f":"LEFT(IF(C56>0,(VLOOKUP($C56,Inscription!$A$6:$G$205,6,FALSE)),\" \"),8)","v":"3ème cat"},0,{"$f":"IF(COUNTIF($F$4:$F56,$F56)<2,$F56,\" \")","v":" "},"","",{"$f":"IF(COUNTIF($F$4:$F56,$F56)<3,$F56,\" \")","v":" "},"","","",1000,1000,{"$f":"IF(COUNTIF($F$4:$F56,J56)<4,$F56,\" \")","v":" "},"","","","","",""," ","T",12,0,1000,1000,1000,1000,1000,1000," "," "]
[59.509803921568626,5,68,{"$f":"IF(C57>0,CONCATENATE((VLOOKUP($C57,Inscription!$A$6:$G$205,3,FALSE)),\"   \",(VLOOKUP($C57,Inscription!$A$6:$G$205,4,FALSE))),\" \")","v":"GOUYA   Alain"},null,{"$f":"IF(C57>0,(VLOOKUP($C57,Inscription!$A$6:$G$205,5,FALSE)),\" \")","v":"district loudéac"},{"$f":"IF(C57>0,(VLOOKUP($C57,Inscription!$A$6:$G$205,7,FALSE)),\" \")","v":136125},{"$f":"LEFT(IF(C57>0,(VLOOKUP($C57,Inscription!$A$6:$G$205,6,FALSE)),\" \"),8)","v":"3ème cat"},0,{"$f":"IF(COUNTIF($F$4:$F57,$F57)<2,$F57,\" \")","v":" "},"","",{"$f":"IF(COUNTIF($F$4:$F57,$F57)<3,$F57,\" \")","v":" "},"","","",1000,1000,{"$f":"IF(COUNTIF($F$4:$F57,J57)<4,$F57,\" \")","v":" "},"","","","","",""," ","T",13,0,1000,1000,1000,1000,1000,1000," "," "]
[59.509803921568626,6,61,{"$f":"IF(C58>0,CONCATENATE((VLOOKUP($C58,Inscription!$A$6:$G$205,3,FALSE)),\"   \",(VLOOKUP($C58,Inscription!$A$6:$G$205,4,FALSE))),\" \")","v":"GUILLOT   Denis"},null,{"$f":"IF(C58>0,(VLOOKUP($C58,Inscription!$A$6:$G$205,5,FALSE)),\" \")","v":"team du pays de dinan guinefort"},{"$f":"IF(C58>0,(VLOOKUP($C58,Inscription!$A$6:$G$205,7,FALSE)),\" \")","v":844159},{"$f":"LEFT(IF(C58>0,(VLOOKUP($C58,Inscription!$A$6:$G$205,6,FALSE)),\" \"),8)","v":"3ème cat"},0,{"$f":"IF(COUNTIF($F$4:$F58,$F58)<2,$F58,\" \")","v":" "},"","",{"$f":"IF(COUNTIF($F$4:$F58,$F58)<3,$F58,\" \")","v":"team du pays de dinan guinefort"},59.509803921568626,0,"team du pays de dinan guinefort",59.509803921568626,0,{"$f":"IF(COUNTIF($F$4:$F58,J58)<4,$F58,\" \")","v":" "},"","",""," ","",""," ","T",14,0,1000,1000,1000,1000,1000,1000," "," "]
[59.509803921568626,7,60,{"$f":"IF(C59>0,CONCATENATE((VLOOKUP($C59,Inscription!$A$6:$G$205,3,FALSE)),\"   \",(VLOOKUP($C59,Inscription!$A$6:$G$205,4,FALSE))),\" \")","v":"GOUYA   Noel"},null,{"$f":"IF(C59>0,(VLOOKUP($C59,Inscription!$A$6:$G$205,5,FALSE)),\" \")","v":"team du pays de dinan guinefort"},{"$f":"IF(C59>0,(VLOOKUP($C59,Inscription!$A$6:$G$205,7,FALSE)),\" \")","v":226768},{"$f":"LEFT(IF(C59>0,(VLOOKUP($C59,Inscription!$A$6:$G$205,6,FALSE)),\" \"),8)","v":"3ème cat"},0,{"$f":"IF(COUNTIF($F$4:$F59,$F59)<2,$F59,\" \")","v":" "},"","",{"$f":"IF(COUNTIF($F$4:$F59,$F59)<3,$F59,\" \")","v":" "},"","","",1000,1000,{"$f":"IF(COUNTIF($F$4:$F59,J59)<4,$F59,\" \")","v":" "},"","","","","",""," ","T",15,0,1000,1000,1000,1000,1000,1000," "," "]
[59.509803921568626,8,63,{"$f":"IF(C60>0,CONCATENATE((VLOOKUP($C60,Inscription!$A$6:$G$205,3,FALSE)),\"   \",(VLOOKUP($C60,Inscription!$A$6:$G$205,4,FALSE))),\" \")","v":"COUALAN   Dominique"},null,{"$f":"IF(C60>0,(VLOOKUP($C60,Inscription!$A$6:$G$205,5,FALSE)),\" \")","v":"cc pleven"},{"$f":"IF(C60>0,(VLOOKUP($C60,Inscription!$A$6:$G$205,7,FALSE)),\" \")","v":153631},{"$f":"LEFT(IF(C60>0,(VLOOKUP($C60,Inscription!$A$6:$G$205,6,FALSE)),\" \"),8)","v":"3ème cat"},0,{"$f":"IF(COUNTIF($F$4:$F60,$F60)<2,$F60,\" \")","v":"cc pleven"},59.509803921568626,0,{"$f":"IF(COUNTIF($F$4:$F60,$F60)<3,$F60,\" \")","v":"cc pleven"},59.509803921568626,0,"",1000,1000,{"$f":"IF(COUNTIF($F$4:$F60,J60)<4,$F60,\" \")","v":"cc pleven"},59.509803921568626,0,"","","",""," ","T",16,0,1000,1000,1000,1000,1000,1000," "," "]
[59.509803921568626,9,71,{"$f":"IF(C61>0,CONCATENATE((VLOOKUP($C61,Inscription!$A$6:$G$205,3,FALSE)),\"   \",(VLOOKUP($C61,Inscription!$A$6:$G$205,4,FALSE))),\" \")","v":"GOUPIL   Michel"},null,{"$f":"IF(C61>0,(VLOOKUP($C61,Inscription!$A$6:$G$205,5,FALSE)),\" \")","v":"team mégrit"},{"$f":"IF(C61>0,(VLOOKUP($C61,Inscription!$A$6:$G$205,7,FALSE)),\" \")","v":55779611},{"$f":"LEFT(IF(C61>0,(VLOOKUP($C61,Inscription!$A$6:$G$205,6,FALSE)),\" \"),8)","v":"3ème cat"},0,{"$f":"IF(COUNTIF($F$4:$F61,$F61)<2,$F61,\" \")","v":" "},"","",{"$f":"IF(COUNTIF($F$4:$F61,$F61)<3,$F61,\" \")","v":" "},"","","",1000,1000,{"$f":"IF(COUNTIF($F$4:$F61,J61)<4,$F61,\" \")","v":" "},"","","","","",""," ","T",17,0,1000,1000,1000,1000,1000,1000," "," "]
[10,10,70,{"$f":"IF(C62>0,CONCATENATE((VLOOKUP($C62,Inscription!$A$6:$G$205,3,FALSE)),\"   \",(VLOOKUP($C62,Inscription!$A$6:$G$205,4,FALSE))),\" \")","v":"COLAS    Roger"},null,{"$f":"IF(C62>0,(VLOOKUP($C62,Inscription!$A$6:$G$205,5,FALSE)),\" \")","v":"vc crehen"},{"$f":"IF(C62>0,(VLOOKUP($C62,Inscription!$A$6:$G$205,7,FALSE)),\" \")","v":227437},{"$f":"LEFT(IF(C62>0,(VLOOKUP($C62,Inscription!$A$6:$G$205,6,FALSE)),\" \"),8)","v":"3ème cat"},0,{"$f":"IF(COUNTIF($F$4:$F62,$F62)<2,$F62,\" \")","v":"vc crehen"},10,0,{"$f":"IF(COUNTIF($F$4:$F62,$F62)<3,$F62,\" \")","v":"vc crehen"},10,0,"",1000,1000,{"$f":"IF(COUNTIF($F$4:$F62,J62)<4,$F62,\" \")","v":"vc crehen"},10,0,"","","",""," ",10,18,0,1000,1000,1000,1000,1000,1000," "," "]
[11,11,66,{"$f":"IF(C63>0,CONCATENATE((VLOOKUP($C63,Inscription!$A$6:$G$205,3,FALSE)),\"   \",(VLOOKUP($C63,Inscription!$A$6:$G$205,4,FALSE))),\" \")","v":"GEORGET   Charles"},null,{"$f":"IF(C63>0,(VLOOKUP($C63,Inscription!$A$6:$G$205,5,FALSE)),\" \")","v":"district loudéac"},{"$f":"IF(C63>0,(VLOOKUP($C63,Inscription!$A$6:$G$205,7,FALSE)),\" \")","v":227931},{"$f":"LEFT(IF(C63>0,(VLOOKUP($C63,Inscription!$A$6:$G$205,6,FALSE)),\" \"),8)","v":"3ème cat"},0,{"$f":"IF(COUNTIF($F$4:$F63,$F63)<2,$F63,\" \")","v":" "},"","",{"$f":"IF(COUNTIF($F$4:$F63,$F63)<3,$F63,\" \")","v":" "},"","","",1000,1000,{"$f":"IF(COUNTIF($F$4:$F63,J63)<4,$F63,\" \")","v":" "},"","","","","",""," ",11,19,0,1000,1000,1000,1000,1000,1000," "," "]
[12,12,67,{"$f":"IF(C64>0,CONCATENATE((VLOOKUP($C64,Inscription!$A$6:$G$205,3,FALSE)),\"   \",(VLOOKUP($C64,Inscription!$A$6:$G$205,4,FALSE))),\" \")","v":"BEDEL    Michel"},null,{"$f":"IF(C64>0,(VLOOKUP($C64,Inscription!$A$6:$G$205,5,FALSE)),\" \")","v":"district loudéac"},{"$f":"IF(C64>0,(VLOOKUP($C64,Inscription!$A$6:$G$205,7,FALSE)),\" \")","v":267277},{"$f":"LEFT(IF(C64>0,(VLOOKUP($C64,Inscription!$A$6:$G$205,6,FALSE)),\" \"),8)","v":"3ème cat"},0,{"$f":"IF(COUNTIF($F$4:$F64,$F64)<2,$F64,\" \")","v":" "},"","",{"$f":"IF(COUNTIF($F$4:$F64,$F64)<3,$F64,\" \")","v":" "},"","","",1000,1000,{"$f":"IF(COUNTIF($F$4:$F64,J64)<4,$F64,\" \")","v":" "},"","","","","",""," ",12,20,0,1000,1000,1000,1000,1000,1000," "," "]
[13,13,69,{"$f":"IF(C65>0,CONCATENATE((VLOOKUP($C65,Inscription!$A$6:$G$205,3,FALSE)),\"   \",(VLOOKUP($C65,Inscription!$A$6:$G$205,4,FALSE))),\" \")","v":"GAILLARD   Marcel"},null,{"$f":"IF(C65>0,(VLOOKUP($C65,Inscription!$A$6:$G$205,5,FALSE)),\" \")","v":"cos kerentrech"},{"$f":"IF(C65>0,(VLOOKUP($C65,Inscription!$A$6:$G$205,7,FALSE)),\" \")","v":57243},{"$f":"LEFT(IF(C65>0,(VLOOKUP($C65,Inscription!$A$6:$G$205,6,FALSE)),\" \"),8)","v":"3ème cat"},0,{"$f":"IF(COUNTIF($F$4:$F65,$F65)<2,$F65,\" \")","v":"cos kerentrech"},13,0,{"$f":"IF(COUNTIF($F$4:$F65,$F65)<3,$F65,\" \")","v":"cos kerentrech"},13,0,"",1000,1000,{"$f":"IF(COUNTIF($F$4:$F65,J65)<4,$F65,\" \")","v":"cos kerentrech"},13,0,"","","",""," ",13,21,0,1000,1000,1000,1000,1000,1000," "," "]
[59.509803921568626,"DNF",62,{"$f":"IF(C66>0,CONCATENATE((VLOOKUP($C66,Inscription!$A$6:$G$205,3,FALSE)),\"   \",(VLOOKUP($C66,Inscription!$A$6:$G$205,4,FALSE))),\" \")","v":"DURAND   Jacques"},null,{"$f":"IF(C66>0,(VLOOKUP($C66,Inscription!$A$6:$G$205,5,FALSE)),\" \")","v":"team du pays de dinan guinefort"},{"$f":"IF(C66>0,(VLOOKUP($C66,Inscription!$A$6:$G$205,7,FALSE)),\" \")","v":144227},{"$f":"LEFT(IF(C66>0,(VLOOKUP($C66,Inscription!$A$6:$G$205,6,FALSE)),\" \"),8)","v":"3ème cat"},0,{"$f":"IF(COUNTIF($F$4:$F66,$F66)<2,$F66,\" \")","v":" "},"","",{"$f":"IF(COUNTIF($F$4:$F66,$F66)<3,$F66,\" \")","v":" "},"","","",1000,1000,{"$f":"IF(COUNTIF($F$4:$F66,J66)<4,$F66,\" \")","v":" "},"","","","","",""," ","T",22,0,1000,1000,1000,1000,1000,1000," "," "]
[1000,null,null,{"$f":"IF(C67>0,CONCATENATE((VLOOKUP($C67,Inscription!$A$6:$G$205,3,FALSE)),\"   \",(VLOOKUP($C67,Inscription!$A$6:$G$205,4,FALSE))),\" \")","v":" "},null,{"$f":"IF(C67>0,(VLOOKUP($C67,Inscription!$A$6:$G$205,5,FALSE)),\" \")","v":" "},{"$f":"IF(C67>0,(VLOOKUP($C67,Inscription!$A$6:$G$205,7,FALSE)),\" \")","v":" "},{"$f":"LEFT(IF(C67>0,(VLOOKUP($C67,Inscription!$A$6:$G$205,6,FALSE)),\" \"),8)","v":" "},0,{"$f":"IF(COUNTIF($F$4:$F67,$F67)<2,$F67,\" \")","v":" "},1000,0,{"$f":"IF(COUNTIF($F$4:$F67,$F67)<3,$F67,\" \")","v":" "},1000,0,"",1000,1000,{"$f":"IF(COUNTIF($F$4:$F67,J67)<4,$F67,\" \")","v":" "},1000,0,"","","",""," ",0,23,0,1000,1000,1000,1000,1000,1000," "," "]
[{"$f":"IF(B68<1,1000,(IF(AA68=B68,B68,(20100-SUM($AA$4:$AA$203))/(COUNTIF($AA$4:$AA$203,\"T\")))))","v":1000},null,null,{"$f":"IF(C68>0,CONCATENATE((VLOOKUP($C68,Inscription!$A$6:$G$205,3,FALSE)),\"   \",(VLOOKUP($C68,Inscription!$A$6:$G$205,4,FALSE))),\" \")","v":" "},null,{"$f":"IF(C68>0,(VLOOKUP($C68,Inscription!$A$6:$G$205,5,FALSE)),\" \")","v":" "},{"$f":"IF(C68>0,(VLOOKUP($C68,Inscription!$A$6:$G$205,7,FALSE)),\" \")","v":" "},{"$f":"LEFT(IF(C68>0,(VLOOKUP($C68,Inscription!$A$6:$G$205,6,FALSE)),\" \"),8)","v":" "},0,{"$f":"IF(COUNTIF($F$4:$F68,$F68)<2,$F68,\" \")","v":" "},1000,0,{"$f":"IF(COUNTIF($F$4:$F68,$F68)<3,$F68,\" \")","v":" "},1000,0,"",1000,1000,{"$f":"IF(COUNTIF($F$4:$F68,J68)<4,$F68,\" \")","v":" "},1000,0,"","","","",{"$f":"IF(COUNTIF($C$4:$C$203,C68)>1,\"X\",\" \")","v":" "},{"$f":"IF(COUNTIF($B$4:$B$203,B68)>1,\"T\",B68)","v":0},24,0,1000,1000,1000,1000,1000,1000," "," "]
[1000,null,null,{"$f":"IF(C69>0,CONCATENATE((VLOOKUP($C69,Inscription!$A$6:$G$205,3,FALSE)),\"   \",(VLOOKUP($C69,Inscription!$A$6:$G$205,4,FALSE))),\" \")","v":" "},null,{"$f":"IF(C69>0,(VLOOKUP($C69,Inscription!$A$6:$G$205,5,FALSE)),\" \")","v":" "},{"$f":"IF(C69>0,(VLOOKUP($C69,Inscription!$A$6:$G$205,7,FALSE)),\" \")","v":" "},{"$f":"LEFT(IF(C69>0,(VLOOKUP($C69,Inscription!$A$6:$G$205,6,FALSE)),\" \"),8)","v":" "},0,{"$f":"IF(COUNTIF($F$4:$F69,$F69)<2,$F69,\" \")","v":" "},{"$f":"IF(J69=F69,A69,\"\")","v":1000},{"$f":"IF(J69=F69,I69,\"\")","v":0},{"$f":"IF(COUNTIF($F$4:$F69,$F69)<3,$F69,\" \")","v":" "},{"$f":"IF(M69=$F69,$A69,\"\")","v":1000},{"$f":"IF(M69=$F69,$I69,\"\")","v":0},{"$f":"IF(M69=J69,\"\",M69)","v":""},{"$f":"IF(P69=$F69,$A69,1000)","v":1000},{"$f":"IF(P69=$F69,$I69,1000)","v":1000},{"$f":"IF(COUNTIF($F$4:$F69,J69)<4,$F69,\" \")","v":" "},{"$f":"IF(S69=$F69,$A69,\"\")","v":1000},{"$f":"IF(S69=$F69,$I69,\"\")","v":0},{"$f":"IF(S69=J69,\"\",S69)","v":""},{"$f":"IF(V69=P69,\"\",S69)","v":""},{"$f":"IF(W69=$F69,$A69,\"\")","v":""},{"$f":"IF(W69=$F69,$I69,\"\")","v":""}," ",0,25,0,1000,1000,1000,1000,1000,1000," "," "]
[1000,null,null,{"$f":"IF(C70>0,CONCATENATE((VLOOKUP($C70,Inscription!$A$6:$G$205,3,FALSE)),\"   \",(VLOOKUP($C70,Inscription!$A$6:$G$205,4,FALSE))),\" \")","v":" "},null,{"$f":"IF(C70>0,(VLOOKUP($C70,Inscription!$A$6:$G$205,5,FALSE)),\" \")","v":" "},{"$f":"IF(C70>0,(VLOOKUP($C70,Inscription!$A$6:$G$205,7,FALSE)),\" \")","v":" "},{"$f":"LEFT(IF(C70>0,(VLOOKUP($C70,Inscription!$A$6:$G$205,6,FALSE)),\" \"),8)","v":" "},{"$f":"I69","v":0},{"$f":"IF(COUNTIF($F$4:$F70,$F70)<2,$F70,\" \")","v":" "},1000,0,{"$f":"IF(COUNTIF($F$4:$F70,$F70)<3,$F70,\" \")","v":" "},1000,0,"",1000,1000,{"$f":"IF(COUNTIF($F$4:$F70,J70)<4,$F70,\" \")","v":" "},1000,0,"","","",""," ",0,26,0,1000,1000,1000,1000,1000,1000," "," "]
[1000,null,null,{"$f":"IF(C71>0,CONCATENATE((VLOOKUP($C71,Inscription!$A$6:$G$205,3,FALSE)),\"   \",(VLOOKUP($C71,Inscription!$A$6:$G$205,4,FALSE))),\" \")","v":" "},null,{"$f":"IF(C71>0,(VLOOKUP($C71,Inscription!$A$6:$G$205,5,FALSE)),\" \")","v":" "},{"$f":"IF(C71>0,(VLOOKUP($C71,Inscription!$A$6:$G$205,7,FALSE)),\" \")","v":" "},{"$f":"LEFT(IF(C71>0,(VLOOKUP($C71,Inscription!$A$6:$G$205,6,FALSE)),\" \"),8)","v":" "},0,{"$f":"IF(COUNTIF($F$4:$F71,$F71)<2,$F71,\" \")","v":" "},1000,0,{"$f":"IF(COUNTIF($F$4:$F71,$F71)<3,$F71,\" \")","v":" "},1000,0,"",1000,1000,{"$f":"IF(COUNTIF($F$4:$F71,J71)<4,$F71,\" \")","v":" "},1000,0,"","","",""," ",0,27,0,1000,1000,1000,1000,1000,1000," "," "]
[1000,null,null,{"$f":"IF(C72>0,CONCATENATE((VLOOKUP($C72,Inscription!$A$6:$G$205,3,FALSE)),\"   \",(VLOOKUP($C72,Inscription!$A$6:$G$205,4,FALSE))),\" \")","v":" "},null,{"$f":"IF(C72>0,(VLOOKUP($C72,Inscription!$A$6:$G$205,5,FALSE)),\" \")","v":" "},{"$f":"IF(C72>0,(VLOOKUP($C72,Inscription!$A$6:$G$205,7,FALSE)),\" \")","v":" "},{"$f":"LEFT(IF(C72>0,(VLOOKUP($C72,Inscription!$A$6:$G$205,6,FALSE)),\" \"),8)","v":" "},0,{"$f":"IF(COUNTIF($F$4:$F72,$F72)<2,$F72,\" \")","v":" "},1000,0,{"$f":"IF(COUNTIF($F$4:$F72,$F72)<3,$F72,\" \")","v":" "},1000,0,"",1000,1000,{"$f":"IF(COUNTIF($F$4:$F72,J72)<4,$F72,\" \")","v":" "},1000,0,"","","",""," ",0,28,0,1000,1000,1000,1000,1000,1000," "," "]
[1000,null,null,{"$f":"IF(C73>0,CONCATENATE((VLOOKUP($C73,Inscription!$A$6:$G$205,3,FALSE)),\"   \",(VLOOKUP($C73,Inscription!$A$6:$G$205,4,FALSE))),\" \")","v":" "},null,{"$f":"IF(C73>0,(VLOOKUP($C73,Inscription!$A$6:$G$205,5,FALSE)),\" \")","v":" "},{"$f":"IF(C73>0,(VLOOKUP($C73,Inscription!$A$6:$G$205,7,FALSE)),\" \")","v":" "},{"$f":"LEFT(IF(C73>0,(VLOOKUP($C73,Inscription!$A$6:$G$205,6,FALSE)),\" \"),8)","v":" "},0,{"$f":"IF(COUNTIF($F$4:$F73,$F73)<2,$F73,\" \")","v":" "},1000,0,{"$f":"IF(COUNTIF($F$4:$F73,$F73)<3,$F73,\" \")","v":" "},1000,0,"",1000,1000,{"$f":"IF(COUNTIF($F$4:$F73,J73)<4,$F73,\" \")","v":" "},1000,0,"","","",""," ",0,29,0,1000,1000,1000,1000,1000,1000," "," "]
[1000,null,null,{"$f":"IF(C74>0,CONCATENATE((VLOOKUP($C74,Inscription!$A$6:$G$205,3,FALSE)),\"   \",(VLOOKUP($C74,Inscription!$A$6:$G$205,4,FALSE))),\" \")","v":" "},null,{"$f":"IF(C74>0,(VLOOKUP($C74,Inscription!$A$6:$G$205,5,FALSE)),\" \")","v":" "},{"$f":"IF(C74>0,(VLOOKUP($C74,Inscription!$A$6:$G$205,7,FALSE)),\" \")","v":" "},{"$f":"LEFT(IF(C74>0,(VLOOKUP($C74,Inscription!$A$6:$G$205,6,FALSE)),\" \"),8)","v":" "},0,{"$f":"IF(COUNTIF($F$4:$F74,$F74)<2,$F74,\" \")","v":" "},1000,0,{"$f":"IF(COUNTIF($F$4:$F74,$F74)<3,$F74,\" \")","v":" "},1000,0,"",1000,1000,{"$f":"IF(COUNTIF($F$4:$F74,J74)<4,$F74,\" \")","v":" "},1000,0,"","","",""," ",0,30,0,1000,1000,1000,1000,1000,1000," "," "]
[1000,null,null,{"$f":"IF(C75>0,CONCATENATE((VLOOKUP($C75,Inscription!$A$6:$G$205,3,FALSE)),\"   \",(VLOOKUP($C75,Inscription!$A$6:$G$205,4,FALSE))),\" \")","v":" "},null,{"$f":"IF(C75>0,(VLOOKUP($C75,Inscription!$A$6:$G$205,5,FALSE)),\" \")","v":" "},{"$f":"IF(C75>0,(VLOOKUP($C75,Inscription!$A$6:$G$205,7,FALSE)),\" \")","v":" "},{"$f":"LEFT(IF(C75>0,(VLOOKUP($C75,Inscription!$A$6:$G$205,6,FALSE)),\" \"),8)","v":" "},0,{"$f":"IF(COUNTIF($F$4:$F75,$F75)<2,$F75,\" \")","v":" "},1000,0,{"$f":"IF(COUNTIF($F$4:$F75,$F75)<3,$F75,\" \")","v":" "},1000,0,"",1000,1000,{"$f":"IF(COUNTIF($F$4:$F75,J75)<4,$F75,\" \")","v":" "},1000,0,"","","",""," ",0,31,0,1000,1000,1000,1000,1000,1000," "," "]
[1000,null,null,{"$f":"IF(C76>0,CONCATENATE((VLOOKUP($C76,Inscription!$A$6:$G$205,3,FALSE)),\"   \",(VLOOKUP($C76,Inscription!$A$6:$G$205,4,FALSE))),\" \")","v":" "},null,{"$f":"IF(C76>0,(VLOOKUP($C76,Inscription!$A$6:$G$205,5,FALSE)),\" \")","v":" "},{"$f":"IF(C76>0,(VLOOKUP($C76,Inscription!$A$6:$G$205,7,FALSE)),\" \")","v":" "},{"$f":"LEFT(IF(C76>0,(VLOOKUP($C76,Inscription!$A$6:$G$205,6,FALSE)),\" \"),8)","v":" "},0,{"$f":"IF(COUNTIF($F$4:$F76,$F76)<2,$F76,\" \")","v":" "},1000,0,{"$f":"IF(COUNTIF($F$4:$F76,$F76)<3,$F76,\" \")","v":" "},1000,0,"",1000,1000,{"$f":"IF(COUNTIF($F$4:$F76,J76)<4,$F76,\" \")","v":" "},1000,0,"","","",""," ",0,32,0,1000,1000,1000,1000,1000,1000," "," "]
[1000,null,null,{"$f":"IF(C77>0,CONCATENATE((VLOOKUP($C77,Inscription!$A$6:$G$205,3,FALSE)),\"   \",(VLOOKUP($C77,Inscription!$A$6:$G$205,4,FALSE))),\" \")","v":" "},null,{"$f":"IF(C77>0,(VLOOKUP($C77,Inscription!$A$6:$G$205,5,FALSE)),\" \")","v":" "},{"$f":"IF(C77>0,(VLOOKUP($C77,Inscription!$A$6:$G$205,7,FALSE)),\" \")","v":" "},{"$f":"LEFT(IF(C77>0,(VLOOKUP($C77,Inscription!$A$6:$G$205,6,FALSE)),\" \"),8)","v":" "},0,{"$f":"IF(COUNTIF($F$4:$F77,$F77)<2,$F77,\" \")","v":" "},1000,0,{"$f":"IF(COUNTIF($F$4:$F77,$F77)<3,$F77,\" \")","v":" "},1000,0,"",1000,1000,{"$f":"IF(COUNTIF($F$4:$F77,J77)<4,$F77,\" \")","v":" "},1000,0,"","","",""," ",0,33,0,1000,1000,1000,1000,1000,1000," "," "]
[1000,null,null,{"$f":"IF(C78>0,CONCATENATE((VLOOKUP($C78,Inscription!$A$6:$G$205,3,FALSE)),\"   \",(VLOOKUP($C78,Inscription!$A$6:$G$205,4,FALSE))),\" \")","v":" "},null,{"$f":"IF(C78>0,(VLOOKUP($C78,Inscription!$A$6:$G$205,5,FALSE)),\" \")","v":" "},{"$f":"IF(C78>0,(VLOOKUP($C78,Inscription!$A$6:$G$205,7,FALSE)),\" \")","v":" "},{"$f":"LEFT(IF(C78>0,(VLOOKUP($C78,Inscription!$A$6:$G$205,6,FALSE)),\" \"),8)","v":" "},0,{"$f":"IF(COUNTIF($F$4:$F78,$F78)<2,$F78,\" \")","v":" "},1000,0,{"$f":"IF(COUNTIF($F$4:$F78,$F78)<3,$F78,\" \")","v":" "},1000,0,"",1000,1000,{"$f":"IF(COUNTIF($F$4:$F78,J78)<4,$F78,\" \")","v":" "},1000,0,"","","",""," ",0,34,0,1000,1000,1000,1000,1000,1000," "," "]
[1000,null,null,{"$f":"IF(C79>0,CONCATENATE((VLOOKUP($C79,Inscription!$A$6:$G$205,3,FALSE)),\"   \",(VLOOKUP($C79,Inscription!$A$6:$G$205,4,FALSE))),\" \")","v":" "},null,{"$f":"IF(C79>0,(VLOOKUP($C79,Inscription!$A$6:$G$205,5,FALSE)),\" \")","v":" "},{"$f":"IF(C79>0,(VLOOKUP($C79,Inscription!$A$6:$G$205,7,FALSE)),\" \")","v":" "},{"$f":"LEFT(IF(C79>0,(VLOOKUP($C79,Inscription!$A$6:$G$205,6,FALSE)),\" \"),8)","v":" "},0,{"$f":"IF(COUNTIF($F$4:$F79,$F79)<2,$F79,\" \")","v":" "},1000,0,{"$f":"IF(COUNTIF($F$4:$F79,$F79)<3,$F79,\" \")","v":" "},1000,0,"",1000,1000,{"$f":"IF(COUNTIF($F$4:$F79,J79)<4,$F79,\" \")","v":" "},1000,0,"","","",""," ",0,35,0,1000,1000,1000,1000,1000,1000," "," "]
[1000,null,null,{"$f":"IF(C80>0,CONCATENATE((VLOOKUP($C80,Inscription!$A$6:$G$205,3,FALSE)),\"   \",(VLOOKUP($C80,Inscription!$A$6:$G$205,4,FALSE))),\" \")","v":" "},null,{"$f":"IF(C80>0,(VLOOKUP($C80,Inscription!$A$6:$G$205,5,FALSE)),\" \")","v":" "},{"$f":"IF(C80>0,(VLOOKUP($C80,Inscription!$A$6:$G$205,7,FALSE)),\" \")","v":" "},{"$f":"LEFT(IF(C80>0,(VLOOKUP($C80,Inscription!$A$6:$G$205,6,FALSE)),\" \"),8)","v":" "},0,{"$f":"IF(COUNTIF($F$4:$F80,$F80)<2,$F80,\" \")","v":" "},1000,0,{"$f":"IF(COUNTIF($F$4:$F80,$F80)<3,$F80,\" \")","v":" "},1000,0,"",1000,1000,{"$f":"IF(COUNTIF($F$4:$F80,J80)<4,$F80,\" \")","v":" "},1000,0,"","","","",{"$f":"IF(COUNTIF($C$4:$C$203,C80)>1,\"X\",\" \")","v":" "},{"$f":"IF(COUNTIF($B$4:$B$203,B80)>1,\"T\",B80)","v":0}]
[1000,null,null,{"$f":"IF(C81>0,CONCATENATE((VLOOKUP($C81,Inscription!$A$6:$G$205,3,FALSE)),\"   \",(VLOOKUP($C81,Inscription!$A$6:$G$205,4,FALSE))),\" \")","v":" "},null,{"$f":"IF(C81>0,(VLOOKUP($C81,Inscription!$A$6:$G$205,5,FALSE)),\" \")","v":" "},{"$f":"IF(C81>0,(VLOOKUP($C81,Inscription!$A$6:$G$205,7,FALSE)),\" \")","v":" "},{"$f":"LEFT(IF(C81>0,(VLOOKUP($C81,Inscription!$A$6:$G$205,6,FALSE)),\" \"),8)","v":" "},0,{"$f":"IF(COUNTIF($F$4:$F81,$F81)<2,$F81,\" \")","v":" "},1000,0,{"$f":"IF(COUNTIF($F$4:$F81,$F81)<3,$F81,\" \")","v":" "},1000,0,"",1000,1000,{"$f":"IF(COUNTIF($F$4:$F81,J81)<4,$F81,\" \")","v":" "},1000,0,"","","",""," ",0]
[79,79,null,{"$f":"IF(C82>0,CONCATENATE((VLOOKUP($C82,Inscription!$A$6:$G$205,3,FALSE)),\"   \",(VLOOKUP($C82,Inscription!$A$6:$G$205,4,FALSE))),\" \")","v":" "},null,{"$f":"IF(C82>0,(VLOOKUP($C82,Inscription!$A$6:$G$205,5,FALSE)),\" \")","v":" "},{"$f":"IF(C82>0,(VLOOKUP($C82,Inscription!$A$6:$G$205,7,FALSE)),\" \")","v":" "},{"$f":"LEFT(IF(C82>0,(VLOOKUP($C82,Inscription!$A$6:$G$205,6,FALSE)),\" \"),8)","v":" "},0,{"$f":"IF(COUNTIF($F$4:$F82,$F82)<2,$F82,\" \")","v":" "},79,0,{"$f":"IF(COUNTIF($F$4:$F82,$F82)<3,$F82,\" \")","v":" "},79,0,"",1000,1000,{"$f":"IF(COUNTIF($F$4:$F82,J82)<4,$F82,\" \")","v":" "},79,0,"","","",""," ",79]
[80,80,null,{"$f":"IF(C83>0,CONCATENATE((VLOOKUP($C83,Inscription!$A$6:$G$205,3,FALSE)),\"   \",(VLOOKUP($C83,Inscription!$A$6:$G$205,4,FALSE))),\" \")","v":" "},null,{"$f":"IF(C83>0,(VLOOKUP($C83,Inscription!$A$6:$G$205,5,FALSE)),\" \")","v":" "},{"$f":"IF(C83>0,(VLOOKUP($C83,Inscription!$A$6:$G$205,7,FALSE)),\" \")","v":" "},{"$f":"LEFT(IF(C83>0,(VLOOKUP($C83,Inscription!$A$6:$G$205,6,FALSE)),\" \"),8)","v":" "},0,{"$f":"IF(COUNTIF($F$4:$F83,$F83)<2,$F83,\" \")","v":" "},80,0,{"$f":"IF(COUNTIF($F$4:$F83,$F83)<3,$F83,\" \")","v":" "},80,0,"",1000,1000,{"$f":"IF(COUNTIF($F$4:$F83,J83)<4,$F83,\" \")","v":" "},80,0,"","","",""," ",80]
[81,81,null,{"$f":"IF(C84>0,CONCATENATE((VLOOKUP($C84,Inscription!$A$6:$G$205,3,FALSE)),\"   \",(VLOOKUP($C84,Inscription!$A$6:$G$205,4,FALSE))),\" \")","v":" "},null,{"$f":"IF(C84>0,(VLOOKUP($C84,Inscription!$A$6:$G$205,5,FALSE)),\" \")","v":" "},{"$f":"IF(C84>0,(VLOOKUP($C84,Inscription!$A$6:$G$205,7,FALSE)),\" \")","v":" "},{"$f":"LEFT(IF(C84>0,(VLOOKUP($C84,Inscription!$A$6:$G$205,6,FALSE)),\" \"),8)","v":" "},0,{"$f":"IF(COUNTIF($F$4:$F84,$F84)<2,$F84,\" \")","v":" "},81,0,{"$f":"IF(COUNTIF($F$4:$F84,$F84)<3,$F84,\" \")","v":" "},81,0,"",1000,1000,{"$f":"IF(COUNTIF($F$4:$F84,J84)<4,$F84,\" \")","v":" "},81,0,"","","",""," ",81]
[82,82,null,{"$f":"IF(C85>0,CONCATENATE((VLOOKUP($C85,Inscription!$A$6:$G$205,3,FALSE)),\"   \",(VLOOKUP($C85,Inscription!$A$6:$G$205,4,FALSE))),\" \")","v":" "},null,{"$f":"IF(C85>0,(VLOOKUP($C85,Inscription!$A$6:$G$205,5,FALSE)),\" \")","v":" "},{"$f":"IF(C85>0,(VLOOKUP($C85,Inscription!$A$6:$G$205,7,FALSE)),\" \")","v":" "},{"$f":"LEFT(IF(C85>0,(VLOOKUP($C85,Inscription!$A$6:$G$205,6,FALSE)),\" \"),8)","v":" "},0,{"$f":"IF(COUNTIF($F$4:$F85,$F85)<2,$F85,\" \")","v":" "},82,0,{"$f":"IF(COUNTIF($F$4:$F85,$F85)<3,$F85,\" \")","v":" "},82,0,"",1000,1000,{"$f":"IF(COUNTIF($F$4:$F85,J85)<4,$F85,\" \")","v":" "},82,0,"","","",""," ",82]
[83,83,null,{"$f":"IF(C86>0,CONCATENATE((VLOOKUP($C86,Inscription!$A$6:$G$205,3,FALSE)),\"   \",(VLOOKUP($C86,Inscription!$A$6:$G$205,4,FALSE))),\" \")","v":" "},null,{"$f":"IF(C86>0,(VLOOKUP($C86,Inscription!$A$6:$G$205,5,FALSE)),\" \")","v":" "},{"$f":"IF(C86>0,(VLOOKUP($C86,Inscription!$A$6:$G$205,7,FALSE)),\" \")","v":" "},{"$f":"LEFT(IF(C86>0,(VLOOKUP($C86,Inscription!$A$6:$G$205,6,FALSE)),\" \"),8)","v":" "},0,{"$f":"IF(COUNTIF($F$4:$F86,$F86)<2,$F86,\" \")","v":" "},83,0,{"$f":"IF(COUNTIF($F$4:$F86,$F86)<3,$F86,\" \")","v":" "},83,0,"",1000,1000,{"$f":"IF(COUNTIF($F$4:$F86,J86)<4,$F86,\" \")","v":" "},83,0,"","","",""," ",83]
[84,84,null,{"$f":"IF(C87>0,CONCATENATE((VLOOKUP($C87,Inscription!$A$6:$G$205,3,FALSE)),\"   \",(VLOOKUP($C87,Inscription!$A$6:$G$205,4,FALSE))),\" \")","v":" "},null,{"$f":"IF(C87>0,(VLOOKUP($C87,Inscription!$A$6:$G$205,5,FALSE)),\" \")","v":" "},{"$f":"IF(C87>0,(VLOOKUP($C87,Inscription!$A$6:$G$205,7,FALSE)),\" \")","v":" "},{"$f":"LEFT(IF(C87>0,(VLOOKUP($C87,Inscription!$A$6:$G$205,6,FALSE)),\" \"),8)","v":" "},0,{"$f":"IF(COUNTIF($F$4:$F87,$F87)<2,$F87,\" \")","v":" "},84,0,{"$f":"IF(COUNTIF($F$4:$F87,$F87)<3,$F87,\" \")","v":" "},84,0,"",1000,1000,{"$f":"IF(COUNTIF($F$4:$F87,J87)<4,$F87,\" \")","v":" "},84,0,"","","",""," ",84]
[85,85,null,{"$f":"IF(C88>0,CONCATENATE((VLOOKUP($C88,Inscription!$A$6:$G$205,3,FALSE)),\"   \",(VLOOKUP($C88,Inscription!$A$6:$G$205,4,FALSE))),\" \")","v":" "},null,{"$f":"IF(C88>0,(VLOOKUP($C88,Inscription!$A$6:$G$205,5,FALSE)),\" \")","v":" "},{"$f":"IF(C88>0,(VLOOKUP($C88,Inscription!$A$6:$G$205,7,FALSE)),\" \")","v":" "},{"$f":"LEFT(IF(C88>0,(VLOOKUP($C88,Inscription!$A$6:$G$205,6,FALSE)),\" \"),8)","v":" "},0,{"$f":"IF(COUNTIF($F$4:$F88,$F88)<2,$F88,\" \")","v":" "},85,0,{"$f":"IF(COUNTIF($F$4:$F88,$F88)<3,$F88,\" \")","v":" "},85,0,"",1000,1000,{"$f":"IF(COUNTIF($F$4:$F88,J88)<4,$F88,\" \")","v":" "},85,0,"","","",""," ",85]
[86,86,null,{"$f":"IF(C89>0,CONCATENATE((VLOOKUP($C89,Inscription!$A$6:$G$205,3,FALSE)),\"   \",(VLOOKUP($C89,Inscription!$A$6:$G$205,4,FALSE))),\" \")","v":" "},null,{"$f":"IF(C89>0,(VLOOKUP($C89,Inscription!$A$6:$G$205,5,FALSE)),\" \")","v":" "},{"$f":"IF(C89>0,(VLOOKUP($C89,Inscription!$A$6:$G$205,7,FALSE)),\" \")","v":" "},{"$f":"LEFT(IF(C89>0,(VLOOKUP($C89,Inscription!$A$6:$G$205,6,FALSE)),\" \"),8)","v":" "},0,{"$f":"IF(COUNTIF($F$4:$F89,$F89)<2,$F89,\" \")","v":" "},86,0,{"$f":"IF(COUNTIF($F$4:$F89,$F89)<3,$F89,\" \")","v":" "},86,0,"",1000,1000,{"$f":"IF(COUNTIF($F$4:$F89,J89)<4,$F89,\" \")","v":" "},86,0,"","","",""," ",86]
[87,87,null,{"$f":"IF(C90>0,CONCATENATE((VLOOKUP($C90,Inscription!$A$6:$G$205,3,FALSE)),\"   \",(VLOOKUP($C90,Inscription!$A$6:$G$205,4,FALSE))),\" \")","v":" "},null,{"$f":"IF(C90>0,(VLOOKUP($C90,Inscription!$A$6:$G$205,5,FALSE)),\" \")","v":" "},{"$f":"IF(C90>0,(VLOOKUP($C90,Inscription!$A$6:$G$205,7,FALSE)),\" \")","v":" "},{"$f":"LEFT(IF(C90>0,(VLOOKUP($C90,Inscription!$A$6:$G$205,6,FALSE)),\" \"),8)","v":" "},0,{"$f":"IF(COUNTIF($F$4:$F90,$F90)<2,$F90,\" \")","v":" "},87,0,{"$f":"IF(COUNTIF($F$4:$F90,$F90)<3,$F90,\" \")","v":" "},87,0,"",1000,1000,{"$f":"IF(COUNTIF($F$4:$F90,J90)<4,$F90,\" \")","v":" "},87,0,"","","",""," ",87]
[88,88,null,{"$f":"IF(C91>0,CONCATENATE((VLOOKUP($C91,Inscription!$A$6:$G$205,3,FALSE)),\"   \",(VLOOKUP($C91,Inscription!$A$6:$G$205,4,FALSE))),\" \")","v":" "},null,{"$f":"IF(C91>0,(VLOOKUP($C91,Inscription!$A$6:$G$205,5,FALSE)),\" \")","v":" "},{"$f":"IF(C91>0,(VLOOKUP($C91,Inscription!$A$6:$G$205,7,FALSE)),\" \")","v":" "},{"$f":"LEFT(IF(C91>0,(VLOOKUP($C91,Inscription!$A$6:$G$205,6,FALSE)),\" \"),8)","v":" "},0,{"$f":"IF(COUNTIF($F$4:$F91,$F91)<2,$F91,\" \")","v":" "},88,0,{"$f":"IF(COUNTIF($F$4:$F91,$F91)<3,$F91,\" \")","v":" "},88,0,"",1000,1000,{"$f":"IF(COUNTIF($F$4:$F91,J91)<4,$F91,\" \")","v":" "},88,0,"","","",""," ",88]
[89,89,null,{"$f":"IF(C92>0,CONCATENATE((VLOOKUP($C92,Inscription!$A$6:$G$205,3,FALSE)),\"   \",(VLOOKUP($C92,Inscription!$A$6:$G$205,4,FALSE))),\" \")","v":" "},null,{"$f":"IF(C92>0,(VLOOKUP($C92,Inscription!$A$6:$G$205,5,FALSE)),\" \")","v":" "},{"$f":"IF(C92>0,(VLOOKUP($C92,Inscription!$A$6:$G$205,7,FALSE)),\" \")","v":" "},{"$f":"LEFT(IF(C92>0,(VLOOKUP($C92,Inscription!$A$6:$G$205,6,FALSE)),\" \"),8)","v":" "},0,{"$f":"IF(COUNTIF($F$4:$F92,$F92)<2,$F92,\" \")","v":" "},89,0,{"$f":"IF(COUNTIF($F$4:$F92,$F92)<3,$F92,\" \")","v":" "},89,0,"",1000,1000,{"$f":"IF(COUNTIF($F$4:$F92,J92)<4,$F92,\" \")","v":" "},89,0,"","","",""," ",89]
[90,90,null,{"$f":"IF(C93>0,CONCATENATE((VLOOKUP($C93,Inscription!$A$6:$G$205,3,FALSE)),\"   \",(VLOOKUP($C93,Inscription!$A$6:$G$205,4,FALSE))),\" \")","v":" "},null,{"$f":"IF(C93>0,(VLOOKUP($C93,Inscription!$A$6:$G$205,5,FALSE)),\" \")","v":" "},{"$f":"IF(C93>0,(VLOOKUP($C93,Inscription!$A$6:$G$205,7,FALSE)),\" \")","v":" "},{"$f":"LEFT(IF(C93>0,(VLOOKUP($C93,Inscription!$A$6:$G$205,6,FALSE)),\" \"),8)","v":" "},0,{"$f":"IF(COUNTIF($F$4:$F93,$F93)<2,$F93,\" \")","v":" "},90,0,{"$f":"IF(COUNTIF($F$4:$F93,$F93)<3,$F93,\" \")","v":" "},90,0,"",1000,1000,{"$f":"IF(COUNTIF($F$4:$F93,J93)<4,$F93,\" \")","v":" "},90,0,"","","",""," ",90]
[91,91,null,{"$f":"IF(C94>0,CONCATENATE((VLOOKUP($C94,Inscription!$A$6:$G$205,3,FALSE)),\"   \",(VLOOKUP($C94,Inscription!$A$6:$G$205,4,FALSE))),\" \")","v":" "},null,{"$f":"IF(C94>0,(VLOOKUP($C94,Inscription!$A$6:$G$205,5,FALSE)),\" \")","v":" "},{"$f":"IF(C94>0,(VLOOKUP($C94,Inscription!$A$6:$G$205,7,FALSE)),\" \")","v":" "},{"$f":"LEFT(IF(C94>0,(VLOOKUP($C94,Inscription!$A$6:$G$205,6,FALSE)),\" \"),8)","v":" "},0,{"$f":"IF(COUNTIF($F$4:$F94,$F94)<2,$F94,\" \")","v":" "},91,0,{"$f":"IF(COUNTIF($F$4:$F94,$F94)<3,$F94,\" \")","v":" "},91,0,"",1000,1000,{"$f":"IF(COUNTIF($F$4:$F94,J94)<4,$F94,\" \")","v":" "},91,0,"","","",""," ",91]
[92,92,null,{"$f":"IF(C95>0,CONCATENATE((VLOOKUP($C95,Inscription!$A$6:$G$205,3,FALSE)),\"   \",(VLOOKUP($C95,Inscription!$A$6:$G$205,4,FALSE))),\" \")","v":" "},null,{"$f":"IF(C95>0,(VLOOKUP($C95,Inscription!$A$6:$G$205,5,FALSE)),\" \")","v":" "},{"$f":"IF(C95>0,(VLOOKUP($C95,Inscription!$A$6:$G$205,7,FALSE)),\" \")","v":" "},{"$f":"LEFT(IF(C95>0,(VLOOKUP($C95,Inscription!$A$6:$G$205,6,FALSE)),\" \"),8)","v":" "},0,{"$f":"IF(COUNTIF($F$4:$F95,$F95)<2,$F95,\" \")","v":" "},92,0,{"$f":"IF(COUNTIF($F$4:$F95,$F95)<3,$F95,\" \")","v":" "},92,0,"",1000,1000,{"$f":"IF(COUNTIF($F$4:$F95,J95)<4,$F95,\" \")","v":" "},92,0,"","","",""," ",92]
[93,93,null,{"$f":"IF(C96>0,CONCATENATE((VLOOKUP($C96,Inscription!$A$6:$G$205,3,FALSE)),\"   \",(VLOOKUP($C96,Inscription!$A$6:$G$205,4,FALSE))),\" \")","v":" "},null,{"$f":"IF(C96>0,(VLOOKUP($C96,Inscription!$A$6:$G$205,5,FALSE)),\" \")","v":" "},{"$f":"IF(C96>0,(VLOOKUP($C96,Inscription!$A$6:$G$205,7,FALSE)),\" \")","v":" "},{"$f":"LEFT(IF(C96>0,(VLOOKUP($C96,Inscription!$A$6:$G$205,6,FALSE)),\" \"),8)","v":" "},0,{"$f":"IF(COUNTIF($F$4:$F96,$F96)<2,$F96,\" \")","v":" "},93,0,{"$f":"IF(COUNTIF($F$4:$F96,$F96)<3,$F96,\" \")","v":" "},93,0,"",1000,1000,{"$f":"IF(COUNTIF($F$4:$F96,J96)<4,$F96,\" \")","v":" "},93,0,"","","",""," ",93]
[94,94,null,{"$f":"IF(C97>0,CONCATENATE((VLOOKUP($C97,Inscription!$A$6:$G$205,3,FALSE)),\"   \",(VLOOKUP($C97,Inscription!$A$6:$G$205,4,FALSE))),\" \")","v":" "},null,{"$f":"IF(C97>0,(VLOOKUP($C97,Inscription!$A$6:$G$205,5,FALSE)),\" \")","v":" "},{"$f":"IF(C97>0,(VLOOKUP($C97,Inscription!$A$6:$G$205,7,FALSE)),\" \")","v":" "},{"$f":"LEFT(IF(C97>0,(VLOOKUP($C97,Inscription!$A$6:$G$205,6,FALSE)),\" \"),8)","v":" "},0,{"$f":"IF(COUNTIF($F$4:$F97,$F97)<2,$F97,\" \")","v":" "},94,0,{"$f":"IF(COUNTIF($F$4:$F97,$F97)<3,$F97,\" \")","v":" "},94,0,"",1000,1000,{"$f":"IF(COUNTIF($F$4:$F97,J97)<4,$F97,\" \")","v":" "},94,0,"","","",""," ",94]
[95,95,null,{"$f":"IF(C98>0,CONCATENATE((VLOOKUP($C98,Inscription!$A$6:$G$205,3,FALSE)),\"   \",(VLOOKUP($C98,Inscription!$A$6:$G$205,4,FALSE))),\" \")","v":" "},null,{"$f":"IF(C98>0,(VLOOKUP($C98,Inscription!$A$6:$G$205,5,FALSE)),\" \")","v":" "},{"$f":"IF(C98>0,(VLOOKUP($C98,Inscription!$A$6:$G$205,7,FALSE)),\" \")","v":" "},{"$f":"LEFT(IF(C98>0,(VLOOKUP($C98,Inscription!$A$6:$G$205,6,FALSE)),\" \"),8)","v":" "},0,{"$f":"IF(COUNTIF($F$4:$F98,$F98)<2,$F98,\" \")","v":" "},95,0,{"$f":"IF(COUNTIF($F$4:$F98,$F98)<3,$F98,\" \")","v":" "},95,0,"",1000,1000,{"$f":"IF(COUNTIF($F$4:$F98,J98)<4,$F98,\" \")","v":" "},95,0,"","","",""," ",95]
[96,96,null,{"$f":"IF(C99>0,CONCATENATE((VLOOKUP($C99,Inscription!$A$6:$G$205,3,FALSE)),\"   \",(VLOOKUP($C99,Inscription!$A$6:$G$205,4,FALSE))),\" \")","v":" "},null,{"$f":"IF(C99>0,(VLOOKUP($C99,Inscription!$A$6:$G$205,5,FALSE)),\" \")","v":" "},{"$f":"IF(C99>0,(VLOOKUP($C99,Inscription!$A$6:$G$205,7,FALSE)),\" \")","v":" "},{"$f":"LEFT(IF(C99>0,(VLOOKUP($C99,Inscription!$A$6:$G$205,6,FALSE)),\" \"),8)","v":" "},0,{"$f":"IF(COUNTIF($F$4:$F99,$F99)<2,$F99,\" \")","v":" "},96,0,{"$f":"IF(COUNTIF($F$4:$F99,$F99)<3,$F99,\" \")","v":" "},96,0,"",1000,1000,{"$f":"IF(COUNTIF($F$4:$F99,J99)<4,$F99,\" \")","v":" "},96,0,"","","",""," ",96]
[97,97,null,{"$f":"IF(C100>0,CONCATENATE((VLOOKUP($C100,Inscription!$A$6:$G$205,3,FALSE)),\"   \",(VLOOKUP($C100,Inscription!$A$6:$G$205,4,FALSE))),\" \")","v":" "},null,{"$f":"IF(C100>0,(VLOOKUP($C100,Inscription!$A$6:$G$205,5,FALSE)),\" \")","v":" "},{"$f":"IF(C100>0,(VLOOKUP($C100,Inscription!$A$6:$G$205,7,FALSE)),\" \")","v":" "},{"$f":"LEFT(IF(C100>0,(VLOOKUP($C100,Inscription!$A$6:$G$205,6,FALSE)),\" \"),8)","v":" "},0,{"$f":"IF(COUNTIF($F$4:$F100,$F100)<2,$F100,\" \")","v":" "},97,0,{"$f":"IF(COUNTIF($F$4:$F100,$F100)<3,$F100,\" \")","v":" "},97,0,"",1000,1000,{"$f":"IF(COUNTIF($F$4:$F100,J100)<4,$F100,\" \")","v":" "},97,0,"","","",""," ",97]
[98,98,null,{"$f":"IF(C101>0,CONCATENATE((VLOOKUP($C101,Inscription!$A$6:$G$205,3,FALSE)),\"   \",(VLOOKUP($C101,Inscription!$A$6:$G$205,4,FALSE))),\" \")","v":" "},null,{"$f":"IF(C101>0,(VLOOKUP($C101,Inscription!$A$6:$G$205,5,FALSE)),\" \")","v":" "},{"$f":"IF(C101>0,(VLOOKUP($C101,Inscription!$A$6:$G$205,7,FALSE)),\" \")","v":" "},{"$f":"LEFT(IF(C101>0,(VLOOKUP($C101,Inscription!$A$6:$G$205,6,FALSE)),\" \"),8)","v":" "},0,{"$f":"IF(COUNTIF($F$4:$F101,$F101)<2,$F101,\" \")","v":" "},98,0,{"$f":"IF(COUNTIF($F$4:$F101,$F101)<3,$F101,\" \")","v":" "},98,0,"",1000,1000,{"$f":"IF(COUNTIF($F$4:$F101,J101)<4,$F101,\" \")","v":" "},98,0,"","","",""," ",98]
[99,99,null,{"$f":"IF(C102>0,CONCATENATE((VLOOKUP($C102,Inscription!$A$6:$G$205,3,FALSE)),\"   \",(VLOOKUP($C102,Inscription!$A$6:$G$205,4,FALSE))),\" \")","v":" "},null,{"$f":"IF(C102>0,(VLOOKUP($C102,Inscription!$A$6:$G$205,5,FALSE)),\" \")","v":" "},{"$f":"IF(C102>0,(VLOOKUP($C102,Inscription!$A$6:$G$205,7,FALSE)),\" \")","v":" "},{"$f":"LEFT(IF(C102>0,(VLOOKUP($C102,Inscription!$A$6:$G$205,6,FALSE)),\" \"),8)","v":" "},0,{"$f":"IF(COUNTIF($F$4:$F102,$F102)<2,$F102,\" \")","v":" "},99,0,{"$f":"IF(COUNTIF($F$4:$F102,$F102)<3,$F102,\" \")","v":" "},99,0,"",1000,1000,{"$f":"IF(COUNTIF($F$4:$F102,J102)<4,$F102,\" \")","v":" "},99,0,"","","",""," ",99]
[100,100,null,{"$f":"IF(C103>0,CONCATENATE((VLOOKUP($C103,Inscription!$A$6:$G$205,3,FALSE)),\"   \",(VLOOKUP($C103,Inscription!$A$6:$G$205,4,FALSE))),\" \")","v":" "},null,{"$f":"IF(C103>0,(VLOOKUP($C103,Inscription!$A$6:$G$205,5,FALSE)),\" \")","v":" "},{"$f":"IF(C103>0,(VLOOKUP($C103,Inscription!$A$6:$G$205,7,FALSE)),\" \")","v":" "},{"$f":"LEFT(IF(C103>0,(VLOOKUP($C103,Inscription!$A$6:$G$205,6,FALSE)),\" \"),8)","v":" "},0,{"$f":"IF(COUNTIF($F$4:$F103,$F103)<2,$F103,\" \")","v":" "},100,0,{"$f":"IF(COUNTIF($F$4:$F103,$F103)<3,$F103,\" \")","v":" "},100,0,"",1000,1000,{"$f":"IF(COUNTIF($F$4:$F103,J103)<4,$F103,\" \")","v":" "},100,0,"","","",""," ",100]
[101,101,null,{"$f":"IF(C104>0,CONCATENATE((VLOOKUP($C104,Inscription!$A$6:$G$205,3,FALSE)),\"   \",(VLOOKUP($C104,Inscription!$A$6:$G$205,4,FALSE))),\" \")","v":" "},null,{"$f":"IF(C104>0,(VLOOKUP($C104,Inscription!$A$6:$G$205,5,FALSE)),\" \")","v":" "},{"$f":"IF(C104>0,(VLOOKUP($C104,Inscription!$A$6:$G$205,7,FALSE)),\" \")","v":" "},{"$f":"LEFT(IF(C104>0,(VLOOKUP($C104,Inscription!$A$6:$G$205,6,FALSE)),\" \"),8)","v":" "},0,{"$f":"IF(COUNTIF($F$4:$F104,$F104)<2,$F104,\" \")","v":" "},101,0,{"$f":"IF(COUNTIF($F$4:$F104,$F104)<3,$F104,\" \")","v":" "},101,0,"",1000,1000,{"$f":"IF(COUNTIF($F$4:$F104,J104)<4,$F104,\" \")","v":" "},101,0,"","","",""," ",101]
[102,102,null,{"$f":"IF(C105>0,CONCATENATE((VLOOKUP($C105,Inscription!$A$6:$G$205,3,FALSE)),\"   \",(VLOOKUP($C105,Inscription!$A$6:$G$205,4,FALSE))),\" \")","v":" "},null,{"$f":"IF(C105>0,(VLOOKUP($C105,Inscription!$A$6:$G$205,5,FALSE)),\" \")","v":" "},{"$f":"IF(C105>0,(VLOOKUP($C105,Inscription!$A$6:$G$205,7,FALSE)),\" \")","v":" "},{"$f":"LEFT(IF(C105>0,(VLOOKUP($C105,Inscription!$A$6:$G$205,6,FALSE)),\" \"),8)","v":" "},0,{"$f":"IF(COUNTIF($F$4:$F105,$F105)<2,$F105,\" \")","v":" "},102,0,{"$f":"IF(COUNTIF($F$4:$F105,$F105)<3,$F105,\" \")","v":" "},102,0,"",1000,1000,{"$f":"IF(COUNTIF($F$4:$F105,J105)<4,$F105,\" \")","v":" "},102,0,"","","",""," ",102]
[103,103,null,{"$f":"IF(C106>0,CONCATENATE((VLOOKUP($C106,Inscription!$A$6:$G$205,3,FALSE)),\"   \",(VLOOKUP($C106,Inscription!$A$6:$G$205,4,FALSE))),\" \")","v":" "},null,{"$f":"IF(C106>0,(VLOOKUP($C106,Inscription!$A$6:$G$205,5,FALSE)),\" \")","v":" "},{"$f":"IF(C106>0,(VLOOKUP($C106,Inscription!$A$6:$G$205,7,FALSE)),\" \")","v":" "},{"$f":"LEFT(IF(C106>0,(VLOOKUP($C106,Inscription!$A$6:$G$205,6,FALSE)),\" \"),8)","v":" "},0,{"$f":"IF(COUNTIF($F$4:$F106,$F106)<2,$F106,\" \")","v":" "},103,0,{"$f":"IF(COUNTIF($F$4:$F106,$F106)<3,$F106,\" \")","v":" "},103,0,"",1000,1000,{"$f":"IF(COUNTIF($F$4:$F106,J106)<4,$F106,\" \")","v":" "},103,0,"","","",""," ",103]
[104,104,null,{"$f":"IF(C107>0,CONCATENATE((VLOOKUP($C107,Inscription!$A$6:$G$205,3,FALSE)),\"   \",(VLOOKUP($C107,Inscription!$A$6:$G$205,4,FALSE))),\" \")","v":" "},null,{"$f":"IF(C107>0,(VLOOKUP($C107,Inscription!$A$6:$G$205,5,FALSE)),\" \")","v":" "},{"$f":"IF(C107>0,(VLOOKUP($C107,Inscription!$A$6:$G$205,7,FALSE)),\" \")","v":" "},{"$f":"LEFT(IF(C107>0,(VLOOKUP($C107,Inscription!$A$6:$G$205,6,FALSE)),\" \"),8)","v":" "},0,{"$f":"IF(COUNTIF($F$4:$F107,$F107)<2,$F107,\" \")","v":" "},104,0,{"$f":"IF(COUNTIF($F$4:$F107,$F107)<3,$F107,\" \")","v":" "},104,0,"",1000,1000,{"$f":"IF(COUNTIF($F$4:$F107,J107)<4,$F107,\" \")","v":" "},104,0,"","","",""," ",104]
[105,105,null,{"$f":"IF(C108>0,CONCATENATE((VLOOKUP($C108,Inscription!$A$6:$G$205,3,FALSE)),\"   \",(VLOOKUP($C108,Inscription!$A$6:$G$205,4,FALSE))),\" \")","v":" "},null,{"$f":"IF(C108>0,(VLOOKUP($C108,Inscription!$A$6:$G$205,5,FALSE)),\" \")","v":" "},{"$f":"IF(C108>0,(VLOOKUP($C108,Inscription!$A$6:$G$205,7,FALSE)),\" \")","v":" "},{"$f":"LEFT(IF(C108>0,(VLOOKUP($C108,Inscription!$A$6:$G$205,6,FALSE)),\" \"),8)","v":" "},0,{"$f":"IF(COUNTIF($F$4:$F108,$F108)<2,$F108,\" \")","v":" "},105,0,{"$f":"IF(COUNTIF($F$4:$F108,$F108)<3,$F108,\" \")","v":" "},105,0,"",1000,1000,{"$f":"IF(COUNTIF($F$4:$F108,J108)<4,$F108,\" \")","v":" "},105,0,"","","",""," ",105]
[106,106,null,{"$f":"IF(C109>0,CONCATENATE((VLOOKUP($C109,Inscription!$A$6:$G$205,3,FALSE)),\"   \",(VLOOKUP($C109,Inscription!$A$6:$G$205,4,FALSE))),\" \")","v":" "},null,{"$f":"IF(C109>0,(VLOOKUP($C109,Inscription!$A$6:$G$205,5,FALSE)),\" \")","v":" "},{"$f":"IF(C109>0,(VLOOKUP($C109,Inscription!$A$6:$G$205,7,FALSE)),\" \")","v":" "},{"$f":"LEFT(IF(C109>0,(VLOOKUP($C109,Inscription!$A$6:$G$205,6,FALSE)),\" \"),8)","v":" "},0,{"$f":"IF(COUNTIF($F$4:$F109,$F109)<2,$F109,\" \")","v":" "},106,0,{"$f":"IF(COUNTIF($F$4:$F109,$F109)<3,$F109,\" \")","v":" "},106,0,"",1000,1000,{"$f":"IF(COUNTIF($F$4:$F109,J109)<4,$F109,\" \")","v":" "},106,0,"","","",""," ",106]
[107,107,null,{"$f":"IF(C110>0,CONCATENATE((VLOOKUP($C110,Inscription!$A$6:$G$205,3,FALSE)),\"   \",(VLOOKUP($C110,Inscription!$A$6:$G$205,4,FALSE))),\" \")","v":" "},null,{"$f":"IF(C110>0,(VLOOKUP($C110,Inscription!$A$6:$G$205,5,FALSE)),\" \")","v":" "},{"$f":"IF(C110>0,(VLOOKUP($C110,Inscription!$A$6:$G$205,7,FALSE)),\" \")","v":" "},{"$f":"LEFT(IF(C110>0,(VLOOKUP($C110,Inscription!$A$6:$G$205,6,FALSE)),\" \"),8)","v":" "},0,{"$f":"IF(COUNTIF($F$4:$F110,$F110)<2,$F110,\" \")","v":" "},107,0,{"$f":"IF(COUNTIF($F$4:$F110,$F110)<3,$F110,\" \")","v":" "},107,0,"",1000,1000,{"$f":"IF(COUNTIF($F$4:$F110,J110)<4,$F110,\" \")","v":" "},107,0,"","","",""," ",107]
[108,108,null,{"$f":"IF(C111>0,CONCATENATE((VLOOKUP($C111,Inscription!$A$6:$G$205,3,FALSE)),\"   \",(VLOOKUP($C111,Inscription!$A$6:$G$205,4,FALSE))),\" \")","v":" "},null,{"$f":"IF(C111>0,(VLOOKUP($C111,Inscription!$A$6:$G$205,5,FALSE)),\" \")","v":" "},{"$f":"IF(C111>0,(VLOOKUP($C111,Inscription!$A$6:$G$205,7,FALSE)),\" \")","v":" "},{"$f":"LEFT(IF(C111>0,(VLOOKUP($C111,Inscription!$A$6:$G$205,6,FALSE)),\" \"),8)","v":" "},0,{"$f":"IF(COUNTIF($F$4:$F111,$F111)<2,$F111,\" \")","v":" "},108,0,{"$f":"IF(COUNTIF($F$4:$F111,$F111)<3,$F111,\" \")","v":" "},108,0,"",1000,1000,{"$f":"IF(COUNTIF($F$4:$F111,J111)<4,$F111,\" \")","v":" "},108,0,"","","",""," ",108]
[109,109,null,{"$f":"IF(C112>0,CONCATENATE((VLOOKUP($C112,Inscription!$A$6:$G$205,3,FALSE)),\"   \",(VLOOKUP($C112,Inscription!$A$6:$G$205,4,FALSE))),\" \")","v":" "},null,{"$f":"IF(C112>0,(VLOOKUP($C112,Inscription!$A$6:$G$205,5,FALSE)),\" \")","v":" "},{"$f":"IF(C112>0,(VLOOKUP($C112,Inscription!$A$6:$G$205,7,FALSE)),\" \")","v":" "},{"$f":"LEFT(IF(C112>0,(VLOOKUP($C112,Inscription!$A$6:$G$205,6,FALSE)),\" \"),8)","v":" "},0,{"$f":"IF(COUNTIF($F$4:$F112,$F112)<2,$F112,\" \")","v":" "},109,0,{"$f":"IF(COUNTIF($F$4:$F112,$F112)<3,$F112,\" \")","v":" "},109,0,"",1000,1000,{"$f":"IF(COUNTIF($F$4:$F112,J112)<4,$F112,\" \")","v":" "},109,0,"","","",""," ",109]
[110,110,null,{"$f":"IF(C113>0,CONCATENATE((VLOOKUP($C113,Inscription!$A$6:$G$205,3,FALSE)),\"   \",(VLOOKUP($C113,Inscription!$A$6:$G$205,4,FALSE))),\" \")","v":" "},null,{"$f":"IF(C113>0,(VLOOKUP($C113,Inscription!$A$6:$G$205,5,FALSE)),\" \")","v":" "},{"$f":"IF(C113>0,(VLOOKUP($C113,Inscription!$A$6:$G$205,7,FALSE)),\" \")","v":" "},{"$f":"LEFT(IF(C113>0,(VLOOKUP($C113,Inscription!$A$6:$G$205,6,FALSE)),\" \"),8)","v":" "},0,{"$f":"IF(COUNTIF($F$4:$F113,$F113)<2,$F113,\" \")","v":" "},110,0,{"$f":"IF(COUNTIF($F$4:$F113,$F113)<3,$F113,\" \")","v":" "},110,0,"",1000,1000,{"$f":"IF(COUNTIF($F$4:$F113,J113)<4,$F113,\" \")","v":" "},110,0,"","","",""," ",110]
[111,111,null,{"$f":"IF(C114>0,CONCATENATE((VLOOKUP($C114,Inscription!$A$6:$G$205,3,FALSE)),\"   \",(VLOOKUP($C114,Inscription!$A$6:$G$205,4,FALSE))),\" \")","v":" "},null,{"$f":"IF(C114>0,(VLOOKUP($C114,Inscription!$A$6:$G$205,5,FALSE)),\" \")","v":" "},{"$f":"IF(C114>0,(VLOOKUP($C114,Inscription!$A$6:$G$205,7,FALSE)),\" \")","v":" "},{"$f":"LEFT(IF(C114>0,(VLOOKUP($C114,Inscription!$A$6:$G$205,6,FALSE)),\" \"),8)","v":" "},0,{"$f":"IF(COUNTIF($F$4:$F114,$F114)<2,$F114,\" \")","v":" "},111,0,{"$f":"IF(COUNTIF($F$4:$F114,$F114)<3,$F114,\" \")","v":" "},111,0,"",1000,1000,{"$f":"IF(COUNTIF($F$4:$F114,J114)<4,$F114,\" \")","v":" "},111,0,"","","",""," ",111]
[112,112,null,{"$f":"IF(C115>0,CONCATENATE((VLOOKUP($C115,Inscription!$A$6:$G$205,3,FALSE)),\"   \",(VLOOKUP($C115,Inscription!$A$6:$G$205,4,FALSE))),\" \")","v":" "},null,{"$f":"IF(C115>0,(VLOOKUP($C115,Inscription!$A$6:$G$205,5,FALSE)),\" \")","v":" "},{"$f":"IF(C115>0,(VLOOKUP($C115,Inscription!$A$6:$G$205,7,FALSE)),\" \")","v":" "},{"$f":"LEFT(IF(C115>0,(VLOOKUP($C115,Inscription!$A$6:$G$205,6,FALSE)),\" \"),8)","v":" "},0,{"$f":"IF(COUNTIF($F$4:$F115,$F115)<2,$F115,\" \")","v":" "},112,0,{"$f":"IF(COUNTIF($F$4:$F115,$F115)<3,$F115,\" \")","v":" "},112,0,"",1000,1000,{"$f":"IF(COUNTIF($F$4:$F115,J115)<4,$F115,\" \")","v":" "},112,0,"","","",""," ",112]
[113,113,null,{"$f":"IF(C116>0,CONCATENATE((VLOOKUP($C116,Inscription!$A$6:$G$205,3,FALSE)),\"   \",(VLOOKUP($C116,Inscription!$A$6:$G$205,4,FALSE))),\" \")","v":" "},null,{"$f":"IF(C116>0,(VLOOKUP($C116,Inscription!$A$6:$G$205,5,FALSE)),\" \")","v":" "},{"$f":"IF(C116>0,(VLOOKUP($C116,Inscription!$A$6:$G$205,7,FALSE)),\" \")","v":" "},{"$f":"LEFT(IF(C116>0,(VLOOKUP($C116,Inscription!$A$6:$G$205,6,FALSE)),\" \"),8)","v":" "},0,{"$f":"IF(COUNTIF($F$4:$F116,$F116)<2,$F116,\" \")","v":" "},113,0,{"$f":"IF(COUNTIF($F$4:$F116,$F116)<3,$F116,\" \")","v":" "},113,0,"",1000,1000,{"$f":"IF(COUNTIF($F$4:$F116,J116)<4,$F116,\" \")","v":" "},113,0,"","","",""," ",113]
[114,114,null,{"$f":"IF(C117>0,CONCATENATE((VLOOKUP($C117,Inscription!$A$6:$G$205,3,FALSE)),\"   \",(VLOOKUP($C117,Inscription!$A$6:$G$205,4,FALSE))),\" \")","v":" "},null,{"$f":"IF(C117>0,(VLOOKUP($C117,Inscription!$A$6:$G$205,5,FALSE)),\" \")","v":" "},{"$f":"IF(C117>0,(VLOOKUP($C117,Inscription!$A$6:$G$205,7,FALSE)),\" \")","v":" "},{"$f":"LEFT(IF(C117>0,(VLOOKUP($C117,Inscription!$A$6:$G$205,6,FALSE)),\" \"),8)","v":" "},0,{"$f":"IF(COUNTIF($F$4:$F117,$F117)<2,$F117,\" \")","v":" "},114,0,{"$f":"IF(COUNTIF($F$4:$F117,$F117)<3,$F117,\" \")","v":" "},114,0,"",1000,1000,{"$f":"IF(COUNTIF($F$4:$F117,J117)<4,$F117,\" \")","v":" "},114,0,"","","",""," ",114]
[115,115,null,{"$f":"IF(C118>0,CONCATENATE((VLOOKUP($C118,Inscription!$A$6:$G$205,3,FALSE)),\"   \",(VLOOKUP($C118,Inscription!$A$6:$G$205,4,FALSE))),\" \")","v":" "},null,{"$f":"IF(C118>0,(VLOOKUP($C118,Inscription!$A$6:$G$205,5,FALSE)),\" \")","v":" "},{"$f":"IF(C118>0,(VLOOKUP($C118,Inscription!$A$6:$G$205,7,FALSE)),\" \")","v":" "},{"$f":"LEFT(IF(C118>0,(VLOOKUP($C118,Inscription!$A$6:$G$205,6,FALSE)),\" \"),8)","v":" "},0,{"$f":"IF(COUNTIF($F$4:$F118,$F118)<2,$F118,\" \")","v":" "},115,0,{"$f":"IF(COUNTIF($F$4:$F118,$F118)<3,$F118,\" \")","v":" "},115,0,"",1000,1000,{"$f":"IF(COUNTIF($F$4:$F118,J118)<4,$F118,\" \")","v":" "},115,0,"","","",""," ",115]
[116,116,null,{"$f":"IF(C119>0,CONCATENATE((VLOOKUP($C119,Inscription!$A$6:$G$205,3,FALSE)),\"   \",(VLOOKUP($C119,Inscription!$A$6:$G$205,4,FALSE))),\" \")","v":" "},null,{"$f":"IF(C119>0,(VLOOKUP($C119,Inscription!$A$6:$G$205,5,FALSE)),\" \")","v":" "},{"$f":"IF(C119>0,(VLOOKUP($C119,Inscription!$A$6:$G$205,7,FALSE)),\" \")","v":" "},{"$f":"LEFT(IF(C119>0,(VLOOKUP($C119,Inscription!$A$6:$G$205,6,FALSE)),\" \"),8)","v":" "},0,{"$f":"IF(COUNTIF($F$4:$F119,$F119)<2,$F119,\" \")","v":" "},116,0,{"$f":"IF(COUNTIF($F$4:$F119,$F119)<3,$F119,\" \")","v":" "},116,0,"",1000,1000,{"$f":"IF(COUNTIF($F$4:$F119,J119)<4,$F119,\" \")","v":" "},116,0,"","","",""," ",116]
[117,117,null,{"$f":"IF(C120>0,CONCATENATE((VLOOKUP($C120,Inscription!$A$6:$G$205,3,FALSE)),\"   \",(VLOOKUP($C120,Inscription!$A$6:$G$205,4,FALSE))),\" \")","v":" "},null,{"$f":"IF(C120>0,(VLOOKUP($C120,Inscription!$A$6:$G$205,5,FALSE)),\" \")","v":" "},{"$f":"IF(C120>0,(VLOOKUP($C120,Inscription!$A$6:$G$205,7,FALSE)),\" \")","v":" "},{"$f":"LEFT(IF(C120>0,(VLOOKUP($C120,Inscription!$A$6:$G$205,6,FALSE)),\" \"),8)","v":" "},0,{"$f":"IF(COUNTIF($F$4:$F120,$F120)<2,$F120,\" \")","v":" "},117,0,{"$f":"IF(COUNTIF($F$4:$F120,$F120)<3,$F120,\" \")","v":" "},117,0,"",1000,1000,{"$f":"IF(COUNTIF($F$4:$F120,J120)<4,$F120,\" \")","v":" "},117,0,"","","",""," ",117]
[118,118,null,{"$f":"IF(C121>0,CONCATENATE((VLOOKUP($C121,Inscription!$A$6:$G$205,3,FALSE)),\"   \",(VLOOKUP($C121,Inscription!$A$6:$G$205,4,FALSE))),\" \")","v":" "},null,{"$f":"IF(C121>0,(VLOOKUP($C121,Inscription!$A$6:$G$205,5,FALSE)),\" \")","v":" "},{"$f":"IF(C121>0,(VLOOKUP($C121,Inscription!$A$6:$G$205,7,FALSE)),\" \")","v":" "},{"$f":"LEFT(IF(C121>0,(VLOOKUP($C121,Inscription!$A$6:$G$205,6,FALSE)),\" \"),8)","v":" "},0,{"$f":"IF(COUNTIF($F$4:$F121,$F121)<2,$F121,\" \")","v":" "},118,0,{"$f":"IF(COUNTIF($F$4:$F121,$F121)<3,$F121,\" \")","v":" "},118,0,"",1000,1000,{"$f":"IF(COUNTIF($F$4:$F121,J121)<4,$F121,\" \")","v":" "},118,0,"","","",""," ",118]
[119,119,null,{"$f":"IF(C122>0,CONCATENATE((VLOOKUP($C122,Inscription!$A$6:$G$205,3,FALSE)),\"   \",(VLOOKUP($C122,Inscription!$A$6:$G$205,4,FALSE))),\" \")","v":" "},null,{"$f":"IF(C122>0,(VLOOKUP($C122,Inscription!$A$6:$G$205,5,FALSE)),\" \")","v":" "},{"$f":"IF(C122>0,(VLOOKUP($C122,Inscription!$A$6:$G$205,7,FALSE)),\" \")","v":" "},{"$f":"LEFT(IF(C122>0,(VLOOKUP($C122,Inscription!$A$6:$G$205,6,FALSE)),\" \"),8)","v":" "},0,{"$f":"IF(COUNTIF($F$4:$F122,$F122)<2,$F122,\" \")","v":" "},119,0,{"$f":"IF(COUNTIF($F$4:$F122,$F122)<3,$F122,\" \")","v":" "},119,0,"",1000,1000,{"$f":"IF(COUNTIF($F$4:$F122,J122)<4,$F122,\" \")","v":" "},119,0,"","","",""," ",119]
[120,120,null,{"$f":"IF(C123>0,CONCATENATE((VLOOKUP($C123,Inscription!$A$6:$G$205,3,FALSE)),\"   \",(VLOOKUP($C123,Inscription!$A$6:$G$205,4,FALSE))),\" \")","v":" "},null,{"$f":"IF(C123>0,(VLOOKUP($C123,Inscription!$A$6:$G$205,5,FALSE)),\" \")","v":" "},{"$f":"IF(C123>0,(VLOOKUP($C123,Inscription!$A$6:$G$205,7,FALSE)),\" \")","v":" "},{"$f":"LEFT(IF(C123>0,(VLOOKUP($C123,Inscription!$A$6:$G$205,6,FALSE)),\" \"),8)","v":" "},0,{"$f":"IF(COUNTIF($F$4:$F123,$F123)<2,$F123,\" \")","v":" "},120,0,{"$f":"IF(COUNTIF($F$4:$F123,$F123)<3,$F123,\" \")","v":" "},120,0,"",1000,1000,{"$f":"IF(COUNTIF($F$4:$F123,J123)<4,$F123,\" \")","v":" "},120,0,"","","",""," ",120]
[121,121,null,{"$f":"IF(C124>0,CONCATENATE((VLOOKUP($C124,Inscription!$A$6:$G$205,3,FALSE)),\"   \",(VLOOKUP($C124,Inscription!$A$6:$G$205,4,FALSE))),\" \")","v":" "},null,{"$f":"IF(C124>0,(VLOOKUP($C124,Inscription!$A$6:$G$205,5,FALSE)),\" \")","v":" "},{"$f":"IF(C124>0,(VLOOKUP($C124,Inscription!$A$6:$G$205,7,FALSE)),\" \")","v":" "},{"$f":"LEFT(IF(C124>0,(VLOOKUP($C124,Inscription!$A$6:$G$205,6,FALSE)),\" \"),8)","v":" "},0,{"$f":"IF(COUNTIF($F$4:$F124,$F124)<2,$F124,\" \")","v":" "},121,0,{"$f":"IF(COUNTIF($F$4:$F124,$F124)<3,$F124,\" \")","v":" "},121,0,"",1000,1000,{"$f":"IF(COUNTIF($F$4:$F124,J124)<4,$F124,\" \")","v":" "},121,0,"","","",""," ",121]
[122,122,null,{"$f":"IF(C125>0,CONCATENATE((VLOOKUP($C125,Inscription!$A$6:$G$205,3,FALSE)),\"   \",(VLOOKUP($C125,Inscription!$A$6:$G$205,4,FALSE))),\" \")","v":" "},null,{"$f":"IF(C125>0,(VLOOKUP($C125,Inscription!$A$6:$G$205,5,FALSE)),\" \")","v":" "},{"$f":"IF(C125>0,(VLOOKUP($C125,Inscription!$A$6:$G$205,7,FALSE)),\" \")","v":" "},{"$f":"LEFT(IF(C125>0,(VLOOKUP($C125,Inscription!$A$6:$G$205,6,FALSE)),\" \"),8)","v":" "},0,{"$f":"IF(COUNTIF($F$4:$F125,$F125)<2,$F125,\" \")","v":" "},122,0,{"$f":"IF(COUNTIF($F$4:$F125,$F125)<3,$F125,\" \")","v":" "},122,0,"",1000,1000,{"$f":"IF(COUNTIF($F$4:$F125,J125)<4,$F125,\" \")","v":" "},122,0,"","","",""," ",122]
[123,123,null,{"$f":"IF(C126>0,CONCATENATE((VLOOKUP($C126,Inscription!$A$6:$G$205,3,FALSE)),\"   \",(VLOOKUP($C126,Inscription!$A$6:$G$205,4,FALSE))),\" \")","v":" "},null,{"$f":"IF(C126>0,(VLOOKUP($C126,Inscription!$A$6:$G$205,5,FALSE)),\" \")","v":" "},{"$f":"IF(C126>0,(VLOOKUP($C126,Inscription!$A$6:$G$205,7,FALSE)),\" \")","v":" "},{"$f":"LEFT(IF(C126>0,(VLOOKUP($C126,Inscription!$A$6:$G$205,6,FALSE)),\" \"),8)","v":" "},0,{"$f":"IF(COUNTIF($F$4:$F126,$F126)<2,$F126,\" \")","v":" "},123,0,{"$f":"IF(COUNTIF($F$4:$F126,$F126)<3,$F126,\" \")","v":" "},123,0,"",1000,1000,{"$f":"IF(COUNTIF($F$4:$F126,J126)<4,$F126,\" \")","v":" "},123,0,"","","",""," ",123]
[124,124,null,{"$f":"IF(C127>0,CONCATENATE((VLOOKUP($C127,Inscription!$A$6:$G$205,3,FALSE)),\"   \",(VLOOKUP($C127,Inscription!$A$6:$G$205,4,FALSE))),\" \")","v":" "},null,{"$f":"IF(C127>0,(VLOOKUP($C127,Inscription!$A$6:$G$205,5,FALSE)),\" \")","v":" "},{"$f":"IF(C127>0,(VLOOKUP($C127,Inscription!$A$6:$G$205,7,FALSE)),\" \")","v":" "},{"$f":"LEFT(IF(C127>0,(VLOOKUP($C127,Inscription!$A$6:$G$205,6,FALSE)),\" \"),8)","v":" "},0,{"$f":"IF(COUNTIF($F$4:$F127,$F127)<2,$F127,\" \")","v":" "},124,0,{"$f":"IF(COUNTIF($F$4:$F127,$F127)<3,$F127,\" \")","v":" "},124,0,"",1000,1000,{"$f":"IF(COUNTIF($F$4:$F127,J127)<4,$F127,\" \")","v":" "},124,0,"","","",""," ",124]
[125,125,null,{"$f":"IF(C128>0,CONCATENATE((VLOOKUP($C128,Inscription!$A$6:$G$205,3,FALSE)),\"   \",(VLOOKUP($C128,Inscription!$A$6:$G$205,4,FALSE))),\" \")","v":" "},null,{"$f":"IF(C128>0,(VLOOKUP($C128,Inscription!$A$6:$G$205,5,FALSE)),\" \")","v":" "},{"$f":"IF(C128>0,(VLOOKUP($C128,Inscription!$A$6:$G$205,7,FALSE)),\" \")","v":" "},{"$f":"LEFT(IF(C128>0,(VLOOKUP($C128,Inscription!$A$6:$G$205,6,FALSE)),\" \"),8)","v":" "},0,{"$f":"IF(COUNTIF($F$4:$F128,$F128)<2,$F128,\" \")","v":" "},125,0,{"$f":"IF(COUNTIF($F$4:$F128,$F128)<3,$F128,\" \")","v":" "},125,0,"",1000,1000,{"$f":"IF(COUNTIF($F$4:$F128,J128)<4,$F128,\" \")","v":" "},125,0,"","","",""," ",125]
[126,126,null,{"$f":"IF(C129>0,CONCATENATE((VLOOKUP($C129,Inscription!$A$6:$G$205,3,FALSE)),\"   \",(VLOOKUP($C129,Inscription!$A$6:$G$205,4,FALSE))),\" \")","v":" "},null,{"$f":"IF(C129>0,(VLOOKUP($C129,Inscription!$A$6:$G$205,5,FALSE)),\" \")","v":" "},{"$f":"IF(C129>0,(VLOOKUP($C129,Inscription!$A$6:$G$205,7,FALSE)),\" \")","v":" "},{"$f":"LEFT(IF(C129>0,(VLOOKUP($C129,Inscription!$A$6:$G$205,6,FALSE)),\" \"),8)","v":" "},0,{"$f":"IF(COUNTIF($F$4:$F129,$F129)<2,$F129,\" \")","v":" "},126,0,{"$f":"IF(COUNTIF($F$4:$F129,$F129)<3,$F129,\" \")","v":" "},126,0,"",1000,1000,{"$f":"IF(COUNTIF($F$4:$F129,J129)<4,$F129,\" \")","v":" "},126,0,"","","",""," ",126]
[127,127,null,{"$f":"IF(C130>0,CONCATENATE((VLOOKUP($C130,Inscription!$A$6:$G$205,3,FALSE)),\"   \",(VLOOKUP($C130,Inscription!$A$6:$G$205,4,FALSE))),\" \")","v":" "},null,{"$f":"IF(C130>0,(VLOOKUP($C130,Inscription!$A$6:$G$205,5,FALSE)),\" \")","v":" "},{"$f":"IF(C130>0,(VLOOKUP($C130,Inscription!$A$6:$G$205,7,FALSE)),\" \")","v":" "},{"$f":"LEFT(IF(C130>0,(VLOOKUP($C130,Inscription!$A$6:$G$205,6,FALSE)),\" \"),8)","v":" "},0,{"$f":"IF(COUNTIF($F$4:$F130,$F130)<2,$F130,\" \")","v":" "},127,0,{"$f":"IF(COUNTIF($F$4:$F130,$F130)<3,$F130,\" \")","v":" "},127,0,"",1000,1000,{"$f":"IF(COUNTIF($F$4:$F130,J130)<4,$F130,\" \")","v":" "},127,0,"","","",""," ",127]
[128,128,null,{"$f":"IF(C131>0,CONCATENATE((VLOOKUP($C131,Inscription!$A$6:$G$205,3,FALSE)),\"   \",(VLOOKUP($C131,Inscription!$A$6:$G$205,4,FALSE))),\" \")","v":" "},null,{"$f":"IF(C131>0,(VLOOKUP($C131,Inscription!$A$6:$G$205,5,FALSE)),\" \")","v":" "},{"$f":"IF(C131>0,(VLOOKUP($C131,Inscription!$A$6:$G$205,7,FALSE)),\" \")","v":" "},{"$f":"LEFT(IF(C131>0,(VLOOKUP($C131,Inscription!$A$6:$G$205,6,FALSE)),\" \"),8)","v":" "},0,{"$f":"IF(COUNTIF($F$4:$F131,$F131)<2,$F131,\" \")","v":" "},128,0,{"$f":"IF(COUNTIF($F$4:$F131,$F131)<3,$F131,\" \")","v":" "},128,0,"",1000,1000,{"$f":"IF(COUNTIF($F$4:$F131,J131)<4,$F131,\" \")","v":" "},128,0,"","","",""," ",128]
[{"$f":"IF(B132<1,1000,(IF(AA132=B132,B132,(20100-SUM($AA$4:$AA$203))/(COUNTIF($AA$4:$AA$203,\"T\")))))","v":129},129,null,{"$f":"IF(C132>0,CONCATENATE((VLOOKUP($C132,Inscription!$A$6:$G$205,3,FALSE)),\"   \",(VLOOKUP($C132,Inscription!$A$6:$G$205,4,FALSE))),\" \")","v":" "},null,{"$f":"IF(C132>0,(VLOOKUP($C132,Inscription!$A$6:$G$205,5,FALSE)),\" \")","v":" "},{"$f":"IF(C132>0,(VLOOKUP($C132,Inscription!$A$6:$G$205,7,FALSE)),\" \")","v":" "},{"$f":"LEFT(IF(C132>0,(VLOOKUP($C132,Inscription!$A$6:$G$205,6,FALSE)),\" \"),8)","v":" "},0,{"$f":"IF(COUNTIF($F$4:$F132,$F132)<2,$F132,\" \")","v":" "},129,0,{"$f":"IF(COUNTIF($F$4:$F132,$F132)<3,$F132,\" \")","v":" "},129,0,"",1000,1000,{"$f":"IF(COUNTIF($F$4:$F132,J132)<4,$F132,\" \")","v":" "},129,0,"","","",""," ",129]
[130,130,null,{"$f":"IF(C133>0,CONCATENATE((VLOOKUP($C133,Inscription!$A$6:$G$205,3,FALSE)),\"   \",(VLOOKUP($C133,Inscription!$A$6:$G$205,4,FALSE))),\" \")","v":" "},null,{"$f":"IF(C133>0,(VLOOKUP($C133,Inscription!$A$6:$G$205,5,FALSE)),\" \")","v":" "},{"$f":"IF(C133>0,(VLOOKUP($C133,Inscription!$A$6:$G$205,7,FALSE)),\" \")","v":" "},{"$f":"LEFT(IF(C133>0,(VLOOKUP($C133,Inscription!$A$6:$G$205,6,FALSE)),\" \"),8)","v":" "},0,{"$f":"IF(COUNTIF($F$4:$F133,$F133)<2,$F133,\" \")","v":" "},{"$f":"IF(J133=F133,A133,\"\")","v":130},{"$f":"IF(J133=F133,I133,\"\")","v":0},{"$f":"IF(COUNTIF($F$4:$F133,$F133)<3,$F133,\" \")","v":" "},{"$f":"IF(M133=$F133,$A133,\"\")","v":130},{"$f":"IF(M133=$F133,$I133,\"\")","v":0},{"$f":"IF(M133=J133,\"\",M133)","v":""},{"$f":"IF(P133=$F133,$A133,1000)","v":1000},{"$f":"IF(P133=$F133,$I133,1000)","v":1000},{"$f":"IF(COUNTIF($F$4:$F133,J133)<4,$F133,\" \")","v":" "},{"$f":"IF(S133=$F133,$A133,\"\")","v":130},{"$f":"IF(S133=$F133,$I133,\"\")","v":0},{"$f":"IF(S133=J133,\"\",S133)","v":""},{"$f":"IF(V133=P133,\"\",S133)","v":""},{"$f":"IF(W133=$F133,$A133,\"\")","v":""},{"$f":"IF(W133=$F133,$I133,\"\")","v":""}," ",130]
[131,131,null,{"$f":"IF(C134>0,CONCATENATE((VLOOKUP($C134,Inscription!$A$6:$G$205,3,FALSE)),\"   \",(VLOOKUP($C134,Inscription!$A$6:$G$205,4,FALSE))),\" \")","v":" "},null,{"$f":"IF(C134>0,(VLOOKUP($C134,Inscription!$A$6:$G$205,5,FALSE)),\" \")","v":" "},{"$f":"IF(C134>0,(VLOOKUP($C134,Inscription!$A$6:$G$205,7,FALSE)),\" \")","v":" "},{"$f":"LEFT(IF(C134>0,(VLOOKUP($C134,Inscription!$A$6:$G$205,6,FALSE)),\" \"),8)","v":" "},{"$f":"I133","v":0},{"$f":"IF(COUNTIF($F$4:$F134,$F134)<2,$F134,\" \")","v":" "},131,0,{"$f":"IF(COUNTIF($F$4:$F134,$F134)<3,$F134,\" \")","v":" "},131,0,"",1000,1000,{"$f":"IF(COUNTIF($F$4:$F134,J134)<4,$F134,\" \")","v":" "},131,0,"","","",""," ",131]
[132,132,null,{"$f":"IF(C135>0,CONCATENATE((VLOOKUP($C135,Inscription!$A$6:$G$205,3,FALSE)),\"   \",(VLOOKUP($C135,Inscription!$A$6:$G$205,4,FALSE))),\" \")","v":" "},null,{"$f":"IF(C135>0,(VLOOKUP($C135,Inscription!$A$6:$G$205,5,FALSE)),\" \")","v":" "},{"$f":"IF(C135>0,(VLOOKUP($C135,Inscription!$A$6:$G$205,7,FALSE)),\" \")","v":" "},{"$f":"LEFT(IF(C135>0,(VLOOKUP($C135,Inscription!$A$6:$G$205,6,FALSE)),\" \"),8)","v":" "},0,{"$f":"IF(COUNTIF($F$4:$F135,$F135)<2,$F135,\" \")","v":" "},132,0,{"$f":"IF(COUNTIF($F$4:$F135,$F135)<3,$F135,\" \")","v":" "},132,0,"",1000,1000,{"$f":"IF(COUNTIF($F$4:$F135,J135)<4,$F135,\" \")","v":" "},132,0,"","","",""," ",132]
[133,133,null,{"$f":"IF(C136>0,CONCATENATE((VLOOKUP($C136,Inscription!$A$6:$G$205,3,FALSE)),\"   \",(VLOOKUP($C136,Inscription!$A$6:$G$205,4,FALSE))),\" \")","v":" "},null,{"$f":"IF(C136>0,(VLOOKUP($C136,Inscription!$A$6:$G$205,5,FALSE)),\" \")","v":" "},{"$f":"IF(C136>0,(VLOOKUP($C136,Inscription!$A$6:$G$205,7,FALSE)),\" \")","v":" "},{"$f":"LEFT(IF(C136>0,(VLOOKUP($C136,Inscription!$A$6:$G$205,6,FALSE)),\" \"),8)","v":" "},0,{"$f":"IF(COUNTIF($F$4:$F136,$F136)<2,$F136,\" \")","v":" "},133,0,{"$f":"IF(COUNTIF($F$4:$F136,$F136)<3,$F136,\" \")","v":" "},133,0,"",1000,1000,{"$f":"IF(COUNTIF($F$4:$F136,J136)<4,$F136,\" \")","v":" "},133,0,"","","",""," ",133]
[134,134,null,{"$f":"IF(C137>0,CONCATENATE((VLOOKUP($C137,Inscription!$A$6:$G$205,3,FALSE)),\"   \",(VLOOKUP($C137,Inscription!$A$6:$G$205,4,FALSE))),\" \")","v":" "},null,{"$f":"IF(C137>0,(VLOOKUP($C137,Inscription!$A$6:$G$205,5,FALSE)),\" \")","v":" "},{"$f":"IF(C137>0,(VLOOKUP($C137,Inscription!$A$6:$G$205,7,FALSE)),\" \")","v":" "},{"$f":"LEFT(IF(C137>0,(VLOOKUP($C137,Inscription!$A$6:$G$205,6,FALSE)),\" \"),8)","v":" "},0,{"$f":"IF(COUNTIF($F$4:$F137,$F137)<2,$F137,\" \")","v":" "},134,0,{"$f":"IF(COUNTIF($F$4:$F137,$F137)<3,$F137,\" \")","v":" "},134,0,"",1000,1000,{"$f":"IF(COUNTIF($F$4:$F137,J137)<4,$F137,\" \")","v":" "},134,0,"","","",""," ",134]
[135,135,null,{"$f":"IF(C138>0,CONCATENATE((VLOOKUP($C138,Inscription!$A$6:$G$205,3,FALSE)),\"   \",(VLOOKUP($C138,Inscription!$A$6:$G$205,4,FALSE))),\" \")","v":" "},null,{"$f":"IF(C138>0,(VLOOKUP($C138,Inscription!$A$6:$G$205,5,FALSE)),\" \")","v":" "},{"$f":"IF(C138>0,(VLOOKUP($C138,Inscription!$A$6:$G$205,7,FALSE)),\" \")","v":" "},{"$f":"LEFT(IF(C138>0,(VLOOKUP($C138,Inscription!$A$6:$G$205,6,FALSE)),\" \"),8)","v":" "},0,{"$f":"IF(COUNTIF($F$4:$F138,$F138)<2,$F138,\" \")","v":" "},135,0,{"$f":"IF(COUNTIF($F$4:$F138,$F138)<3,$F138,\" \")","v":" "},135,0,"",1000,1000,{"$f":"IF(COUNTIF($F$4:$F138,J138)<4,$F138,\" \")","v":" "},135,0,"","","",""," ",135]
[136,136,null,{"$f":"IF(C139>0,CONCATENATE((VLOOKUP($C139,Inscription!$A$6:$G$205,3,FALSE)),\"   \",(VLOOKUP($C139,Inscription!$A$6:$G$205,4,FALSE))),\" \")","v":" "},null,{"$f":"IF(C139>0,(VLOOKUP($C139,Inscription!$A$6:$G$205,5,FALSE)),\" \")","v":" "},{"$f":"IF(C139>0,(VLOOKUP($C139,Inscription!$A$6:$G$205,7,FALSE)),\" \")","v":" "},{"$f":"LEFT(IF(C139>0,(VLOOKUP($C139,Inscription!$A$6:$G$205,6,FALSE)),\" \"),8)","v":" "},0,{"$f":"IF(COUNTIF($F$4:$F139,$F139)<2,$F139,\" \")","v":" "},136,0,{"$f":"IF(COUNTIF($F$4:$F139,$F139)<3,$F139,\" \")","v":" "},136,0,"",1000,1000,{"$f":"IF(COUNTIF($F$4:$F139,J139)<4,$F139,\" \")","v":" "},136,0,"","","",""," ",136]
[137,137,null,{"$f":"IF(C140>0,CONCATENATE((VLOOKUP($C140,Inscription!$A$6:$G$205,3,FALSE)),\"   \",(VLOOKUP($C140,Inscription!$A$6:$G$205,4,FALSE))),\" \")","v":" "},null,{"$f":"IF(C140>0,(VLOOKUP($C140,Inscription!$A$6:$G$205,5,FALSE)),\" \")","v":" "},{"$f":"IF(C140>0,(VLOOKUP($C140,Inscription!$A$6:$G$205,7,FALSE)),\" \")","v":" "},{"$f":"LEFT(IF(C140>0,(VLOOKUP($C140,Inscription!$A$6:$G$205,6,FALSE)),\" \"),8)","v":" "},0,{"$f":"IF(COUNTIF($F$4:$F140,$F140)<2,$F140,\" \")","v":" "},137,0,{"$f":"IF(COUNTIF($F$4:$F140,$F140)<3,$F140,\" \")","v":" "},137,0,"",1000,1000,{"$f":"IF(COUNTIF($F$4:$F140,J140)<4,$F140,\" \")","v":" "},137,0,"","","",""," ",137]
[138,138,null,{"$f":"IF(C141>0,CONCATENATE((VLOOKUP($C141,Inscription!$A$6:$G$205,3,FALSE)),\"   \",(VLOOKUP($C141,Inscription!$A$6:$G$205,4,FALSE))),\" \")","v":" "},null,{"$f":"IF(C141>0,(VLOOKUP($C141,Inscription!$A$6:$G$205,5,FALSE)),\" \")","v":" "},{"$f":"IF(C141>0,(VLOOKUP($C141,Inscription!$A$6:$G$205,7,FALSE)),\" \")","v":" "},{"$f":"LEFT(IF(C141>0,(VLOOKUP($C141,Inscription!$A$6:$G$205,6,FALSE)),\" \"),8)","v":" "},0,{"$f":"IF(COUNTIF($F$4:$F141,$F141)<2,$F141,\" \")","v":" "},138,0,{"$f":"IF(COUNTIF($F$4:$F141,$F141)<3,$F141,\" \")","v":" "},138,0,"",1000,1000,{"$f":"IF(COUNTIF($F$4:$F141,J141)<4,$F141,\" \")","v":" "},138,0,"","","",""," ",138]
[139,139,null,{"$f":"IF(C142>0,CONCATENATE((VLOOKUP($C142,Inscription!$A$6:$G$205,3,FALSE)),\"   \",(VLOOKUP($C142,Inscription!$A$6:$G$205,4,FALSE))),\" \")","v":" "},null,{"$f":"IF(C142>0,(VLOOKUP($C142,Inscription!$A$6:$G$205,5,FALSE)),\" \")","v":" "},{"$f":"IF(C142>0,(VLOOKUP($C142,Inscription!$A$6:$G$205,7,FALSE)),\" \")","v":" "},{"$f":"LEFT(IF(C142>0,(VLOOKUP($C142,Inscription!$A$6:$G$205,6,FALSE)),\" \"),8)","v":" "},0,{"$f":"IF(COUNTIF($F$4:$F142,$F142)<2,$F142,\" \")","v":" "},139,0,{"$f":"IF(COUNTIF($F$4:$F142,$F142)<3,$F142,\" \")","v":" "},139,0,"",1000,1000,{"$f":"IF(COUNTIF($F$4:$F142,J142)<4,$F142,\" \")","v":" "},139,0,"","","",""," ",139]
[140,140,null,{"$f":"IF(C143>0,CONCATENATE((VLOOKUP($C143,Inscription!$A$6:$G$205,3,FALSE)),\"   \",(VLOOKUP($C143,Inscription!$A$6:$G$205,4,FALSE))),\" \")","v":" "},null,{"$f":"IF(C143>0,(VLOOKUP($C143,Inscription!$A$6:$G$205,5,FALSE)),\" \")","v":" "},{"$f":"IF(C143>0,(VLOOKUP($C143,Inscription!$A$6:$G$205,7,FALSE)),\" \")","v":" "},{"$f":"LEFT(IF(C143>0,(VLOOKUP($C143,Inscription!$A$6:$G$205,6,FALSE)),\" \"),8)","v":" "},0,{"$f":"IF(COUNTIF($F$4:$F143,$F143)<2,$F143,\" \")","v":" "},140,0,{"$f":"IF(COUNTIF($F$4:$F143,$F143)<3,$F143,\" \")","v":" "},140,0,"",1000,1000,{"$f":"IF(COUNTIF($F$4:$F143,J143)<4,$F143,\" \")","v":" "},140,0,"","","",""," ",140]
[141,141,null,{"$f":"IF(C144>0,CONCATENATE((VLOOKUP($C144,Inscription!$A$6:$G$205,3,FALSE)),\"   \",(VLOOKUP($C144,Inscription!$A$6:$G$205,4,FALSE))),\" \")","v":" "},null,{"$f":"IF(C144>0,(VLOOKUP($C144,Inscription!$A$6:$G$205,5,FALSE)),\" \")","v":" "},{"$f":"IF(C144>0,(VLOOKUP($C144,Inscription!$A$6:$G$205,7,FALSE)),\" \")","v":" "},{"$f":"LEFT(IF(C144>0,(VLOOKUP($C144,Inscription!$A$6:$G$205,6,FALSE)),\" \"),8)","v":" "},0,{"$f":"IF(COUNTIF($F$4:$F144,$F144)<2,$F144,\" \")","v":" "},141,0,{"$f":"IF(COUNTIF($F$4:$F144,$F144)<3,$F144,\" \")","v":" "},141,0,"",1000,1000,{"$f":"IF(COUNTIF($F$4:$F144,J144)<4,$F144,\" \")","v":" "},141,0,"","","","",{"$f":"IF(COUNTIF($C$4:$C$203,C144)>1,\"X\",\" \")","v":" "},{"$f":"IF(COUNTIF($B$4:$B$203,B144)>1,\"T\",B144)","v":141}]
[142,142,null,{"$f":"IF(C145>0,CONCATENATE((VLOOKUP($C145,Inscription!$A$6:$G$205,3,FALSE)),\"   \",(VLOOKUP($C145,Inscription!$A$6:$G$205,4,FALSE))),\" \")","v":" "},null,{"$f":"IF(C145>0,(VLOOKUP($C145,Inscription!$A$6:$G$205,5,FALSE)),\" \")","v":" "},{"$f":"IF(C145>0,(VLOOKUP($C145,Inscription!$A$6:$G$205,7,FALSE)),\" \")","v":" "},{"$f":"LEFT(IF(C145>0,(VLOOKUP($C145,Inscription!$A$6:$G$205,6,FALSE)),\" \"),8)","v":" "},0,{"$f":"IF(COUNTIF($F$4:$F145,$F145)<2,$F145,\" \")","v":" "},142,0,{"$f":"IF(COUNTIF($F$4:$F145,$F145)<3,$F145,\" \")","v":" "},142,0,"",1000,1000,{"$f":"IF(COUNTIF($F$4:$F145,J145)<4,$F145,\" \")","v":" "},142,0,"","","",""," ",142]
[143,143,null,{"$f":"IF(C146>0,CONCATENATE((VLOOKUP($C146,Inscription!$A$6:$G$205,3,FALSE)),\"   \",(VLOOKUP($C146,Inscription!$A$6:$G$205,4,FALSE))),\" \")","v":" "},null,{"$f":"IF(C146>0,(VLOOKUP($C146,Inscription!$A$6:$G$205,5,FALSE)),\" \")","v":" "},{"$f":"IF(C146>0,(VLOOKUP($C146,Inscription!$A$6:$G$205,7,FALSE)),\" \")","v":" "},{"$f":"LEFT(IF(C146>0,(VLOOKUP($C146,Inscription!$A$6:$G$205,6,FALSE)),\" \"),8)","v":" "},0,{"$f":"IF(COUNTIF($F$4:$F146,$F146)<2,$F146,\" \")","v":" "},143,0,{"$f":"IF(COUNTIF($F$4:$F146,$F146)<3,$F146,\" \")","v":" "},143,0,"",1000,1000,{"$f":"IF(COUNTIF($F$4:$F146,J146)<4,$F146,\" \")","v":" "},143,0,"","","",""," ",143]
[144,144,null,{"$f":"IF(C147>0,CONCATENATE((VLOOKUP($C147,Inscription!$A$6:$G$205,3,FALSE)),\"   \",(VLOOKUP($C147,Inscription!$A$6:$G$205,4,FALSE))),\" \")","v":" "},null,{"$f":"IF(C147>0,(VLOOKUP($C147,Inscription!$A$6:$G$205,5,FALSE)),\" \")","v":" "},{"$f":"IF(C147>0,(VLOOKUP($C147,Inscription!$A$6:$G$205,7,FALSE)),\" \")","v":" "},{"$f":"LEFT(IF(C147>0,(VLOOKUP($C147,Inscription!$A$6:$G$205,6,FALSE)),\" \"),8)","v":" "},0,{"$f":"IF(COUNTIF($F$4:$F147,$F147)<2,$F147,\" \")","v":" "},144,0,{"$f":"IF(COUNTIF($F$4:$F147,$F147)<3,$F147,\" \")","v":" "},144,0,"",1000,1000,{"$f":"IF(COUNTIF($F$4:$F147,J147)<4,$F147,\" \")","v":" "},144,0,"","","",""," ",144]
[145,145,null,{"$f":"IF(C148>0,CONCATENATE((VLOOKUP($C148,Inscription!$A$6:$G$205,3,FALSE)),\"   \",(VLOOKUP($C148,Inscription!$A$6:$G$205,4,FALSE))),\" \")","v":" "},null,{"$f":"IF(C148>0,(VLOOKUP($C148,Inscription!$A$6:$G$205,5,FALSE)),\" \")","v":" "},{"$f":"IF(C148>0,(VLOOKUP($C148,Inscription!$A$6:$G$205,7,FALSE)),\" \")","v":" "},{"$f":"LEFT(IF(C148>0,(VLOOKUP($C148,Inscription!$A$6:$G$205,6,FALSE)),\" \"),8)","v":" "},0,{"$f":"IF(COUNTIF($F$4:$F148,$F148)<2,$F148,\" \")","v":" "},145,0,{"$f":"IF(COUNTIF($F$4:$F148,$F148)<3,$F148,\" \")","v":" "},145,0,"",1000,1000,{"$f":"IF(COUNTIF($F$4:$F148,J148)<4,$F148,\" \")","v":" "},145,0,"","","",""," ",145]
[146,146,null,{"$f":"IF(C149>0,CONCATENATE((VLOOKUP($C149,Inscription!$A$6:$G$205,3,FALSE)),\"   \",(VLOOKUP($C149,Inscription!$A$6:$G$205,4,FALSE))),\" \")","v":" "},null,{"$f":"IF(C149>0,(VLOOKUP($C149,Inscription!$A$6:$G$205,5,FALSE)),\" \")","v":" "},{"$f":"IF(C149>0,(VLOOKUP($C149,Inscription!$A$6:$G$205,7,FALSE)),\" \")","v":" "},{"$f":"LEFT(IF(C149>0,(VLOOKUP($C149,Inscription!$A$6:$G$205,6,FALSE)),\" \"),8)","v":" "},0,{"$f":"IF(COUNTIF($F$4:$F149,$F149)<2,$F149,\" \")","v":" "},146,0,{"$f":"IF(COUNTIF($F$4:$F149,$F149)<3,$F149,\" \")","v":" "},146,0,"",1000,1000,{"$f":"IF(COUNTIF($F$4:$F149,J149)<4,$F149,\" \")","v":" "},146,0,"","","",""," ",146]
[147,147,null,{"$f":"IF(C150>0,CONCATENATE((VLOOKUP($C150,Inscription!$A$6:$G$205,3,FALSE)),\"   \",(VLOOKUP($C150,Inscription!$A$6:$G$205,4,FALSE))),\" \")","v":" "},null,{"$f":"IF(C150>0,(VLOOKUP($C150,Inscription!$A$6:$G$205,5,FALSE)),\" \")","v":" "},{"$f":"IF(C150>0,(VLOOKUP($C150,Inscription!$A$6:$G$205,7,FALSE)),\" \")","v":" "},{"$f":"LEFT(IF(C150>0,(VLOOKUP($C150,Inscription!$A$6:$G$205,6,FALSE)),\" \"),8)","v":" "},0,{"$f":"IF(COUNTIF($F$4:$F150,$F150)<2,$F150,\" \")","v":" "},147,0,{"$f":"IF(COUNTIF($F$4:$F150,$F150)<3,$F150,\" \")","v":" "},147,0,"",1000,1000,{"$f":"IF(COUNTIF($F$4:$F150,J150)<4,$F150,\" \")","v":" "},147,0,"","","",""," ",147]
[148,148,null,{"$f":"IF(C151>0,CONCATENATE((VLOOKUP($C151,Inscription!$A$6:$G$205,3,FALSE)),\"   \",(VLOOKUP($C151,Inscription!$A$6:$G$205,4,FALSE))),\" \")","v":" "},null,{"$f":"IF(C151>0,(VLOOKUP($C151,Inscription!$A$6:$G$205,5,FALSE)),\" \")","v":" "},{"$f":"IF(C151>0,(VLOOKUP($C151,Inscription!$A$6:$G$205,7,FALSE)),\" \")","v":" "},{"$f":"LEFT(IF(C151>0,(VLOOKUP($C151,Inscription!$A$6:$G$205,6,FALSE)),\" \"),8)","v":" "},0,{"$f":"IF(COUNTIF($F$4:$F151,$F151)<2,$F151,\" \")","v":" "},148,0,{"$f":"IF(COUNTIF($F$4:$F151,$F151)<3,$F151,\" \")","v":" "},148,0,"",1000,1000,{"$f":"IF(COUNTIF($F$4:$F151,J151)<4,$F151,\" \")","v":" "},148,0,"","","",""," ",148]
[149,149,null,{"$f":"IF(C152>0,CONCATENATE((VLOOKUP($C152,Inscription!$A$6:$G$205,3,FALSE)),\"   \",(VLOOKUP($C152,Inscription!$A$6:$G$205,4,FALSE))),\" \")","v":" "},null,{"$f":"IF(C152>0,(VLOOKUP($C152,Inscription!$A$6:$G$205,5,FALSE)),\" \")","v":" "},{"$f":"IF(C152>0,(VLOOKUP($C152,Inscription!$A$6:$G$205,7,FALSE)),\" \")","v":" "},{"$f":"LEFT(IF(C152>0,(VLOOKUP($C152,Inscription!$A$6:$G$205,6,FALSE)),\" \"),8)","v":" "},0,{"$f":"IF(COUNTIF($F$4:$F152,$F152)<2,$F152,\" \")","v":" "},149,0,{"$f":"IF(COUNTIF($F$4:$F152,$F152)<3,$F152,\" \")","v":" "},149,0,"",1000,1000,{"$f":"IF(COUNTIF($F$4:$F152,J152)<4,$F152,\" \")","v":" "},149,0,"","","",""," ",149]
[150,150,null,{"$f":"IF(C153>0,CONCATENATE((VLOOKUP($C153,Inscription!$A$6:$G$205,3,FALSE)),\"   \",(VLOOKUP($C153,Inscription!$A$6:$G$205,4,FALSE))),\" \")","v":" "},null,{"$f":"IF(C153>0,(VLOOKUP($C153,Inscription!$A$6:$G$205,5,FALSE)),\" \")","v":" "},{"$f":"IF(C153>0,(VLOOKUP($C153,Inscription!$A$6:$G$205,7,FALSE)),\" \")","v":" "},{"$f":"LEFT(IF(C153>0,(VLOOKUP($C153,Inscription!$A$6:$G$205,6,FALSE)),\" \"),8)","v":" "},0,{"$f":"IF(COUNTIF($F$4:$F153,$F153)<2,$F153,\" \")","v":" "},150,0,{"$f":"IF(COUNTIF($F$4:$F153,$F153)<3,$F153,\" \")","v":" "},150,0,"",1000,1000,{"$f":"IF(COUNTIF($F$4:$F153,J153)<4,$F153,\" \")","v":" "},150,0,"","","",""," ",150]
[151,151,null,{"$f":"IF(C154>0,CONCATENATE((VLOOKUP($C154,Inscription!$A$6:$G$205,3,FALSE)),\"   \",(VLOOKUP($C154,Inscription!$A$6:$G$205,4,FALSE))),\" \")","v":" "},null,{"$f":"IF(C154>0,(VLOOKUP($C154,Inscription!$A$6:$G$205,5,FALSE)),\" \")","v":" "},{"$f":"IF(C154>0,(VLOOKUP($C154,Inscription!$A$6:$G$205,7,FALSE)),\" \")","v":" "},{"$f":"LEFT(IF(C154>0,(VLOOKUP($C154,Inscription!$A$6:$G$205,6,FALSE)),\" \"),8)","v":" "},0,{"$f":"IF(COUNTIF($F$4:$F154,$F154)<2,$F154,\" \")","v":" "},151,0,{"$f":"IF(COUNTIF($F$4:$F154,$F154)<3,$F154,\" \")","v":" "},151,0,"",1000,1000,{"$f":"IF(COUNTIF($F$4:$F154,J154)<4,$F154,\" \")","v":" "},151,0,"","","",""," ",151]
[152,152,null,{"$f":"IF(C155>0,CONCATENATE((VLOOKUP($C155,Inscription!$A$6:$G$205,3,FALSE)),\"   \",(VLOOKUP($C155,Inscription!$A$6:$G$205,4,FALSE))),\" \")","v":" "},null,{"$f":"IF(C155>0,(VLOOKUP($C155,Inscription!$A$6:$G$205,5,FALSE)),\" \")","v":" "},{"$f":"IF(C155>0,(VLOOKUP($C155,Inscription!$A$6:$G$205,7,FALSE)),\" \")","v":" "},{"$f":"LEFT(IF(C155>0,(VLOOKUP($C155,Inscription!$A$6:$G$205,6,FALSE)),\" \"),8)","v":" "},0,{"$f":"IF(COUNTIF($F$4:$F155,$F155)<2,$F155,\" \")","v":" "},152,0,{"$f":"IF(COUNTIF($F$4:$F155,$F155)<3,$F155,\" \")","v":" "},152,0,"",1000,1000,{"$f":"IF(COUNTIF($F$4:$F155,J155)<4,$F155,\" \")","v":" "},152,0,"","","",""," ",152]
[153,153,null,{"$f":"IF(C156>0,CONCATENATE((VLOOKUP($C156,Inscription!$A$6:$G$205,3,FALSE)),\"   \",(VLOOKUP($C156,Inscription!$A$6:$G$205,4,FALSE))),\" \")","v":" "},null,{"$f":"IF(C156>0,(VLOOKUP($C156,Inscription!$A$6:$G$205,5,FALSE)),\" \")","v":" "},{"$f":"IF(C156>0,(VLOOKUP($C156,Inscription!$A$6:$G$205,7,FALSE)),\" \")","v":" "},{"$f":"LEFT(IF(C156>0,(VLOOKUP($C156,Inscription!$A$6:$G$205,6,FALSE)),\" \"),8)","v":" "},0,{"$f":"IF(COUNTIF($F$4:$F156,$F156)<2,$F156,\" \")","v":" "},153,0,{"$f":"IF(COUNTIF($F$4:$F156,$F156)<3,$F156,\" \")","v":" "},153,0,"",1000,1000,{"$f":"IF(COUNTIF($F$4:$F156,J156)<4,$F156,\" \")","v":" "},153,0,"","","",""," ",153]
[154,154,null,{"$f":"IF(C157>0,CONCATENATE((VLOOKUP($C157,Inscription!$A$6:$G$205,3,FALSE)),\"   \",(VLOOKUP($C157,Inscription!$A$6:$G$205,4,FALSE))),\" \")","v":" "},null,{"$f":"IF(C157>0,(VLOOKUP($C157,Inscription!$A$6:$G$205,5,FALSE)),\" \")","v":" "},{"$f":"IF(C157>0,(VLOOKUP($C157,Inscription!$A$6:$G$205,7,FALSE)),\" \")","v":" "},{"$f":"LEFT(IF(C157>0,(VLOOKUP($C157,Inscription!$A$6:$G$205,6,FALSE)),\" \"),8)","v":" "},0,{"$f":"IF(COUNTIF($F$4:$F157,$F157)<2,$F157,\" \")","v":" "},154,0,{"$f":"IF(COUNTIF($F$4:$F157,$F157)<3,$F157,\" \")","v":" "},154,0,"",1000,1000,{"$f":"IF(COUNTIF($F$4:$F157,J157)<4,$F157,\" \")","v":" "},154,0,"","","",""," ",154]
[155,155,null,{"$f":"IF(C158>0,CONCATENATE((VLOOKUP($C158,Inscription!$A$6:$G$205,3,FALSE)),\"   \",(VLOOKUP($C158,Inscription!$A$6:$G$205,4,FALSE))),\" \")","v":" "},null,{"$f":"IF(C158>0,(VLOOKUP($C158,Inscription!$A$6:$G$205,5,FALSE)),\" \")","v":" "},{"$f":"IF(C158>0,(VLOOKUP($C158,Inscription!$A$6:$G$205,7,FALSE)),\" \")","v":" "},{"$f":"LEFT(IF(C158>0,(VLOOKUP($C158,Inscription!$A$6:$G$205,6,FALSE)),\" \"),8)","v":" "},0,{"$f":"IF(COUNTIF($F$4:$F158,$F158)<2,$F158,\" \")","v":" "},155,0,{"$f":"IF(COUNTIF($F$4:$F158,$F158)<3,$F158,\" \")","v":" "},155,0,"",1000,1000,{"$f":"IF(COUNTIF($F$4:$F158,J158)<4,$F158,\" \")","v":" "},155,0,"","","",""," ",155]
[156,156,null,{"$f":"IF(C159>0,CONCATENATE((VLOOKUP($C159,Inscription!$A$6:$G$205,3,FALSE)),\"   \",(VLOOKUP($C159,Inscription!$A$6:$G$205,4,FALSE))),\" \")","v":" "},null,{"$f":"IF(C159>0,(VLOOKUP($C159,Inscription!$A$6:$G$205,5,FALSE)),\" \")","v":" "},{"$f":"IF(C159>0,(VLOOKUP($C159,Inscription!$A$6:$G$205,7,FALSE)),\" \")","v":" "},{"$f":"LEFT(IF(C159>0,(VLOOKUP($C159,Inscription!$A$6:$G$205,6,FALSE)),\" \"),8)","v":" "},0,{"$f":"IF(COUNTIF($F$4:$F159,$F159)<2,$F159,\" \")","v":" "},156,0,{"$f":"IF(COUNTIF($F$4:$F159,$F159)<3,$F159,\" \")","v":" "},156,0,"",1000,1000,{"$f":"IF(COUNTIF($F$4:$F159,J159)<4,$F159,\" \")","v":" "},156,0,"","","",""," ",156]
[157,157,null,{"$f":"IF(C160>0,CONCATENATE((VLOOKUP($C160,Inscription!$A$6:$G$205,3,FALSE)),\"   \",(VLOOKUP($C160,Inscription!$A$6:$G$205,4,FALSE))),\" \")","v":" "},null,{"$f":"IF(C160>0,(VLOOKUP($C160,Inscription!$A$6:$G$205,5,FALSE)),\" \")","v":" "},{"$f":"IF(C160>0,(VLOOKUP($C160,Inscription!$A$6:$G$205,7,FALSE)),\" \")","v":" "},{"$f":"LEFT(IF(C160>0,(VLOOKUP($C160,Inscription!$A$6:$G$205,6,FALSE)),\" \"),8)","v":" "},0,{"$f":"IF(COUNTIF($F$4:$F160,$F160)<2,$F160,\" \")","v":" "},157,0,{"$f":"IF(COUNTIF($F$4:$F160,$F160)<3,$F160,\" \")","v":" "},157,0,"",1000,1000,{"$f":"IF(COUNTIF($F$4:$F160,J160)<4,$F160,\" \")","v":" "},157,0,"","","",""," ",157]
[158,158,null,{"$f":"IF(C161>0,CONCATENATE((VLOOKUP($C161,Inscription!$A$6:$G$205,3,FALSE)),\"   \",(VLOOKUP($C161,Inscription!$A$6:$G$205,4,FALSE))),\" \")","v":" "},null,{"$f":"IF(C161>0,(VLOOKUP($C161,Inscription!$A$6:$G$205,5,FALSE)),\" \")","v":" "},{"$f":"IF(C161>0,(VLOOKUP($C161,Inscription!$A$6:$G$205,7,FALSE)),\" \")","v":" "},{"$f":"LEFT(IF(C161>0,(VLOOKUP($C161,Inscription!$A$6:$G$205,6,FALSE)),\" \"),8)","v":" "},0,{"$f":"IF(COUNTIF($F$4:$F161,$F161)<2,$F161,\" \")","v":" "},158,0,{"$f":"IF(COUNTIF($F$4:$F161,$F161)<3,$F161,\" \")","v":" "},158,0,"",1000,1000,{"$f":"IF(COUNTIF($F$4:$F161,J161)<4,$F161,\" \")","v":" "},158,0,"","","",""," ",158]
[159,159,null,{"$f":"IF(C162>0,CONCATENATE((VLOOKUP($C162,Inscription!$A$6:$G$205,3,FALSE)),\"   \",(VLOOKUP($C162,Inscription!$A$6:$G$205,4,FALSE))),\" \")","v":" "},null,{"$f":"IF(C162>0,(VLOOKUP($C162,Inscription!$A$6:$G$205,5,FALSE)),\" \")","v":" "},{"$f":"IF(C162>0,(VLOOKUP($C162,Inscription!$A$6:$G$205,7,FALSE)),\" \")","v":" "},{"$f":"LEFT(IF(C162>0,(VLOOKUP($C162,Inscription!$A$6:$G$205,6,FALSE)),\" \"),8)","v":" "},0,{"$f":"IF(COUNTIF($F$4:$F162,$F162)<2,$F162,\" \")","v":" "},159,0,{"$f":"IF(COUNTIF($F$4:$F162,$F162)<3,$F162,\" \")","v":" "},159,0,"",1000,1000,{"$f":"IF(COUNTIF($F$4:$F162,J162)<4,$F162,\" \")","v":" "},159,0,"","","",""," ",159]
[160,160,null,{"$f":"IF(C163>0,CONCATENATE((VLOOKUP($C163,Inscription!$A$6:$G$205,3,FALSE)),\"   \",(VLOOKUP($C163,Inscription!$A$6:$G$205,4,FALSE))),\" \")","v":" "},null,{"$f":"IF(C163>0,(VLOOKUP($C163,Inscription!$A$6:$G$205,5,FALSE)),\" \")","v":" "},{"$f":"IF(C163>0,(VLOOKUP($C163,Inscription!$A$6:$G$205,7,FALSE)),\" \")","v":" "},{"$f":"LEFT(IF(C163>0,(VLOOKUP($C163,Inscription!$A$6:$G$205,6,FALSE)),\" \"),8)","v":" "},0,{"$f":"IF(COUNTIF($F$4:$F163,$F163)<2,$F163,\" \")","v":" "},160,0,{"$f":"IF(COUNTIF($F$4:$F163,$F163)<3,$F163,\" \")","v":" "},160,0,"",1000,1000,{"$f":"IF(COUNTIF($F$4:$F163,J163)<4,$F163,\" \")","v":" "},160,0,"","","",""," ",160]
[161,161,null,{"$f":"IF(C164>0,CONCATENATE((VLOOKUP($C164,Inscription!$A$6:$G$205,3,FALSE)),\"   \",(VLOOKUP($C164,Inscription!$A$6:$G$205,4,FALSE))),\" \")","v":" "},null,{"$f":"IF(C164>0,(VLOOKUP($C164,Inscription!$A$6:$G$205,5,FALSE)),\" \")","v":" "},{"$f":"IF(C164>0,(VLOOKUP($C164,Inscription!$A$6:$G$205,7,FALSE)),\" \")","v":" "},{"$f":"LEFT(IF(C164>0,(VLOOKUP($C164,Inscription!$A$6:$G$205,6,FALSE)),\" \"),8)","v":" "},0,{"$f":"IF(COUNTIF($F$4:$F164,$F164)<2,$F164,\" \")","v":" "},161,0,{"$f":"IF(COUNTIF($F$4:$F164,$F164)<3,$F164,\" \")","v":" "},161,0,"",1000,1000,{"$f":"IF(COUNTIF($F$4:$F164,J164)<4,$F164,\" \")","v":" "},161,0,"","","",""," ",161]
[162,162,null,{"$f":"IF(C165>0,CONCATENATE((VLOOKUP($C165,Inscription!$A$6:$G$205,3,FALSE)),\"   \",(VLOOKUP($C165,Inscription!$A$6:$G$205,4,FALSE))),\" \")","v":" "},null,{"$f":"IF(C165>0,(VLOOKUP($C165,Inscription!$A$6:$G$205,5,FALSE)),\" \")","v":" "},{"$f":"IF(C165>0,(VLOOKUP($C165,Inscription!$A$6:$G$205,7,FALSE)),\" \")","v":" "},{"$f":"LEFT(IF(C165>0,(VLOOKUP($C165,Inscription!$A$6:$G$205,6,FALSE)),\" \"),8)","v":" "},0,{"$f":"IF(COUNTIF($F$4:$F165,$F165)<2,$F165,\" \")","v":" "},162,0,{"$f":"IF(COUNTIF($F$4:$F165,$F165)<3,$F165,\" \")","v":" "},162,0,"",1000,1000,{"$f":"IF(COUNTIF($F$4:$F165,J165)<4,$F165,\" \")","v":" "},162,0,"","","",""," ",162]
[163,163,null,{"$f":"IF(C166>0,CONCATENATE((VLOOKUP($C166,Inscription!$A$6:$G$205,3,FALSE)),\"   \",(VLOOKUP($C166,Inscription!$A$6:$G$205,4,FALSE))),\" \")","v":" "},null,{"$f":"IF(C166>0,(VLOOKUP($C166,Inscription!$A$6:$G$205,5,FALSE)),\" \")","v":" "},{"$f":"IF(C166>0,(VLOOKUP($C166,Inscription!$A$6:$G$205,7,FALSE)),\" \")","v":" "},{"$f":"LEFT(IF(C166>0,(VLOOKUP($C166,Inscription!$A$6:$G$205,6,FALSE)),\" \"),8)","v":" "},0,{"$f":"IF(COUNTIF($F$4:$F166,$F166)<2,$F166,\" \")","v":" "},163,0,{"$f":"IF(COUNTIF($F$4:$F166,$F166)<3,$F166,\" \")","v":" "},163,0,"",1000,1000,{"$f":"IF(COUNTIF($F$4:$F166,J166)<4,$F166,\" \")","v":" "},163,0,"","","",""," ",163]
[164,164,null,{"$f":"IF(C167>0,CONCATENATE((VLOOKUP($C167,Inscription!$A$6:$G$205,3,FALSE)),\"   \",(VLOOKUP($C167,Inscription!$A$6:$G$205,4,FALSE))),\" \")","v":" "},null,{"$f":"IF(C167>0,(VLOOKUP($C167,Inscription!$A$6:$G$205,5,FALSE)),\" \")","v":" "},{"$f":"IF(C167>0,(VLOOKUP($C167,Inscription!$A$6:$G$205,7,FALSE)),\" \")","v":" "},{"$f":"LEFT(IF(C167>0,(VLOOKUP($C167,Inscription!$A$6:$G$205,6,FALSE)),\" \"),8)","v":" "},0,{"$f":"IF(COUNTIF($F$4:$F167,$F167)<2,$F167,\" \")","v":" "},164,0,{"$f":"IF(COUNTIF($F$4:$F167,$F167)<3,$F167,\" \")","v":" "},164,0,"",1000,1000,{"$f":"IF(COUNTIF($F$4:$F167,J167)<4,$F167,\" \")","v":" "},164,0,"","","",""," ",164]
[165,165,null,{"$f":"IF(C168>0,CONCATENATE((VLOOKUP($C168,Inscription!$A$6:$G$205,3,FALSE)),\"   \",(VLOOKUP($C168,Inscription!$A$6:$G$205,4,FALSE))),\" \")","v":" "},null,{"$f":"IF(C168>0,(VLOOKUP($C168,Inscription!$A$6:$G$205,5,FALSE)),\" \")","v":" "},{"$f":"IF(C168>0,(VLOOKUP($C168,Inscription!$A$6:$G$205,7,FALSE)),\" \")","v":" "},{"$f":"LEFT(IF(C168>0,(VLOOKUP($C168,Inscription!$A$6:$G$205,6,FALSE)),\" \"),8)","v":" "},0,{"$f":"IF(COUNTIF($F$4:$F168,$F168)<2,$F168,\" \")","v":" "},165,0,{"$f":"IF(COUNTIF($F$4:$F168,$F168)<3,$F168,\" \")","v":" "},165,0,"",1000,1000,{"$f":"IF(COUNTIF($F$4:$F168,J168)<4,$F168,\" \")","v":" "},165,0,"","","",""," ",165]
[166,166,null,{"$f":"IF(C169>0,CONCATENATE((VLOOKUP($C169,Inscription!$A$6:$G$205,3,FALSE)),\"   \",(VLOOKUP($C169,Inscription!$A$6:$G$205,4,FALSE))),\" \")","v":" "},null,{"$f":"IF(C169>0,(VLOOKUP($C169,Inscription!$A$6:$G$205,5,FALSE)),\" \")","v":" "},{"$f":"IF(C169>0,(VLOOKUP($C169,Inscription!$A$6:$G$205,7,FALSE)),\" \")","v":" "},{"$f":"LEFT(IF(C169>0,(VLOOKUP($C169,Inscription!$A$6:$G$205,6,FALSE)),\" \"),8)","v":" "},0,{"$f":"IF(COUNTIF($F$4:$F169,$F169)<2,$F169,\" \")","v":" "},166,0,{"$f":"IF(COUNTIF($F$4:$F169,$F169)<3,$F169,\" \")","v":" "},166,0,"",1000,1000,{"$f":"IF(COUNTIF($F$4:$F169,J169)<4,$F169,\" \")","v":" "},166,0,"","","",""," ",166]
[167,167,null,{"$f":"IF(C170>0,CONCATENATE((VLOOKUP($C170,Inscription!$A$6:$G$205,3,FALSE)),\"   \",(VLOOKUP($C170,Inscription!$A$6:$G$205,4,FALSE))),\" \")","v":" "},null,{"$f":"IF(C170>0,(VLOOKUP($C170,Inscription!$A$6:$G$205,5,FALSE)),\" \")","v":" "},{"$f":"IF(C170>0,(VLOOKUP($C170,Inscription!$A$6:$G$205,7,FALSE)),\" \")","v":" "},{"$f":"LEFT(IF(C170>0,(VLOOKUP($C170,Inscription!$A$6:$G$205,6,FALSE)),\" \"),8)","v":" "},0,{"$f":"IF(COUNTIF($F$4:$F170,$F170)<2,$F170,\" \")","v":" "},167,0,{"$f":"IF(COUNTIF($F$4:$F170,$F170)<3,$F170,\" \")","v":" "},167,0,"",1000,1000,{"$f":"IF(COUNTIF($F$4:$F170,J170)<4,$F170,\" \")","v":" "},167,0,"","","",""," ",167]
[168,168,null,{"$f":"IF(C171>0,CONCATENATE((VLOOKUP($C171,Inscription!$A$6:$G$205,3,FALSE)),\"   \",(VLOOKUP($C171,Inscription!$A$6:$G$205,4,FALSE))),\" \")","v":" "},null,{"$f":"IF(C171>0,(VLOOKUP($C171,Inscription!$A$6:$G$205,5,FALSE)),\" \")","v":" "},{"$f":"IF(C171>0,(VLOOKUP($C171,Inscription!$A$6:$G$205,7,FALSE)),\" \")","v":" "},{"$f":"LEFT(IF(C171>0,(VLOOKUP($C171,Inscription!$A$6:$G$205,6,FALSE)),\" \"),8)","v":" "},0,{"$f":"IF(COUNTIF($F$4:$F171,$F171)<2,$F171,\" \")","v":" "},168,0,{"$f":"IF(COUNTIF($F$4:$F171,$F171)<3,$F171,\" \")","v":" "},168,0,"",1000,1000,{"$f":"IF(COUNTIF($F$4:$F171,J171)<4,$F171,\" \")","v":" "},168,0,"","","",""," ",168]
[169,169,null,{"$f":"IF(C172>0,CONCATENATE((VLOOKUP($C172,Inscription!$A$6:$G$205,3,FALSE)),\"   \",(VLOOKUP($C172,Inscription!$A$6:$G$205,4,FALSE))),\" \")","v":" "},null,{"$f":"IF(C172>0,(VLOOKUP($C172,Inscription!$A$6:$G$205,5,FALSE)),\" \")","v":" "},{"$f":"IF(C172>0,(VLOOKUP($C172,Inscription!$A$6:$G$205,7,FALSE)),\" \")","v":" "},{"$f":"LEFT(IF(C172>0,(VLOOKUP($C172,Inscription!$A$6:$G$205,6,FALSE)),\" \"),8)","v":" "},0,{"$f":"IF(COUNTIF($F$4:$F172,$F172)<2,$F172,\" \")","v":" "},169,0,{"$f":"IF(COUNTIF($F$4:$F172,$F172)<3,$F172,\" \")","v":" "},169,0,"",1000,1000,{"$f":"IF(COUNTIF($F$4:$F172,J172)<4,$F172,\" \")","v":" "},169,0,"","","",""," ",169]
[170,170,null,{"$f":"IF(C173>0,CONCATENATE((VLOOKUP($C173,Inscription!$A$6:$G$205,3,FALSE)),\"   \",(VLOOKUP($C173,Inscription!$A$6:$G$205,4,FALSE))),\" \")","v":" "},null,{"$f":"IF(C173>0,(VLOOKUP($C173,Inscription!$A$6:$G$205,5,FALSE)),\" \")","v":" "},{"$f":"IF(C173>0,(VLOOKUP($C173,Inscription!$A$6:$G$205,7,FALSE)),\" \")","v":" "},{"$f":"LEFT(IF(C173>0,(VLOOKUP($C173,Inscription!$A$6:$G$205,6,FALSE)),\" \"),8)","v":" "},0,{"$f":"IF(COUNTIF($F$4:$F173,$F173)<2,$F173,\" \")","v":" "},170,0,{"$f":"IF(COUNTIF($F$4:$F173,$F173)<3,$F173,\" \")","v":" "},170,0,"",1000,1000,{"$f":"IF(COUNTIF($F$4:$F173,J173)<4,$F173,\" \")","v":" "},170,0,"","","",""," ",170]
[171,171,null,{"$f":"IF(C174>0,CONCATENATE((VLOOKUP($C174,Inscription!$A$6:$G$205,3,FALSE)),\"   \",(VLOOKUP($C174,Inscription!$A$6:$G$205,4,FALSE))),\" \")","v":" "},null,{"$f":"IF(C174>0,(VLOOKUP($C174,Inscription!$A$6:$G$205,5,FALSE)),\" \")","v":" "},{"$f":"IF(C174>0,(VLOOKUP($C174,Inscription!$A$6:$G$205,7,FALSE)),\" \")","v":" "},{"$f":"LEFT(IF(C174>0,(VLOOKUP($C174,Inscription!$A$6:$G$205,6,FALSE)),\" \"),8)","v":" "},0,{"$f":"IF(COUNTIF($F$4:$F174,$F174)<2,$F174,\" \")","v":" "},171,0,{"$f":"IF(COUNTIF($F$4:$F174,$F174)<3,$F174,\" \")","v":" "},171,0,"",1000,1000,{"$f":"IF(COUNTIF($F$4:$F174,J174)<4,$F174,\" \")","v":" "},171,0,"","","",""," ",171]
[172,172,null,{"$f":"IF(C175>0,CONCATENATE((VLOOKUP($C175,Inscription!$A$6:$G$205,3,FALSE)),\"   \",(VLOOKUP($C175,Inscription!$A$6:$G$205,4,FALSE))),\" \")","v":" "},null,{"$f":"IF(C175>0,(VLOOKUP($C175,Inscription!$A$6:$G$205,5,FALSE)),\" \")","v":" "},{"$f":"IF(C175>0,(VLOOKUP($C175,Inscription!$A$6:$G$205,7,FALSE)),\" \")","v":" "},{"$f":"LEFT(IF(C175>0,(VLOOKUP($C175,Inscription!$A$6:$G$205,6,FALSE)),\" \"),8)","v":" "},0,{"$f":"IF(COUNTIF($F$4:$F175,$F175)<2,$F175,\" \")","v":" "},172,0,{"$f":"IF(COUNTIF($F$4:$F175,$F175)<3,$F175,\" \")","v":" "},172,0,"",1000,1000,{"$f":"IF(COUNTIF($F$4:$F175,J175)<4,$F175,\" \")","v":" "},172,0,"","","",""," ",172]
[173,173,null,{"$f":"IF(C176>0,CONCATENATE((VLOOKUP($C176,Inscription!$A$6:$G$205,3,FALSE)),\"   \",(VLOOKUP($C176,Inscription!$A$6:$G$205,4,FALSE))),\" \")","v":" "},null,{"$f":"IF(C176>0,(VLOOKUP($C176,Inscription!$A$6:$G$205,5,FALSE)),\" \")","v":" "},{"$f":"IF(C176>0,(VLOOKUP($C176,Inscription!$A$6:$G$205,7,FALSE)),\" \")","v":" "},{"$f":"LEFT(IF(C176>0,(VLOOKUP($C176,Inscription!$A$6:$G$205,6,FALSE)),\" \"),8)","v":" "},0,{"$f":"IF(COUNTIF($F$4:$F176,$F176)<2,$F176,\" \")","v":" "},173,0,{"$f":"IF(COUNTIF($F$4:$F176,$F176)<3,$F176,\" \")","v":" "},173,0,"",1000,1000,{"$f":"IF(COUNTIF($F$4:$F176,J176)<4,$F176,\" \")","v":" "},173,0,"","","",""," ",173]
[174,174,null,{"$f":"IF(C177>0,CONCATENATE((VLOOKUP($C177,Inscription!$A$6:$G$205,3,FALSE)),\"   \",(VLOOKUP($C177,Inscription!$A$6:$G$205,4,FALSE))),\" \")","v":" "},null,{"$f":"IF(C177>0,(VLOOKUP($C177,Inscription!$A$6:$G$205,5,FALSE)),\" \")","v":" "},{"$f":"IF(C177>0,(VLOOKUP($C177,Inscription!$A$6:$G$205,7,FALSE)),\" \")","v":" "},{"$f":"LEFT(IF(C177>0,(VLOOKUP($C177,Inscription!$A$6:$G$205,6,FALSE)),\" \"),8)","v":" "},0,{"$f":"IF(COUNTIF($F$4:$F177,$F177)<2,$F177,\" \")","v":" "},174,0,{"$f":"IF(COUNTIF($F$4:$F177,$F177)<3,$F177,\" \")","v":" "},174,0,"",1000,1000,{"$f":"IF(COUNTIF($F$4:$F177,J177)<4,$F177,\" \")","v":" "},174,0,"","","",""," ",174]
[175,175,null,{"$f":"IF(C178>0,CONCATENATE((VLOOKUP($C178,Inscription!$A$6:$G$205,3,FALSE)),\"   \",(VLOOKUP($C178,Inscription!$A$6:$G$205,4,FALSE))),\" \")","v":" "},null,{"$f":"IF(C178>0,(VLOOKUP($C178,Inscription!$A$6:$G$205,5,FALSE)),\" \")","v":" "},{"$f":"IF(C178>0,(VLOOKUP($C178,Inscription!$A$6:$G$205,7,FALSE)),\" \")","v":" "},{"$f":"LEFT(IF(C178>0,(VLOOKUP($C178,Inscription!$A$6:$G$205,6,FALSE)),\" \"),8)","v":" "},0,{"$f":"IF(COUNTIF($F$4:$F178,$F178)<2,$F178,\" \")","v":" "},175,0,{"$f":"IF(COUNTIF($F$4:$F178,$F178)<3,$F178,\" \")","v":" "},175,0,"",1000,1000,{"$f":"IF(COUNTIF($F$4:$F178,J178)<4,$F178,\" \")","v":" "},175,0,"","","",""," ",175]
[176,176,null,{"$f":"IF(C179>0,CONCATENATE((VLOOKUP($C179,Inscription!$A$6:$G$205,3,FALSE)),\"   \",(VLOOKUP($C179,Inscription!$A$6:$G$205,4,FALSE))),\" \")","v":" "},null,{"$f":"IF(C179>0,(VLOOKUP($C179,Inscription!$A$6:$G$205,5,FALSE)),\" \")","v":" "},{"$f":"IF(C179>0,(VLOOKUP($C179,Inscription!$A$6:$G$205,7,FALSE)),\" \")","v":" "},{"$f":"LEFT(IF(C179>0,(VLOOKUP($C179,Inscription!$A$6:$G$205,6,FALSE)),\" \"),8)","v":" "},0,{"$f":"IF(COUNTIF($F$4:$F179,$F179)<2,$F179,\" \")","v":" "},176,0,{"$f":"IF(COUNTIF($F$4:$F179,$F179)<3,$F179,\" \")","v":" "},176,0,"",1000,1000,{"$f":"IF(COUNTIF($F$4:$F179,J179)<4,$F179,\" \")","v":" "},176,0,"","","",""," ",176]
[177,177,null,{"$f":"IF(C180>0,CONCATENATE((VLOOKUP($C180,Inscription!$A$6:$G$205,3,FALSE)),\"   \",(VLOOKUP($C180,Inscription!$A$6:$G$205,4,FALSE))),\" \")","v":" "},null,{"$f":"IF(C180>0,(VLOOKUP($C180,Inscription!$A$6:$G$205,5,FALSE)),\" \")","v":" "},{"$f":"IF(C180>0,(VLOOKUP($C180,Inscription!$A$6:$G$205,7,FALSE)),\" \")","v":" "},{"$f":"LEFT(IF(C180>0,(VLOOKUP($C180,Inscription!$A$6:$G$205,6,FALSE)),\" \"),8)","v":" "},0,{"$f":"IF(COUNTIF($F$4:$F180,$F180)<2,$F180,\" \")","v":" "},177,0,{"$f":"IF(COUNTIF($F$4:$F180,$F180)<3,$F180,\" \")","v":" "},177,0,"",1000,1000,{"$f":"IF(COUNTIF($F$4:$F180,J180)<4,$F180,\" \")","v":" "},177,0,"","","",""," ",177]
[178,178,null,{"$f":"IF(C181>0,CONCATENATE((VLOOKUP($C181,Inscription!$A$6:$G$205,3,FALSE)),\"   \",(VLOOKUP($C181,Inscription!$A$6:$G$205,4,FALSE))),\" \")","v":" "},null,{"$f":"IF(C181>0,(VLOOKUP($C181,Inscription!$A$6:$G$205,5,FALSE)),\" \")","v":" "},{"$f":"IF(C181>0,(VLOOKUP($C181,Inscription!$A$6:$G$205,7,FALSE)),\" \")","v":" "},{"$f":"LEFT(IF(C181>0,(VLOOKUP($C181,Inscription!$A$6:$G$205,6,FALSE)),\" \"),8)","v":" "},0,{"$f":"IF(COUNTIF($F$4:$F181,$F181)<2,$F181,\" \")","v":" "},178,0,{"$f":"IF(COUNTIF($F$4:$F181,$F181)<3,$F181,\" \")","v":" "},178,0,"",1000,1000,{"$f":"IF(COUNTIF($F$4:$F181,J181)<4,$F181,\" \")","v":" "},178,0,"","","",""," ",178]
[179,179,null,{"$f":"IF(C182>0,CONCATENATE((VLOOKUP($C182,Inscription!$A$6:$G$205,3,FALSE)),\"   \",(VLOOKUP($C182,Inscription!$A$6:$G$205,4,FALSE))),\" \")","v":" "},null,{"$f":"IF(C182>0,(VLOOKUP($C182,Inscription!$A$6:$G$205,5,FALSE)),\" \")","v":" "},{"$f":"IF(C182>0,(VLOOKUP($C182,Inscription!$A$6:$G$205,7,FALSE)),\" \")","v":" "},{"$f":"LEFT(IF(C182>0,(VLOOKUP($C182,Inscription!$A$6:$G$205,6,FALSE)),\" \"),8)","v":" "},0,{"$f":"IF(COUNTIF($F$4:$F182,$F182)<2,$F182,\" \")","v":" "},179,0,{"$f":"IF(COUNTIF($F$4:$F182,$F182)<3,$F182,\" \")","v":" "},179,0,"",1000,1000,{"$f":"IF(COUNTIF($F$4:$F182,J182)<4,$F182,\" \")","v":" "},179,0,"","","",""," ",179]
[180,180,null,{"$f":"IF(C183>0,CONCATENATE((VLOOKUP($C183,Inscription!$A$6:$G$205,3,FALSE)),\"   \",(VLOOKUP($C183,Inscription!$A$6:$G$205,4,FALSE))),\" \")","v":" "},null,{"$f":"IF(C183>0,(VLOOKUP($C183,Inscription!$A$6:$G$205,5,FALSE)),\" \")","v":" "},{"$f":"IF(C183>0,(VLOOKUP($C183,Inscription!$A$6:$G$205,7,FALSE)),\" \")","v":" "},{"$f":"LEFT(IF(C183>0,(VLOOKUP($C183,Inscription!$A$6:$G$205,6,FALSE)),\" \"),8)","v":" "},0,{"$f":"IF(COUNTIF($F$4:$F183,$F183)<2,$F183,\" \")","v":" "},180,0,{"$f":"IF(COUNTIF($F$4:$F183,$F183)<3,$F183,\" \")","v":" "},180,0,"",1000,1000,{"$f":"IF(COUNTIF($F$4:$F183,J183)<4,$F183,\" \")","v":" "},180,0,"","","",""," ",180]
[181,181,null,{"$f":"IF(C184>0,CONCATENATE((VLOOKUP($C184,Inscription!$A$6:$G$205,3,FALSE)),\"   \",(VLOOKUP($C184,Inscription!$A$6:$G$205,4,FALSE))),\" \")","v":" "},null,{"$f":"IF(C184>0,(VLOOKUP($C184,Inscription!$A$6:$G$205,5,FALSE)),\" \")","v":" "},{"$f":"IF(C184>0,(VLOOKUP($C184,Inscription!$A$6:$G$205,7,FALSE)),\" \")","v":" "},{"$f":"LEFT(IF(C184>0,(VLOOKUP($C184,Inscription!$A$6:$G$205,6,FALSE)),\" \"),8)","v":" "},0,{"$f":"IF(COUNTIF($F$4:$F184,$F184)<2,$F184,\" \")","v":" "},181,0,{"$f":"IF(COUNTIF($F$4:$F184,$F184)<3,$F184,\" \")","v":" "},181,0,"",1000,1000,{"$f":"IF(COUNTIF($F$4:$F184,J184)<4,$F184,\" \")","v":" "},181,0,"","","",""," ",181]
[182,182,null,{"$f":"IF(C185>0,CONCATENATE((VLOOKUP($C185,Inscription!$A$6:$G$205,3,FALSE)),\"   \",(VLOOKUP($C185,Inscription!$A$6:$G$205,4,FALSE))),\" \")","v":" "},null,{"$f":"IF(C185>0,(VLOOKUP($C185,Inscription!$A$6:$G$205,5,FALSE)),\" \")","v":" "},{"$f":"IF(C185>0,(VLOOKUP($C185,Inscription!$A$6:$G$205,7,FALSE)),\" \")","v":" "},{"$f":"LEFT(IF(C185>0,(VLOOKUP($C185,Inscription!$A$6:$G$205,6,FALSE)),\" \"),8)","v":" "},0,{"$f":"IF(COUNTIF($F$4:$F185,$F185)<2,$F185,\" \")","v":" "},182,0,{"$f":"IF(COUNTIF($F$4:$F185,$F185)<3,$F185,\" \")","v":" "},182,0,"",1000,1000,{"$f":"IF(COUNTIF($F$4:$F185,J185)<4,$F185,\" \")","v":" "},182,0,"","","",""," ",182]
[183,183,null,{"$f":"IF(C186>0,CONCATENATE((VLOOKUP($C186,Inscription!$A$6:$G$205,3,FALSE)),\"   \",(VLOOKUP($C186,Inscription!$A$6:$G$205,4,FALSE))),\" \")","v":" "},null,{"$f":"IF(C186>0,(VLOOKUP($C186,Inscription!$A$6:$G$205,5,FALSE)),\" \")","v":" "},{"$f":"IF(C186>0,(VLOOKUP($C186,Inscription!$A$6:$G$205,7,FALSE)),\" \")","v":" "},{"$f":"LEFT(IF(C186>0,(VLOOKUP($C186,Inscription!$A$6:$G$205,6,FALSE)),\" \"),8)","v":" "},0,{"$f":"IF(COUNTIF($F$4:$F186,$F186)<2,$F186,\" \")","v":" "},183,0,{"$f":"IF(COUNTIF($F$4:$F186,$F186)<3,$F186,\" \")","v":" "},183,0,"",1000,1000,{"$f":"IF(COUNTIF($F$4:$F186,J186)<4,$F186,\" \")","v":" "},183,0,"","","",""," ",183]
[184,184,null,{"$f":"IF(C187>0,CONCATENATE((VLOOKUP($C187,Inscription!$A$6:$G$205,3,FALSE)),\"   \",(VLOOKUP($C187,Inscription!$A$6:$G$205,4,FALSE))),\" \")","v":" "},null,{"$f":"IF(C187>0,(VLOOKUP($C187,Inscription!$A$6:$G$205,5,FALSE)),\" \")","v":" "},{"$f":"IF(C187>0,(VLOOKUP($C187,Inscription!$A$6:$G$205,7,FALSE)),\" \")","v":" "},{"$f":"LEFT(IF(C187>0,(VLOOKUP($C187,Inscription!$A$6:$G$205,6,FALSE)),\" \"),8)","v":" "},0,{"$f":"IF(COUNTIF($F$4:$F187,$F187)<2,$F187,\" \")","v":" "},184,0,{"$f":"IF(COUNTIF($F$4:$F187,$F187)<3,$F187,\" \")","v":" "},184,0,"",1000,1000,{"$f":"IF(COUNTIF($F$4:$F187,J187)<4,$F187,\" \")","v":" "},184,0,"","","",""," ",184]
[185,185,null,{"$f":"IF(C188>0,CONCATENATE((VLOOKUP($C188,Inscription!$A$6:$G$205,3,FALSE)),\"   \",(VLOOKUP($C188,Inscription!$A$6:$G$205,4,FALSE))),\" \")","v":" "},null,{"$f":"IF(C188>0,(VLOOKUP($C188,Inscription!$A$6:$G$205,5,FALSE)),\" \")","v":" "},{"$f":"IF(C188>0,(VLOOKUP($C188,Inscription!$A$6:$G$205,7,FALSE)),\" \")","v":" "},{"$f":"LEFT(IF(C188>0,(VLOOKUP($C188,Inscription!$A$6:$G$205,6,FALSE)),\" \"),8)","v":" "},0,{"$f":"IF(COUNTIF($F$4:$F188,$F188)<2,$F188,\" \")","v":" "},185,0,{"$f":"IF(COUNTIF($F$4:$F188,$F188)<3,$F188,\" \")","v":" "},185,0,"",1000,1000,{"$f":"IF(COUNTIF($F$4:$F188,J188)<4,$F188,\" \")","v":" "},185,0,"","","",""," ",185]
[186,186,null,{"$f":"IF(C189>0,CONCATENATE((VLOOKUP($C189,Inscription!$A$6:$G$205,3,FALSE)),\"   \",(VLOOKUP($C189,Inscription!$A$6:$G$205,4,FALSE))),\" \")","v":" "},null,{"$f":"IF(C189>0,(VLOOKUP($C189,Inscription!$A$6:$G$205,5,FALSE)),\" \")","v":" "},{"$f":"IF(C189>0,(VLOOKUP($C189,Inscription!$A$6:$G$205,7,FALSE)),\" \")","v":" "},{"$f":"LEFT(IF(C189>0,(VLOOKUP($C189,Inscription!$A$6:$G$205,6,FALSE)),\" \"),8)","v":" "},0,{"$f":"IF(COUNTIF($F$4:$F189,$F189)<2,$F189,\" \")","v":" "},186,0,{"$f":"IF(COUNTIF($F$4:$F189,$F189)<3,$F189,\" \")","v":" "},186,0,"",1000,1000,{"$f":"IF(COUNTIF($F$4:$F189,J189)<4,$F189,\" \")","v":" "},186,0,"","","",""," ",186]
[187,187,null,{"$f":"IF(C190>0,CONCATENATE((VLOOKUP($C190,Inscription!$A$6:$G$205,3,FALSE)),\"   \",(VLOOKUP($C190,Inscription!$A$6:$G$205,4,FALSE))),\" \")","v":" "},null,{"$f":"IF(C190>0,(VLOOKUP($C190,Inscription!$A$6:$G$205,5,FALSE)),\" \")","v":" "},{"$f":"IF(C190>0,(VLOOKUP($C190,Inscription!$A$6:$G$205,7,FALSE)),\" \")","v":" "},{"$f":"LEFT(IF(C190>0,(VLOOKUP($C190,Inscription!$A$6:$G$205,6,FALSE)),\" \"),8)","v":" "},0,{"$f":"IF(COUNTIF($F$4:$F190,$F190)<2,$F190,\" \")","v":" "},187,0,{"$f":"IF(COUNTIF($F$4:$F190,$F190)<3,$F190,\" \")","v":" "},187,0,"",1000,1000,{"$f":"IF(COUNTIF($F$4:$F190,J190)<4,$F190,\" \")","v":" "},187,0,"","","",""," ",187]
[188,188,null,{"$f":"IF(C191>0,CONCATENATE((VLOOKUP($C191,Inscription!$A$6:$G$205,3,FALSE)),\"   \",(VLOOKUP($C191,Inscription!$A$6:$G$205,4,FALSE))),\" \")","v":" "},null,{"$f":"IF(C191>0,(VLOOKUP($C191,Inscription!$A$6:$G$205,5,FALSE)),\" \")","v":" "},{"$f":"IF(C191>0,(VLOOKUP($C191,Inscription!$A$6:$G$205,7,FALSE)),\" \")","v":" "},{"$f":"LEFT(IF(C191>0,(VLOOKUP($C191,Inscription!$A$6:$G$205,6,FALSE)),\" \"),8)","v":" "},0,{"$f":"IF(COUNTIF($F$4:$F191,$F191)<2,$F191,\" \")","v":" "},188,0,{"$f":"IF(COUNTIF($F$4:$F191,$F191)<3,$F191,\" \")","v":" "},188,0,"",1000,1000,{"$f":"IF(COUNTIF($F$4:$F191,J191)<4,$F191,\" \")","v":" "},188,0,"","","",""," ",188]
[189,189,null,{"$f":"IF(C192>0,CONCATENATE((VLOOKUP($C192,Inscription!$A$6:$G$205,3,FALSE)),\"   \",(VLOOKUP($C192,Inscription!$A$6:$G$205,4,FALSE))),\" \")","v":" "},null,{"$f":"IF(C192>0,(VLOOKUP($C192,Inscription!$A$6:$G$205,5,FALSE)),\" \")","v":" "},{"$f":"IF(C192>0,(VLOOKUP($C192,Inscription!$A$6:$G$205,7,FALSE)),\" \")","v":" "},{"$f":"LEFT(IF(C192>0,(VLOOKUP($C192,Inscription!$A$6:$G$205,6,FALSE)),\" \"),8)","v":" "},0,{"$f":"IF(COUNTIF($F$4:$F192,$F192)<2,$F192,\" \")","v":" "},189,0,{"$f":"IF(COUNTIF($F$4:$F192,$F192)<3,$F192,\" \")","v":" "},189,0,"",1000,1000,{"$f":"IF(COUNTIF($F$4:$F192,J192)<4,$F192,\" \")","v":" "},189,0,"","","",""," ",189]
[190,190,null,{"$f":"IF(C193>0,CONCATENATE((VLOOKUP($C193,Inscription!$A$6:$G$205,3,FALSE)),\"   \",(VLOOKUP($C193,Inscription!$A$6:$G$205,4,FALSE))),\" \")","v":" "},null,{"$f":"IF(C193>0,(VLOOKUP($C193,Inscription!$A$6:$G$205,5,FALSE)),\" \")","v":" "},{"$f":"IF(C193>0,(VLOOKUP($C193,Inscription!$A$6:$G$205,7,FALSE)),\" \")","v":" "},{"$f":"LEFT(IF(C193>0,(VLOOKUP($C193,Inscription!$A$6:$G$205,6,FALSE)),\" \"),8)","v":" "},{"$f":"I192","v":0},{"$f":"IF(COUNTIF($F$4:$F193,$F193)<2,$F193,\" \")","v":" "},190,0,{"$f":"IF(COUNTIF($F$4:$F193,$F193)<3,$F193,\" \")","v":" "},190,0,"",1000,1000,{"$f":"IF(COUNTIF($F$4:$F193,J193)<4,$F193,\" \")","v":" "},190,0,"","","",""," ",190]
[191,191,null,{"$f":"IF(C194>0,CONCATENATE((VLOOKUP($C194,Inscription!$A$6:$G$205,3,FALSE)),\"   \",(VLOOKUP($C194,Inscription!$A$6:$G$205,4,FALSE))),\" \")","v":" "},null,{"$f":"IF(C194>0,(VLOOKUP($C194,Inscription!$A$6:$G$205,5,FALSE)),\" \")","v":" "},{"$f":"IF(C194>0,(VLOOKUP($C194,Inscription!$A$6:$G$205,7,FALSE)),\" \")","v":" "},{"$f":"LEFT(IF(C194>0,(VLOOKUP($C194,Inscription!$A$6:$G$205,6,FALSE)),\" \"),8)","v":" "},0,{"$f":"IF(COUNTIF($F$4:$F194,$F194)<2,$F194,\" \")","v":" "},191,0,{"$f":"IF(COUNTIF($F$4:$F194,$F194)<3,$F194,\" \")","v":" "},191,0,"",1000,1000,{"$f":"IF(COUNTIF($F$4:$F194,J194)<4,$F194,\" \")","v":" "},191,0,"","","",""," ",191]
[192,192,null,{"$f":"IF(C195>0,CONCATENATE((VLOOKUP($C195,Inscription!$A$6:$G$205,3,FALSE)),\"   \",(VLOOKUP($C195,Inscription!$A$6:$G$205,4,FALSE))),\" \")","v":" "},null,{"$f":"IF(C195>0,(VLOOKUP($C195,Inscription!$A$6:$G$205,5,FALSE)),\" \")","v":" "},{"$f":"IF(C195>0,(VLOOKUP($C195,Inscription!$A$6:$G$205,7,FALSE)),\" \")","v":" "},{"$f":"LEFT(IF(C195>0,(VLOOKUP($C195,Inscription!$A$6:$G$205,6,FALSE)),\" \"),8)","v":" "},0,{"$f":"IF(COUNTIF($F$4:$F195,$F195)<2,$F195,\" \")","v":" "},192,0,{"$f":"IF(COUNTIF($F$4:$F195,$F195)<3,$F195,\" \")","v":" "},192,0,"",1000,1000,{"$f":"IF(COUNTIF($F$4:$F195,J195)<4,$F195,\" \")","v":" "},192,0,"","","",""," ",192]
[{"$f":"IF(B196<1,1000,(IF(AA196=B196,B196,(20100-SUM($AA$4:$AA$203))/(COUNTIF($AA$4:$AA$203,\"T\")))))","v":193},193,null,{"$f":"IF(C196>0,CONCATENATE((VLOOKUP($C196,Inscription!$A$6:$G$205,3,FALSE)),\"   \",(VLOOKUP($C196,Inscription!$A$6:$G$205,4,FALSE))),\" \")","v":" "},null,{"$f":"IF(C196>0,(VLOOKUP($C196,Inscription!$A$6:$G$205,5,FALSE)),\" \")","v":" "},{"$f":"IF(C196>0,(VLOOKUP($C196,Inscription!$A$6:$G$205,7,FALSE)),\" \")","v":" "},{"$f":"LEFT(IF(C196>0,(VLOOKUP($C196,Inscription!$A$6:$G$205,6,FALSE)),\" \"),8)","v":" "},0,{"$f":"IF(COUNTIF($F$4:$F196,$F196)<2,$F196,\" \")","v":" "},193,0,{"$f":"IF(COUNTIF($F$4:$F196,$F196)<3,$F196,\" \")","v":" "},193,0,"",1000,1000,{"$f":"IF(COUNTIF($F$4:$F196,J196)<4,$F196,\" \")","v":" "},193,0,"","","",""," ",193]
[194,194,null,{"$f":"IF(C197>0,CONCATENATE((VLOOKUP($C197,Inscription!$A$6:$G$205,3,FALSE)),\"   \",(VLOOKUP($C197,Inscription!$A$6:$G$205,4,FALSE))),\" \")","v":" "},null,{"$f":"IF(C197>0,(VLOOKUP($C197,Inscription!$A$6:$G$205,5,FALSE)),\" \")","v":" "},{"$f":"IF(C197>0,(VLOOKUP($C197,Inscription!$A$6:$G$205,7,FALSE)),\" \")","v":" "},{"$f":"LEFT(IF(C197>0,(VLOOKUP($C197,Inscription!$A$6:$G$205,6,FALSE)),\" \"),8)","v":" "},0,{"$f":"IF(COUNTIF($F$4:$F197,$F197)<2,$F197,\" \")","v":" "},{"$f":"IF(J197=F197,A197,\"\")","v":194},{"$f":"IF(J197=F197,I197,\"\")","v":0},{"$f":"IF(COUNTIF($F$4:$F197,$F197)<3,$F197,\" \")","v":" "},{"$f":"IF(M197=$F197,$A197,\"\")","v":194},{"$f":"IF(M197=$F197,$I197,\"\")","v":0},{"$f":"IF(M197=J197,\"\",M197)","v":""},{"$f":"IF(P197=$F197,$A197,1000)","v":1000},{"$f":"IF(P197=$F197,$I197,1000)","v":1000},{"$f":"IF(COUNTIF($F$4:$F197,J197)<4,$F197,\" \")","v":" "},{"$f":"IF(S197=$F197,$A197,\"\")","v":194},{"$f":"IF(S197=$F197,$I197,\"\")","v":0},{"$f":"IF(S197=J197,\"\",S197)","v":""},{"$f":"IF(V197=P197,\"\",S197)","v":""},{"$f":"IF(W197=$F197,$A197,\"\")","v":""},{"$f":"IF(W197=$F197,$I197,\"\")","v":""}," ",194]
[195,195,null,{"$f":"IF(C198>0,CONCATENATE((VLOOKUP($C198,Inscription!$A$6:$G$205,3,FALSE)),\"   \",(VLOOKUP($C198,Inscription!$A$6:$G$205,4,FALSE))),\" \")","v":" "},null,{"$f":"IF(C198>0,(VLOOKUP($C198,Inscription!$A$6:$G$205,5,FALSE)),\" \")","v":" "},{"$f":"IF(C198>0,(VLOOKUP($C198,Inscription!$A$6:$G$205,7,FALSE)),\" \")","v":" "},{"$f":"LEFT(IF(C198>0,(VLOOKUP($C198,Inscription!$A$6:$G$205,6,FALSE)),\" \"),8)","v":" "},0,{"$f":"IF(COUNTIF($F$4:$F198,$F198)<2,$F198,\" \")","v":" "},195,0,{"$f":"IF(COUNTIF($F$4:$F198,$F198)<3,$F198,\" \")","v":" "},195,0,"",1000,1000,{"$f":"IF(COUNTIF($F$4:$F198,J198)<4,$F198,\" \")","v":" "},195,0,"","","",""," ",195]
[196,196,null,{"$f":"IF(C199>0,CONCATENATE((VLOOKUP($C199,Inscription!$A$6:$G$205,3,FALSE)),\"   \",(VLOOKUP($C199,Inscription!$A$6:$G$205,4,FALSE))),\" \")","v":" "},null,{"$f":"IF(C199>0,(VLOOKUP($C199,Inscription!$A$6:$G$205,5,FALSE)),\" \")","v":" "},{"$f":"IF(C199>0,(VLOOKUP($C199,Inscription!$A$6:$G$205,7,FALSE)),\" \")","v":" "},{"$f":"LEFT(IF(C199>0,(VLOOKUP($C199,Inscription!$A$6:$G$205,6,FALSE)),\" \"),8)","v":" "},0,{"$f":"IF(COUNTIF($F$4:$F199,$F199)<2,$F199,\" \")","v":" "},196,0,{"$f":"IF(COUNTIF($F$4:$F199,$F199)<3,$F199,\" \")","v":" "},196,0,"",1000,1000,{"$f":"IF(COUNTIF($F$4:$F199,J199)<4,$F199,\" \")","v":" "},196,0,"","","",""," ",196]
[197,197,null,{"$f":"IF(C200>0,CONCATENATE((VLOOKUP($C200,Inscription!$A$6:$G$205,3,FALSE)),\"   \",(VLOOKUP($C200,Inscription!$A$6:$G$205,4,FALSE))),\" \")","v":" "},null,{"$f":"IF(C200>0,(VLOOKUP($C200,Inscription!$A$6:$G$205,5,FALSE)),\" \")","v":" "},{"$f":"IF(C200>0,(VLOOKUP($C200,Inscription!$A$6:$G$205,7,FALSE)),\" \")","v":" "},{"$f":"LEFT(IF(C200>0,(VLOOKUP($C200,Inscription!$A$6:$G$205,6,FALSE)),\" \"),8)","v":" "},0,{"$f":"IF(COUNTIF($F$4:$F200,$F200)<2,$F200,\" \")","v":" "},197,0,{"$f":"IF(COUNTIF($F$4:$F200,$F200)<3,$F200,\" \")","v":" "},197,0,"",1000,1000,{"$f":"IF(COUNTIF($F$4:$F200,J200)<4,$F200,\" \")","v":" "},197,0,"","","",""," ",197]
[198,198,null,{"$f":"IF(C201>0,CONCATENATE((VLOOKUP($C201,Inscription!$A$6:$G$205,3,FALSE)),\"   \",(VLOOKUP($C201,Inscription!$A$6:$G$205,4,FALSE))),\" \")","v":" "},null,{"$f":"IF(C201>0,(VLOOKUP($C201,Inscription!$A$6:$G$205,5,FALSE)),\" \")","v":" "},{"$f":"IF(C201>0,(VLOOKUP($C201,Inscription!$A$6:$G$205,7,FALSE)),\" \")","v":" "},{"$f":"LEFT(IF(C201>0,(VLOOKUP($C201,Inscription!$A$6:$G$205,6,FALSE)),\" \"),8)","v":" "},0,{"$f":"IF(COUNTIF($F$4:$F201,$F201)<2,$F201,\" \")","v":" "},198,0,{"$f":"IF(COUNTIF($F$4:$F201,$F201)<3,$F201,\" \")","v":" "},198,0,"",1000,1000,{"$f":"IF(COUNTIF($F$4:$F201,J201)<4,$F201,\" \")","v":" "},198,0,"","","",""," ",198]
[199,199,null,{"$f":"IF(C202>0,CONCATENATE((VLOOKUP($C202,Inscription!$A$6:$G$205,3,FALSE)),\"   \",(VLOOKUP($C202,Inscription!$A$6:$G$205,4,FALSE))),\" \")","v":" "},null,{"$f":"IF(C202>0,(VLOOKUP($C202,Inscription!$A$6:$G$205,5,FALSE)),\" \")","v":" "},{"$f":"IF(C202>0,(VLOOKUP($C202,Inscription!$A$6:$G$205,7,FALSE)),\" \")","v":" "},{"$f":"LEFT(IF(C202>0,(VLOOKUP($C202,Inscription!$A$6:$G$205,6,FALSE)),\" \"),8)","v":" "},0,{"$f":"IF(COUNTIF($F$4:$F202,$F202)<2,$F202,\" \")","v":" "},199,0,{"$f":"IF(COUNTIF($F$4:$F202,$F202)<3,$F202,\" \")","v":" "},199,0,"",1000,1000,{"$f":"IF(COUNTIF($F$4:$F202,J202)<4,$F202,\" \")","v":" "},199,0,"","","",""," ",199]
[200,200,null,{"$f":"IF(C203>0,CONCATENATE((VLOOKUP($C203,Inscription!$A$6:$G$205,3,FALSE)),\"   \",(VLOOKUP($C203,Inscription!$A$6:$G$205,4,FALSE))),\" \")","v":" "},null,{"$f":"IF(C203>0,(VLOOKUP($C203,Inscription!$A$6:$G$205,5,FALSE)),\" \")","v":" "},{"$f":"IF(C203>0,(VLOOKUP($C203,Inscription!$A$6:$G$205,7,FALSE)),\" \")","v":" "},{"$f":"LEFT(IF(C203>0,(VLOOKUP($C203,Inscription!$A$6:$G$205,6,FALSE)),\" \"),8)","v":" "},0,{"$f":"IF(COUNTIF($F$4:$F203,$F203)<2,$F203,\" \")","v":" "},200,0,{"$f":"IF(COUNTIF($F$4:$F203,$F203)<3,$F203,\" \")","v":" "},200,0,"",1000,1000,{"$f":"IF(COUNTIF($F$4:$F203,J203)<4,$F203,\" \")","v":" "},200,0,"","","",""," ",200]

{"sheet":"CLASS INTERNET","index":6,"n_rows":136,"n_cols":8,"rows_kept":136,"cut":false,"hidden":false,"merged":[[119,5,119,6],[2,2,2,3]]}
["COURSE HENANSAL",null,null,null,null,{"$f":"IF(Inscription!$D$4>0,\"DATE :  \"&TEXT(Inscription!D$4,\"jj mmmm aaaa\"),\"\")","v":"DATE :  01 octobre 2023"}]
["CAT",{"$f":"Inscription!#REF!","v":{"$error":"#REF!"}},null,null,"PARTANTS",{"$f":"CLASSEMENT!G2","v":{"$error":"#REF!"}},"CLASSES",{"$f":"CLASSEMENT!I2","v":55}]
["Place","Doss","NOM et PRENOM",null,"ASSOCIATION","LICENCE","CAT.","TEMPS"]
[{"$f":"CLASSEMENT!$B4","v":1},{"$f":"CLASSEMENT!C4","v":3},{"$f":"CLASSEMENT!D4","v":"BASSET   Evan"},null,{"$f":"CLASSEMENT!F4","v":"vc evron"},{"$f":"CLASSEMENT!G4","v":0},{"$f":"CLASSEMENT!H4","v":"poussin"},{"$f":"CLASSEMENT!I4","v":0}]
[{"$f":"CLASSEMENT!$B5","v":2},{"$f":"CLASSEMENT!C5","v":4},{"$f":"CLASSEMENT!D5","v":"BANNER   Livia"},null,{"$f":"CLASSEMENT!F5","v":"vtt du lié"},{"$f":"CLASSEMENT!G5","v":0},{"$f":"CLASSEMENT!H5","v":"poussin"},{"$f":"IF(CLASSEMENT!I5=CLASSEMENT!I4,0,CLASSEMENT!I5-CLASSEMENT!$I$4)","v":"00:00:00"}]
[{"$f":"CLASSEMENT!$B6","v":3},{"$f":"CLASSEMENT!C6","v":2},{"$f":"CLASSEMENT!D6","v":"BARS   Gabin"},null,{"$f":"CLASSEMENT!F6","v":"begard vtt gwerun"},{"$f":"CLASSEMENT!G6","v":407364},{"$f":"CLASSEMENT!H6","v":"poussin"},{"$f":"IF(CLASSEMENT!I6=CLASSEMENT!I5,0,CLASSEMENT!I6-CLASSEMENT!$I$4)","v":"00:00:00"}]
[{"$f":"CLASSEMENT!$B7","v":4},{"$f":"CLASSEMENT!C7","v":5},{"$f":"CLASSEMENT!D7","v":"MACE   Loukas"},null,{"$f":"CLASSEMENT!F7","v":"vc evron"},{"$f":"CLASSEMENT!G7","v":996776},{"$f":"CLASSEMENT!H7","v":"poussin"},{"$f":"IF(CLASSEMENT!I7=CLASSEMENT!I6,0,CLASSEMENT!I7-CLASSEMENT!$I$4)","v":"00:00:00"}]
[{"$f":"CLASSEMENT!$B8","v":5},{"$f":"CLASSEMENT!C8","v":1},{"$f":"CLASSEMENT!D8","v":"LEVEQUE    Nathan"},null,{"$f":"CLASSEMENT!F8","v":"district loudéac"},{"$f":"CLASSEMENT!G8","v":0},{"$f":"CLASSEMENT!H8","v":"poussin"},{"$f":"IF(CLASSEMENT!I8=CLASSEMENT!I7,0,CLASSEMENT!I8-CLASSEMENT!$I$4)","v":"00:00:00"}]
[{"$f":"CLASSEMENT!$B9","v":0},{"$f":"CLASSEMENT!C9","v":0},{"$f":"CLASSEMENT!D9","v":" "},null,{"$f":"CLASSEMENT!F9","v":" "},{"$f":"CLASSEMENT!G9","v":" "},{"$f":"CLASSEMENT!H9","v":" "},{"$f":"IF(CLASSEMENT!I9=CLASSEMENT!I8,0,CLASSEMENT!I9-CLASSEMENT!$I$4)","v":"00:00:00"}]
[{"$f":"CLASSEMENT!$B10","v":1},{"$f":"CLASSEMENT!C10","v":6},{"$f":"CLASSEMENT!D10","v":"BARS   Yvann"},null,{"$f":"CLASSEMENT!F10","v":"begard vtt gwerun"},{"$f":"CLASSEMENT!G10","v":310008},{"$f":"CLASSEMENT!H10","v":"pupille"},{"$f":"IF(CLASSEMENT!I10=CLASSEMENT!I9,0,CLASSEMENT!I10-CLASSEMENT!$I$4)","v":"00:00:00"}]
[{"$f":"CLASSEMENT!$B11","v":2},{"$f":"CLASSEMENT!C11","v":8},{"$f":"CLASSEMENT!D11","v":"LEPERCQ   Batiste"},null,{"$f":"CLASSEMENT!F11","v":"uc plaudren"},{"$f":"CLASSEMENT!G11","v":391433},{"$f":"CLASSEMENT!H11","v":"pupille"},{"$f":"IF(CLASSEMENT!I11=CLASSEMENT!I10,0,CLASSEMENT!I11-CLASSEMENT!$I$4)","v":"00:00:00"}]
[{"$f":"CLASSEMENT!$B12","v":3},{"$f":"CLASSEMENT!C12","v":7},{"$f":"CLASSEMENT!D12","v":"COLAS   Thibaut"},null,{"$f":"CLASSEMENT!F12","v":"begard vtt gwerun"},{"$f":"CLASSEMENT!G12","v":330206},{"$f":"CLASSEMENT!H12","v":"pupille"},{"$f":"IF(CLASSEMENT!I12=CLASSEMENT!I11,0,CLASSEMENT!I12-CLASSEMENT!$I$4)","v":"00:00:00"}]
[{"$f":"CLASSEMENT!$B13","v":4},{"$f":"CLASSEMENT!C13","v":9},{"$f":"CLASSEMENT!D13","v":"CLERET MARECHAL   Loeiz"},null,{"$f":"CLASSEMENT!F13","v":"vtt cotes d'armor hillion"},{"$f":"CLASSEMENT!G13","v":0},{"$f":"CLASSEMENT!H13","v":"pupille"},{"$f":"IF(CLASSEMENT!I13=CLASSEMENT!I12,0,CLASSEMENT!I13-CLASSEMENT!$I$4)","v":"00:00:00"}]
[{"$f":"CLASSEMENT!$B14","v":0},{"$f":"CLASSEMENT!C14","v":0},{"$f":"CLASSEMENT!D14","v":" "},null,{"$f":"CLASSEMENT!F14","v":" "},{"$f":"CLASSEMENT!G14","v":" "},{"$f":"CLASSEMENT!H14","v":" "},{"$f":"IF(CLASSEMENT!I14=CLASSEMENT!I13,0,CLASSEMENT!I14-CLASSEMENT!$I$4)","v":"00:00:00"}]
[{"$f":"CLASSEMENT!$B15","v":1},{"$f":"CLASSEMENT!C15","v":11},{"$f":"CLASSEMENT!D15","v":"POILVET   Jules"},null,{"$f":"CLASSEMENT!F15","v":"vc evron"},{"$f":"CLASSEMENT!G15","v":382431},{"$f":"CLASSEMENT!H15","v":"benjamin"},{"$f":"IF(CLASSEMENT!I15=CLASSEMENT!I14,0,CLASSEMENT!I15-CLASSEMENT!$I$4)","v":"00:00:00"}]
[{"$f":"CLASSEMENT!$B16","v":2},{"$f":"CLASSEMENT!C16","v":14},{"$f":"CLASSEMENT!D16","v":"BANNER   Rafael"},null,{"$f":"CLASSEMENT!F16","v":"vtt du lié"},{"$f":"CLASSEMENT!G16","v":0},{"$f":"CLASSEMENT!H16","v":"benjamin"},{"$f":"IF(CLASSEMENT!I16=CLASSEMENT!I15,0,CLASSEMENT!I16-CLASSEMENT!$I$4)","v":"00:00:00"}]
[{"$f":"CLASSEMENT!$B17","v":3},{"$f":"CLASSEMENT!C17","v":16},{"$f":"CLASSEMENT!D17","v":"BOUGEARD HORNAIS   Aymeris"},null,{"$f":"CLASSEMENT!F17","v":"team bikers"},{"$f":"CLASSEMENT!G17","v":431285},{"$f":"CLASSEMENT!H17","v":"benjamin"},{"$f":"IF(CLASSEMENT!I17=CLASSEMENT!I16,0,CLASSEMENT!I17-CLASSEMENT!$I$4)","v":"00:00:00"}]
[{"$f":"CLASSEMENT!$B18","v":4},{"$f":"CLASSEMENT!C18","v":15},{"$f":"CLASSEMENT!D18","v":"BRIAND   Axel"},null,{"$f":"CLASSEMENT!F18","v":"team bikers"},{"$f":"CLASSEMENT!G18","v":429219},{"$f":"CLASSEMENT!H18","v":"benjamin"},{"$f":"IF(CLASSEMENT!I18=CLASSEMENT!I17,0,CLASSEMENT!I18-CLASSEMENT!$I$4)","v":"00:00:00"}]
[{"$f":"CLASSEMENT!$B19","v":5},{"$f":"CLASSEMENT!C19","v":10},{"$f":"CLASSEMENT!D19","v":"POILVET   Paul"},null,{"$f":"CLASSEMENT!F19","v":"vc evron"},{"$f":"CLASSEMENT!G19","v":382428},{"$f":"CLASSEMENT!H19","v":"benjamin"},{"$f":"IF(CLASSEMENT!I19=CLASSEMENT!I18,0,CLASSEMENT!I19-CLASSEMENT!$I$4)","v":"00:00:00"}]
[{"$f":"CLASSEMENT!$B20","v":6},{"$f":"CLASSEMENT!C20","v":13},{"$f":"CLASSEMENT!D20","v":"BOLORE   Loevan"},null,{"$f":"CLASSEMENT!F20","v":"team bikers"},{"$f":"CLASSEMENT!G20","v":376265},{"$f":"CLASSEMENT!H20","v":"benjamin"},{"$f":"IF(CLASSEMENT!I20=CLASSEMENT!I19,0,CLASSEMENT!I20-CLASSEMENT!$I$4)","v":"00:00:00"}]
[{"$f":"CLASSEMENT!$B21","v":7},{"$f":"CLASSEMENT!C21","v":12},{"$f":"CLASSEMENT!D21","v":"LEPERCQ   Clara"},null,{"$f":"CLASSEMENT!F21","v":"uc plaudren"},{"$f":"CLASSEMENT!G21","v":467480},{"$f":"CLASSEMENT!H21","v":"benjamin"},{"$f":"IF(CLASSEMENT!I21=CLASSEMENT!I20,0,CLASSEMENT!I21-CLASSEMENT!$I$4)","v":"00:00:00"}]
[{"$f":"CLASSEMENT!$B22","v":0},{"$f":"CLASSEMENT!C22","v":0},{"$f":"CLASSEMENT!D22","v":" "},null,{"$f":"CLASSEMENT!F22","v":" "},{"$f":"CLASSEMENT!G22","v":" "},{"$f":"CLASSEMENT!H22","v":" "},{"$f":"IF(CLASSEMENT!I22=CLASSEMENT!I21,0,CLASSEMENT!I22-CLASSEMENT!$I$4)","v":"00:00:00"}]
[{"$f":"CLASSEMENT!$B23","v":1},{"$f":"CLASSEMENT!C23","v":27},{"$f":"CLASSEMENT!D23","v":"GUILMIN   Léo"},null,{"$f":"CLASSEMENT!F23","v":"vc evron"},{"$f":"CLASSEMENT!G23","v":344464},{"$f":"CLASSEMENT!H23","v":"minimes"},{"$f":"IF(CLASSEMENT!I23=CLASSEMENT!I22,0,CLASSEMENT!I23-CLASSEMENT!$I$4)","v":"00:00:00"}]
[{"$f":"CLASSEMENT!$B24","v":2},{"$f":"CLASSEMENT!C24","v":24},{"$f":"CLASSEMENT!D24","v":"BASSET   Loris"},null,{"$f":"CLASSEMENT!F24","v":"vc evron"},{"$f":"CLASSEMENT!G24","v":0},{"$f":"CLASSEMENT!H24","v":"minimes"},{"$f":"IF(CLASSEMENT!I24=CLASSEMENT!I23,0,CLASSEMENT!I24-CLASSEMENT!$I$4)","v":"00:00:00"}]
[{"$f":"CLASSEMENT!$B25","v":3},{"$f":"CLASSEMENT!C25","v":20},{"$f":"CLASSEMENT!D25","v":"BRIEND   Ilhan"},null,{"$f":"CLASSEMENT!F25","v":"accro cycles cotes d'émeraude"},{"$f":"CLASSEMENT!G25","v":919871},{"$f":"CLASSEMENT!H25","v":"minimes"},{"$f":"IF(CLASSEMENT!I25=CLASSEMENT!I24,0,CLASSEMENT!I25-CLASSEMENT!$I$4)","v":"00:00:00"}]
[{"$f":"CLASSEMENT!$B26","v":4},{"$f":"CLASSEMENT!C26","v":21},{"$f":"CLASSEMENT!D26","v":"LE BIHAN   Clément "},null,{"$f":"CLASSEMENT!F26","v":"uc plaudren"},{"$f":"CLASSEMENT!G26","v":968158},{"$f":"CLASSEMENT!H26","v":"minimes"},{"$f":"IF(CLASSEMENT!I26=CLASSEMENT!I25,0,CLASSEMENT!I26-CLASSEMENT!$I$4)","v":"00:00:00"}]
[{"$f":"CLASSEMENT!$B27","v":5},{"$f":"CLASSEMENT!C27","v":26},{"$f":"CLASSEMENT!D27","v":"BOUGEARD   Margot"},null,{"$f":"CLASSEMENT!F27","v":"team bikers"},{"$f":"CLASSEMENT!G27","v":431290},{"$f":"CLASSEMENT!H27","v":"minimes"},{"$f":"IF(CLASSEMENT!I27=CLASSEMENT!I26,0,CLASSEMENT!I27-CLASSEMENT!$I$4)","v":"00:00:00"}]
[{"$f":"CLASSEMENT!$B28","v":6},{"$f":"CLASSEMENT!C28","v":23},{"$f":"CLASSEMENT!D28","v":"ROUILLE   Robin"},null,{"$f":"CLASSEMENT!F28","v":"team bikers"},{"$f":"CLASSEMENT!G28","v":390947},{"$f":"CLASSEMENT!H28","v":"minimes"},{"$f":"IF(CLASSEMENT!I28=CLASSEMENT!I27,0,CLASSEMENT!I28-CLASSEMENT!$I$4)","v":"00:00:00"}]
[{"$f":"CLASSEMENT!$B29","v":7},{"$f":"CLASSEMENT!C29","v":25},{"$f":"CLASSEMENT!D29","v":"BRIAND   Mathis"},null,{"$f":"CLASSEMENT!F29","v":"team bikers"},{"$f":"CLASSEMENT!G29","v":431995},{"$f":"CLASSEMENT!H29","v":"minimes"},{"$f":"IF(CLASSEMENT!I29=CLASSEMENT!I28,0,CLASSEMENT!I29-CLASSEMENT!$I$4)","v":"00:00:00"}]
[{"$f":"CLASSEMENT!$B30","v":8},{"$f":"CLASSEMENT!C30","v":22},{"$f":"CLASSEMENT!D30","v":"BOLORE   Ewen"},null,{"$f":"CLASSEMENT!F30","v":"team bikers"},{"$f":"CLASSEMENT!G30","v":376263},{"$f":"CLASSEMENT!H30","v":"minimes"},{"$f":"IF(CLASSEMENT!I30=CLASSEMENT!I29,0,CLASSEMENT!I30-CLASSEMENT!$I$4)","v":"00:00:00"}]
[{"$f":"CLASSEMENT!$B31","v":0},{"$f":"CLASSEMENT!C31","v":0},{"$f":"CLASSEMENT!D31","v":" "},null,{"$f":"CLASSEMENT!F31","v":" "},{"$f":"CLASSEMENT!G31","v":" "},{"$f":"CLASSEMENT!H31","v":" "},{"$f":"IF(CLASSEMENT!I31=CLASSEMENT!I30,0,CLASSEMENT!I31-CLASSEMENT!$I$4)","v":"00:00:00"}]
[{"$f":"CLASSEMENT!$B32","v":1},{"$f":"CLASSEMENT!C32","v":30},{"$f":"CLASSEMENT!D32","v":"FERTE   Brandon"},null,{"$f":"CLASSEMENT!F32","v":"distric loudéac"},{"$f":"CLASSEMENT!G32","v":297227},{"$f":"CLASSEMENT!H32","v":"cadet"},{"$f":"IF(CLASSEMENT!I32=CLASSEMENT!I31,0,CLASSEMENT!I32-CLASSEMENT!$I$4)","v":"00:00:00"}]
[{"$f":"CLASSEMENT!$B33","v":2},{"$f":"CLASSEMENT!C33","v":31},{"$f":"CLASSEMENT!D33","v":"LEPERCQ   Nathan"},null,{"$f":"CLASSEMENT!F33","v":"uc plaudren"},{"$f":"CLASSEMENT!G33","v":389000},{"$f":"CLASSEMENT!H33","v":"cadet"},{"$f":"IF(CLASSEMENT!I33=CLASSEMENT!I32,0,CLASSEMENT!I33-CLASSEMENT!$I$4)","v":"00:00:00"}]
[{"$f":"CLASSEMENT!$B34","v":0},{"$f":"CLASSEMENT!C34","v":0},{"$f":"CLASSEMENT!D34","v":" "},null,{"$f":"CLASSEMENT!F34","v":" "},{"$f":"CLASSEMENT!G34","v":" "},{"$f":"CLASSEMENT!H34","v":" "},{"$f":"IF(CLASSEMENT!I34=CLASSEMENT!I33,0,CLASSEMENT!I34-CLASSEMENT!$I$4)","v":"00:00:00"}]
[{"$f":"CLASSEMENT!$B35","v":1},{"$f":"CLASSEMENT!C35","v":35},{"$f":"CLASSEMENT!D35","v":"HALLET   Baptiste"},null,{"$f":"CLASSEMENT!F35","v":"vc plurien"},{"$f":"CLASSEMENT!G35","v":136613},{"$f":"CLASSEMENT!H35","v":"espoir"},{"$f":"IF(CLASSEMENT!I35=CLASSEMENT!I34,0,CLASSEMENT!I35-CLASSEMENT!$I$4)","v":"00:00:00"}]
[{"$f":"CLASSEMENT!$B36","v":0},{"$f":"CLASSEMENT!C36","v":0},{"$f":"CLASSEMENT!D36","v":" "},null,{"$f":"CLASSEMENT!F36","v":" "},{"$f":"CLASSEMENT!G36","v":" "},{"$f":"CLASSEMENT!H36","v":" "},{"$f":"IF(CLASSEMENT!I36=CLASSEMENT!I35,0,CLASSEMENT!I36-CLASSEMENT!$I$4)","v":"00:00:00"}]
[{"$f":"CLASSEMENT!$B37","v":1},{"$f":"CLASSEMENT!C37","v":42},{"$f":"CLASSEMENT!D37","v":"BOUGEARD   Pierre-Yves"},null,{"$f":"CLASSEMENT!F37","v":"team bickers"},{"$f":"CLASSEMENT!G37","v":376257},{"$f":"CLASSEMENT!H37","v":"1ère cat"},{"$f":"IF(CLASSEMENT!I37=CLASSEMENT!I36,0,CLASSEMENT!I37-CLASSEMENT!$I$4)","v":"00:00:00"}]
[{"$f":"CLASSEMENT!$B38","v":2},{"$f":"CLASSEMENT!C38","v":43},{"$f":"CLASSEMENT!D38","v":"BASSET   Emerick"},null,{"$f":"CLASSEMENT!F38","v":"vc evron"},{"$f":"CLASSEMENT!G38","v":371872},{"$f":"CLASSEMENT!H38","v":"1ère cat"},{"$f":"IF(CLASSEMENT!I38=CLASSEMENT!I37,0,CLASSEMENT!I38-CLASSEMENT!$I$4)","v":"00:00:00"}]
[{"$f":"CLASSEMENT!$B39","v":3},{"$f":"CLASSEMENT!C39","v":40},{"$f":"CLASSEMENT!D39","v":"KEURMEUR   Romain"},null,{"$f":"CLASSEMENT!F39","v":"team mégrit"},{"$f":"CLASSEMENT!G39","v":363251},{"$f":"CLASSEMENT!H39","v":"1ère cat"},{"$f":"IF(CLASSEMENT!I39=CLASSEMENT!I38,0,CLASSEMENT!I39-CLASSEMENT!$I$4)","v":"00:00:00"}]
[{"$f":"CLASSEMENT!$B40","v":4},{"$f":"CLASSEMENT!C40","v":41},{"$f":"CLASSEMENT!D40","v":"BANNER   Mickael"},null,{"$f":"CLASSEMENT!F40","v":"vtt du lié"},{"$f":"CLASSEMENT!G40","v":950036},{"$f":"CLASSEMENT!H40","v":"1ère cat"},{"$f":"IF(CLASSEMENT!I40=CLASSEMENT!I39,0,CLASSEMENT!I40-CLASSEMENT!$I$4)","v":"00:00:00"}]
[{"$f":"CLASSEMENT!$B41","v":0},{"$f":"CLASSEMENT!C41","v":0},{"$f":"CLASSEMENT!D41","v":" "},null,{"$f":"CLASSEMENT!F41","v":" "},{"$f":"CLASSEMENT!G41","v":" "},{"$f":"CLASSEMENT!H41","v":" "},{"$f":"IF(CLASSEMENT!I41=CLASSEMENT!I40,0,CLASSEMENT!I41-CLASSEMENT!$I$4)","v":"00:00:00"}]
[{"$f":"CLASSEMENT!$B42","v":1},{"$f":"CLASSEMENT!C42","v":48},{"$f":"CLASSEMENT!D42","v":"COLAS   Emmanuel"},null,{"$f":"CLASSEMENT!F42","v":"begard vtt gwerun"},{"$f":"CLASSEMENT!G42","v":386450},{"$f":"CLASSEMENT!H42","v":"2ème cat"},{"$f":"IF(CLASSEMENT!I42=CLASSEMENT!I41,0,CLASSEMENT!I42-CLASSEMENT!$I$4)","v":"00:00:00"}]
[{"$f":"CLASSEMENT!$B43","v":2},{"$f":"CLASSEMENT!C43","v":54},{"$f":"CLASSEMENT!D43","v":"LECOMTE    Guillaume"},null,{"$f":"CLASSEMENT!F43","v":"team xc du léguer"},{"$f":"CLASSEMENT!G43","v":998834},{"$f":"CLASSEMENT!H43","v":"2ème cat"},{"$f":"IF(CLASSEMENT!I43=CLASSEMENT!I42,0,CLASSEMENT!I43-CLASSEMENT!$I$4)","v":"00:00:00"}]
[{"$f":"CLASSEMENT!$B44","v":3},{"$f":"CLASSEMENT!C44","v":53},{"$f":"CLASSEMENT!D44","v":"MARIVINT   Alexis"},null,{"$f":"CLASSEMENT!F44","v":"vc evron"},{"$f":"CLASSEMENT!G44","v":294510},{"$f":"CLASSEMENT!H44","v":"2ème cat"},{"$f":"IF(CLASSEMENT!I44=CLASSEMENT!I43,0,CLASSEMENT!I44-CLASSEMENT!$I$4)","v":"00:00:00"}]
[{"$f":"CLASSEMENT!$B45","v":4},{"$f":"CLASSEMENT!C45","v":50},{"$f":"CLASSEMENT!D45","v":"MACE   Jérome"},null,{"$f":"CLASSEMENT!F45","v":"vc evron"},{"$f":"CLASSEMENT!G45","v":434904},{"$f":"CLASSEMENT!H45","v":"2ème cat"},{"$f":"IF(CLASSEMENT!I45=CLASSEMENT!I44,0,CLASSEMENT!I45-CLASSEMENT!$I$4)","v":"00:00:00"}]
[{"$f":"CLASSEMENT!$B46","v":5},{"$f":"CLASSEMENT!C46","v":49},{"$f":"CLASSEMENT!D46","v":"COLLEU   Pascal"},null,{"$f":"CLASSEMENT!F46","v":"ccvb"},{"$f":"CLASSEMENT!G46","v":511956},{"$f":"CLASSEMENT!H46","v":"2ème cat"},{"$f":"IF(CLASSEMENT!I46=CLASSEMENT!I45,0,CLASSEMENT!I46-CLASSEMENT!$I$4)","v":"00:00:00"}]
[{"$f":"CLASSEMENT!$B47","v":6},{"$f":"CLASSEMENT!C47","v":51},{"$f":"CLASSEMENT!D47","v":"BRIAND    Régis"},null,{"$f":"CLASSEMENT!F47","v":"team bickers"},{"$f":"CLASSEMENT!G47","v":429231},{"$f":"CLASSEMENT!H47","v":"2ème cat"},{"$f":"IF(CLASSEMENT!I47=CLASSEMENT!I46,0,CLASSEMENT!I47-CLASSEMENT!$I$4)","v":"00:00:00"}]
[{"$f":"CLASSEMENT!$B48","v":7},{"$f":"CLASSEMENT!C48","v":45},{"$f":"CLASSEMENT!D48","v":"JEUNEU   Gilles"},null,{"$f":"CLASSEMENT!F48","v":"accro cycles cotes d'émeraude"},{"$f":"CLASSEMENT!G48","v":137390},{"$f":"CLASSEMENT!H48","v":"2ème cat"},{"$f":"IF(CLASSEMENT!I48=CLASSEMENT!I47,0,CLASSEMENT!I48-CLASSEMENT!$I$4)","v":"00:00:00"}]
[{"$f":"CLASSEMENT!$B49","v":8},{"$f":"CLASSEMENT!C49","v":46},{"$f":"CLASSEMENT!D49","v":"LESNE   Régis"},null,{"$f":"CLASSEMENT!F49","v":"district loudéac"},{"$f":"CLASSEMENT!G49","v":227933},{"$f":"CLASSEMENT!H49","v":"2ème cat"},{"$f":"IF(CLASSEMENT!I49=CLASSEMENT!I48,0,CLASSEMENT!I49-CLASSEMENT!$I$4)","v":"00:00:00"}]
[{"$f":"CLASSEMENT!$B50","v":9},{"$f":"CLASSEMENT!C50","v":47},{"$f":"CLASSEMENT!D50","v":"BEDEL   Bapiste"},null,{"$f":"CLASSEMENT!F50","v":"district loudéac"},{"$f":"CLASSEMENT!G50","v":13637},{"$f":"CLASSEMENT!H50","v":"2ème cat"},{"$f":"IF(CLASSEMENT!I50=CLASSEMENT!I49,0,CLASSEMENT!I50-CLASSEMENT!$I$4)","v":"00:00:00"}]
[{"$f":"CLASSEMENT!$B51","v":"DNF"},{"$f":"CLASSEMENT!C51","v":52},{"$f":"CLASSEMENT!D51","v":"MOUTTE   Alexis"},null,{"$f":"CLASSEMENT!F51","v":"team du pays de dinan guinefort"},{"$f":"CLASSEMENT!G51","v":0},{"$f":"CLASSEMENT!H51","v":"2ème cat"},{"$f":"IF(CLASSEMENT!I51=CLASSEMENT!I50,0,CLASSEMENT!I51-CLASSEMENT!$I$4)","v":"00:00:00"}]
[{"$f":"CLASSEMENT!$B52","v":0},{"$f":"CLASSEMENT!C52","v":0},{"$f":"CLASSEMENT!D52","v":" "},null,{"$f":"CLASSEMENT!F52","v":" "},{"$f":"CLASSEMENT!G52","v":" "},{"$f":"CLASSEMENT!H52","v":" "},{"$f":"IF(CLASSEMENT!I52=CLASSEMENT!I51,0,CLASSEMENT!I52-CLASSEMENT!$I$4)","v":"00:00:00"}]
[{"$f":"CLASSEMENT!$B53","v":1},{"$f":"CLASSEMENT!C53","v":72},{"$f":"CLASSEMENT!D53","v":"LECELLIER   Raymond"},null,{"$f":"CLASSEMENT!F53","v":"team mégrit"},{"$f":"CLASSEMENT!G53","v":55656150},{"$f":"CLASSEMENT!H53","v":"3ème cat"},{"$f":"IF(CLASSEMENT!I53=CLASSEMENT!I52,0,CLASSEMENT!I53-CLASSEMENT!$I$4)","v":"00:00:00"}]
[{"$f":"CLASSEMENT!$B54","v":2},{"$f":"CLASSEMENT!C54","v":65},{"$f":"CLASSEMENT!D54","v":"NICOLAS    Jean Charles"},null,{"$f":"CLASSEMENT!F54","v":"ac vildé guingalan"},{"$f":"CLASSEMENT!G54","v":514101},{"$f":"CLASSEMENT!H54","v":"3ème cat"},{"$f":"IF(CLASSEMENT!I54=CLASSEMENT!I53,0,CLASSEMENT!I54-CLASSEMENT!$I$4)","v":"00:00:00"}]
[{"$f":"CLASSEMENT!$B55","v":3},{"$f":"CLASSEMENT!C55","v":64},{"$f":"CLASSEMENT!D55","v":"LEMAITRE   Alain"},null,{"$f":"CLASSEMENT!F55","v":"ac vildé guingalan"},{"$f":"CLASSEMENT!G55","v":225454},{"$f":"CLASSEMENT!H55","v":"3ème cat"},{"$f":"IF(CLASSEMENT!I55=CLASSEMENT!I54,0,CLASSEMENT!I55-CLASSEMENT!$I$4)","v":"00:00:00"}]
[{"$f":"CLASSEMENT!$B56","v":4},{"$f":"CLASSEMENT!C56","v":73},{"$f":"CLASSEMENT!D56","v":"ROPERCH   Bruno"},null,{"$f":"CLASSEMENT!F56","v":"uc plaudren"},{"$f":"CLASSEMENT!G56","v":875266},{"$f":"CLASSEMENT!H56","v":"3ème cat"},{"$f":"IF(CLASSEMENT!I56=CLASSEMENT!I55,0,CLASSEMENT!I56-CLASSEMENT!$I$4)","v":"00:00:00"}]
[{"$f":"CLASSEMENT!$B57","v":5},{"$f":"CLASSEMENT!C57","v":68},{"$f":"CLASSEMENT!D57","v":"GOUYA   Alain"},null,{"$f":"CLASSEMENT!F57","v":"district loudéac"},{"$f":"CLASSEMENT!G57","v":136125},{"$f":"CLASSEMENT!H57","v":"3ème cat"},{"$f":"IF(CLASSEMENT!I57=CLASSEMENT!I56,0,CLASSEMENT!I57-CLASSEMENT!$I$4)","v":"00:00:00"}]
[{"$f":"CLASSEMENT!$B58","v":6},{"$f":"CLASSEMENT!C58","v":61},{"$f":"CLASSEMENT!D58","v":"GUILLOT   Denis"},null,{"$f":"CLASSEMENT!F58","v":"team du pays de dinan guinefort"},{"$f":"CLASSEMENT!G58","v":844159},{"$f":"CLASSEMENT!H58","v":"3ème cat"},{"$f":"IF(CLASSEMENT!I58=CLASSEMENT!I57,0,CLASSEMENT!I58-CLASSEMENT!$I$4)","v":"00:00:00"}]
[{"$f":"CLASSEMENT!$B59","v":7},{"$f":"CLASSEMENT!C59","v":60},{"$f":"CLASSEMENT!D59","v":"GOUYA   Noel"},null,{"$f":"CLASSEMENT!F59","v":"team du pays de dinan guinefort"},{"$f":"CLASSEMENT!G59","v":226768},{"$f":"CLASSEMENT!H59","v":"3ème cat"},{"$f":"IF(CLASSEMENT!I59=CLASSEMENT!I58,0,CLASSEMENT!I59-CLASSEMENT!$I$4)","v":"00:00:00"}]
[{"$f":"CLASSEMENT!$B60","v":8},{"$f":"CLASSEMENT!C60","v":63},{"$f":"CLASSEMENT!D60","v":"COUALAN   Dominique"},null,{"$f":"CLASSEMENT!F60","v":"cc pleven"},{"$f":"CLASSEMENT!G60","v":153631},{"$f":"CLASSEMENT!H60","v":"3ème cat"},{"$f":"IF(CLASSEMENT!I60=CLASSEMENT!I59,0,CLASSEMENT!I60-CLASSEMENT!$I$4)","v":"00:00:00"}]
[{"$f":"CLASSEMENT!$B61","v":9},{"$f":"CLASSEMENT!C61","v":71},{"$f":"CLASSEMENT!D61","v":"GOUPIL   Michel"},null,{"$f":"CLASSEMENT!F61","v":"team mégrit"},{"$f":"CLASSEMENT!G61","v":55779611},{"$f":"CLASSEMENT!H61","v":"3ème cat"},{"$f":"IF(CLASSEMENT!I61=CLASSEMENT!I60,0,CLASSEMENT!I61-CLASSEMENT!$I$4)","v":"00:00:00"}]
[{"$f":"CLASSEMENT!$B62","v":10},{"$f":"CLASSEMENT!C62","v":70},{"$f":"CLASSEMENT!D62","v":"COLAS    Roger"},null,{"$f":"CLASSEMENT!F62","v":"vc crehen"},{"$f":"CLASSEMENT!G62","v":227437},{"$f":"CLASSEMENT!H62","v":"3ème cat"},{"$f":"IF(CLASSEMENT!I62=CLASSEMENT!I61,0,CLASSEMENT!I62-CLASSEMENT!$I$4)","v":"00:00:00"}]
[{"$f":"CLASSEMENT!$B63","v":11},{"$f":"CLASSEMENT!C63","v":66},{"$f":"CLASSEMENT!D63","v":"GEORGET   Charles"},null,{"$f":"CLASSEMENT!F63","v":"district loudéac"},{"$f":"CLASSEMENT!G63","v":227931},{"$f":"CLASSEMENT!H63","v":"3ème cat"},{"$f":"IF(CLASSEMENT!I63=CLASSEMENT!I62,0,CLASSEMENT!I63-CLASSEMENT!$I$4)","v":"00:00:00"}]
[{"$f":"CLASSEMENT!$B64","v":12},{"$f":"CLASSEMENT!C64","v":67},{"$f":"CLASSEMENT!D64","v":"BEDEL    Michel"},null,{"$f":"CLASSEMENT!F64","v":"district loudéac"},{"$f":"CLASSEMENT!G64","v":267277},{"$f":"CLASSEMENT!H64","v":"3ème cat"},{"$f":"IF(CLASSEMENT!I64=CLASSEMENT!I63,0,CLASSEMENT!I64-CLASSEMENT!$I$4)","v":"00:00:00"}]
[{"$f":"CLASSEMENT!$B65","v":13},{"$f":"CLASSEMENT!C65","v":69},{"$f":"CLASSEMENT!D65","v":"GAILLARD   Marcel"},null,{"$f":"CLASSEMENT!F65","v":"cos kerentrech"},{"$f":"CLASSEMENT!G65","v":57243},{"$f":"CLASSEMENT!H65","v":"3ème cat"},{"$f":"IF(CLASSEMENT!I65=CLASSEMENT!I64,0,CLASSEMENT!I65-CLASSEMENT!$I$4)","v":"00:00:00"}]
[{"$f":"CLASSEMENT!$B66","v":"DNF"},{"$f":"CLASSEMENT!C66","v":62},{"$f":"CLASSEMENT!D66","v":"DURAND   Jacques"},null,{"$f":"CLASSEMENT!F66","v":"team du pays de dinan guinefort"},{"$f":"CLASSEMENT!G66","v":144227},{"$f":"CLASSEMENT!H66","v":"3ème cat"},{"$f":"IF(CLASSEMENT!I66=CLASSEMENT!I65,0,CLASSEMENT!I66-CLASSEMENT!$I$4)","v":"00:00:00"}]
[{"$f":"CLASSEMENT!$B67","v":0},{"$f":"CLASSEMENT!C67","v":0},{"$f":"CLASSEMENT!D67","v":" "},null,{"$f":"CLASSEMENT!F67","v":" "},{"$f":"CLASSEMENT!G67","v":" "},{"$f":"CLASSEMENT!H67","v":" "},{"$f":"IF(CLASSEMENT!I67=CLASSEMENT!I66,0,CLASSEMENT!I67-CLASSEMENT!$I$4)","v":"00:00:00"}]
[{"$f":"CLASSEMENT!$B68","v":0},{"$f":"CLASSEMENT!C68","v":0},{"$f":"CLASSEMENT!D68","v":" "},null,{"$f":"CLASSEMENT!F68","v":" "},{"$f":"CLASSEMENT!G68","v":" "},{"$f":"CLASSEMENT!H68","v":" "},{"$f":"IF(CLASSEMENT!I68=CLASSEMENT!I67,0,CLASSEMENT!I68-CLASSEMENT!$I$4)","v":"00:00:00"}]
[{"$f":"CLASSEMENT!$B69","v":0},{"$f":"CLASSEMENT!C69","v":0},{"$f":"CLASSEMENT!D69","v":" "},null,{"$f":"CLASSEMENT!F69","v":" "},{"$f":"CLASSEMENT!G69","v":" "},{"$f":"CLASSEMENT!H69","v":" "},{"$f":"IF(CLASSEMENT!I69=CLASSEMENT!I68,0,CLASSEMENT!I69-CLASSEMENT!$I$4)","v":"00:00:00"}]
[{"$f":"CLASSEMENT!$B70","v":0},{"$f":"CLASSEMENT!C70","v":0},{"$f":"CLASSEMENT!D70","v":" "},null,{"$f":"CLASSEMENT!F70","v":" "},{"$f":"CLASSEMENT!G70","v":" "},{"$f":"CLASSEMENT!H70","v":" "},{"$f":"IF(CLASSEMENT!I70=CLASSEMENT!I69,0,CLASSEMENT!I70-CLASSEMENT!$I$4)","v":"00:00:00"}]
[{"$f":"CLASSEMENT!$B71","v":0},{"$f":"CLASSEMENT!C71","v":0},{"$f":"CLASSEMENT!D71","v":" "},null,{"$f":"CLASSEMENT!F71","v":" "},{"$f":"CLASSEMENT!G71","v":" "},{"$f":"CLASSEMENT!H71","v":" "},{"$f":"IF(CLASSEMENT!I71=CLASSEMENT!I70,0,CLASSEMENT!I71-CLASSEMENT!$I$4)","v":"00:00:00"}]
[{"$f":"CLASSEMENT!$B72","v":0},{"$f":"CLASSEMENT!C72","v":0},{"$f":"CLASSEMENT!D72","v":" "},null,{"$f":"CLASSEMENT!F72","v":" "},{"$f":"CLASSEMENT!G72","v":" "},{"$f":"CLASSEMENT!H72","v":" "},{"$f":"IF(CLASSEMENT!I72=CLASSEMENT!I71,0,CLASSEMENT!I72-CLASSEMENT!$I$4)","v":"00:00:00"}]
[{"$f":"CLASSEMENT!$B73","v":0},{"$f":"CLASSEMENT!C73","v":0},{"$f":"CLASSEMENT!D73","v":" "},null,{"$f":"CLASSEMENT!F73","v":" "},{"$f":"CLASSEMENT!G73","v":" "},{"$f":"CLASSEMENT!H73","v":" "},{"$f":"IF(CLASSEMENT!I73=CLASSEMENT!I72,0,CLASSEMENT!I73-CLASSEMENT!$I$4)","v":"00:00:00"}]
[{"$f":"CLASSEMENT!$B74","v":0},{"$f":"CLASSEMENT!C74","v":0},{"$f":"CLASSEMENT!D74","v":" "},null,{"$f":"CLASSEMENT!F74","v":" "},{"$f":"CLASSEMENT!G74","v":" "},{"$f":"CLASSEMENT!H74","v":" "},{"$f":"IF(CLASSEMENT!I74=CLASSEMENT!I73,0,CLASSEMENT!I74-CLASSEMENT!$I$4)","v":"00:00:00"}]
[{"$f":"CLASSEMENT!$B75","v":0},{"$f":"CLASSEMENT!C75","v":0},{"$f":"CLASSEMENT!D75","v":" "},null,{"$f":"CLASSEMENT!F75","v":" "},{"$f":"CLASSEMENT!G75","v":" "},{"$f":"CLASSEMENT!H75","v":" "},{"$f":"IF(CLASSEMENT!I75=CLASSEMENT!I74,0,CLASSEMENT!I75-CLASSEMENT!$I$4)","v":"00:00:00"}]
[{"$f":"CLASSEMENT!$B76","v":0},{"$f":"CLASSEMENT!C76","v":0},{"$f":"CLASSEMENT!D76","v":" "},null,{"$f":"CLASSEMENT!F76","v":" "},{"$f":"CLASSEMENT!G76","v":" "},{"$f":"CLASSEMENT!H76","v":" "},{"$f":"IF(CLASSEMENT!I76=CLASSEMENT!I75,0,CLASSEMENT!I76-CLASSEMENT!$I$4)","v":"00:00:00"}]
[{"$f":"CLASSEMENT!$B77","v":0},{"$f":"CLASSEMENT!C77","v":0},{"$f":"CLASSEMENT!D77","v":" "},null,{"$f":"CLASSEMENT!F77","v":" "},{"$f":"CLASSEMENT!G77","v":" "},{"$f":"CLASSEMENT!H77","v":" "},{"$f":"IF(CLASSEMENT!I77=CLASSEMENT!I76,0,CLASSEMENT!I77-CLASSEMENT!$I$4)","v":"00:00:00"}]
[{"$f":"CLASSEMENT!$B78","v":0},{"$f":"CLASSEMENT!C78","v":0},{"$f":"CLASSEMENT!D78","v":" "},null,{"$f":"CLASSEMENT!F78","v":" "},{"$f":"CLASSEMENT!G78","v":" "},{"$f":"CLASSEMENT!H78","v":" "},{"$f":"IF(CLASSEMENT!I78=CLASSEMENT!I77,0,CLASSEMENT!I78-CLASSEMENT!$I$4)","v":"00:00:00"}]
[{"$f":"CLASSEMENT!$B79","v":0},{"$f":"CLASSEMENT!C79","v":0},{"$f":"CLASSEMENT!D79","v":" "},null,{"$f":"CLASSEMENT!F79","v":" "},{"$f":"CLASSEMENT!G79","v":" "},{"$f":"CLASSEMENT!H79","v":" "},{"$f":"IF(CLASSEMENT!I79=CLASSEMENT!I78,0,CLASSEMENT!I79-CLASSEMENT!$I$4)","v":"00:00:00"}]
[{"$f":"CLASSEMENT!$B80","v":0},{"$f":"CLASSEMENT!C80","v":0},{"$f":"CLASSEMENT!D80","v":" "},null,{"$f":"CLASSEMENT!F80","v":" "},{"$f":"CLASSEMENT!G80","v":" "},{"$f":"CLASSEMENT!H80","v":" "},{"$f":"IF(CLASSEMENT!I80=CLASSEMENT!I79,0,CLASSEMENT!I80-CLASSEMENT!$I$4)","v":"00:00:00"}]
[{"$f":"CLASSEMENT!$B81","v":0},{"$f":"CLASSEMENT!C81","v":0},{"$f":"CLASSEMENT!D81","v":" "},null,{"$f":"CLASSEMENT!F81","v":" "},{"$f":"CLASSEMENT!G81","v":" "},{"$f":"CLASSEMENT!H81","v":" "},{"$f":"IF(CLASSEMENT!I81=CLASSEMENT!I80,0,CLASSEMENT!I81-CLASSEMENT!$I$4)","v":"00:00:00"}]
[{"$f":"CLASSEMENT!$B82","v":79},{"$f":"CLASSEMENT!C82","v":0},{"$f":"CLASSEMENT!D82","v":" "},null,{"$f":"CLASSEMENT!F82","v":" "},{"$f":"CLASSEMENT!G82","v":" "},{"$f":"CLASSEMENT!H82","v":" "},{"$f":"IF(CLASSEMENT!I82=CLASSEMENT!I81,0,CLASSEMENT!I82-CLASSEMENT!$I$4)","v":"00:00:00"}]
[{"$f":"CLASSEMENT!$B83","v":80},{"$f":"CLASSEMENT!C83","v":0},{"$f":"CLASSEMENT!D83","v":" "},null,{"$f":"CLASSEMENT!F83","v":" "},{"$f":"CLASSEMENT!G83","v":" "},{"$f":"CLASSEMENT!H83","v":" "},{"$f":"IF(CLASSEMENT!I83=CLASSEMENT!I82,0,CLASSEMENT!I83-CLASSEMENT!$I$4)","v":"00:00:00"}]
[{"$f":"CLASSEMENT!$B84","v":81},{"$f":"CLASSEMENT!C84","v":0},{"$f":"CLASSEMENT!D84","v":" "},null,{"$f":"CLASSEMENT!F84","v":" "},{"$f":"CLASSEMENT!G84","v":" "},{"$f":"CLASSEMENT!H84","v":" "},{"$f":"IF(CLASSEMENT!I84=CLASSEMENT!I83,0,CLASSEMENT!I84-CLASSEMENT!$I$4)","v":"00:00:00"}]
[{"$f":"CLASSEMENT!$B85","v":82},{"$f":"CLASSEMENT!C85","v":0},{"$f":"CLASSEMENT!D85","v":" "},null,{"$f":"CLASSEMENT!F85","v":" "},{"$f":"CLASSEMENT!G85","v":" "},{"$f":"CLASSEMENT!H85","v":" "},{"$f":"IF(CLASSEMENT!I85=CLASSEMENT!I84,0,CLASSEMENT!I85-CLASSEMENT!$I$4)","v":"00:00:00"}]
[{"$f":"CLASSEMENT!$B86","v":83},{"$f":"CLASSEMENT!C86","v":0},{"$f":"CLASSEMENT!D86","v":" "},null,{"$f":"CLASSEMENT!F86","v":" "},{"$f":"CLASSEMENT!G86","v":" "},{"$f":"CLASSEMENT!H86","v":" "},{"$f":"IF(CLASSEMENT!I86=CLASSEMENT!I85,0,CLASSEMENT!I86-CLASSEMENT!$I$4)","v":"00:00:00"}]
[{"$f":"CLASSEMENT!$B87","v":84},{"$f":"CLASSEMENT!C87","v":0},{"$f":"CLASSEMENT!D87","v":" "},null,{"$f":"CLASSEMENT!F87","v":" "},{"$f":"CLASSEMENT!G87","v":" "},{"$f":"CLASSEMENT!H87","v":" "},{"$f":"IF(CLASSEMENT!I87=CLASSEMENT!I86,0,CLASSEMENT!I87-CLASSEMENT!$I$4)","v":"00:00:00"}]
[{"$f":"CLASSEMENT!$B88","v":85},{"$f":"CLASSEMENT!C88","v":0},{"$f":"CLASSEMENT!D88","v":" "},null,{"$f":"CLASSEMENT!F88","v":" "},{"$f":"CLASSEMENT!G88","v":" "},{"$f":"CLASSEMENT!H88","v":" "},{"$f":"IF(CLASSEMENT!I88=CLASSEMENT!I87,0,CLASSEMENT!I88-CLASSEMENT!$I$4)","v":"00:00:00"}]
[{"$f":"CLASSEMENT!$B89","v":86},{"$f":"CLASSEMENT!C89","v":0},{"$f":"CLASSEMENT!D89","v":" "},null,{"$f":"CLASSEMENT!F89","v":" "},{"$f":"CLASSEMENT!G89","v":" "},{"$f":"CLASSEMENT!H89","v":" "},{"$f":"IF(CLASSEMENT!I89=CLASSEMENT!I88,0,CLASSEMENT!I89-CLASSEMENT!$I$4)","v":"00:00:00"}]
[{"$f":"CLASSEMENT!$B90","v":87},{"$f":"CLASSEMENT!C90","v":0},{"$f":"CLASSEMENT!D90","v":" "},null,{"$f":"CLASSEMENT!F90","v":" "},{"$f":"CLASSEMENT!G90","v":" "},{"$f":"CLASSEMENT!H90","v":" "},{"$f":"IF(CLASSEMENT!I90=CLASSEMENT!I89,0,CLASSEMENT!I90-CLASSEMENT!$I$4)","v":"00:00:00"}]
[{"$f":"CLASSEMENT!$B91","v":88},{"$f":"CLASSEMENT!C91","v":0},{"$f":"CLASSEMENT!D91","v":" "},null,{"$f":"CLASSEMENT!F91","v":" "},{"$f":"CLASSEMENT!G91","v":" "},{"$f":"CLASSEMENT!H91","v":" "},{"$f":"IF(CLASSEMENT!I91=CLASSEMENT!I90,0,CLASSEMENT!I91-CLASSEMENT!$I$4)","v":"00:00:00"}]
[{"$f":"CLASSEMENT!$B92","v":89},{"$f":"CLASSEMENT!C92","v":0},{"$f":"CLASSEMENT!D92","v":" "},null,{"$f":"CLASSEMENT!F92","v":" "},{"$f":"CLASSEMENT!G92","v":" "},{"$f":"CLASSEMENT!H92","v":" "},{"$f":"IF(CLASSEMENT!I92=CLASSEMENT!I91,0,CLASSEMENT!I92-CLASSEMENT!$I$4)","v":"00:00:00"}]
[{"$f":"CLASSEMENT!$B93","v":90},{"$f":"CLASSEMENT!C93","v":0},{"$f":"CLASSEMENT!D93","v":" "},null,{"$f":"CLASSEMENT!F93","v":" "},{"$f":"CLASSEMENT!G93","v":" "},{"$f":"CLASSEMENT!H93","v":" "},{"$f":"IF(CLASSEMENT!I93=CLASSEMENT!I92,0,CLASSEMENT!I93-CLASSEMENT!$I$4)","v":"00:00:00"}]
[{"$f":"CLASSEMENT!$B94","v":91},{"$f":"CLASSEMENT!C94","v":0},{"$f":"CLASSEMENT!D94","v":" "},null,{"$f":"CLASSEMENT!F94","v":" "},{"$f":"CLASSEMENT!G94","v":" "},{"$f":"CLASSEMENT!H94","v":" "},{"$f":"IF(CLASSEMENT!I94=CLASSEMENT!I93,0,CLASSEMENT!I94-CLASSEMENT!$I$4)","v":"00:00:00"}]
[{"$f":"CLASSEMENT!$B95","v":92},{"$f":"CLASSEMENT!C95","v":0},{"$f":"CLASSEMENT!D95","v":" "},null,{"$f":"CLASSEMENT!F95","v":" "},{"$f":"CLASSEMENT!G95","v":" "},{"$f":"CLASSEMENT!H95","v":" "},{"$f":"IF(CLASSEMENT!I95=CLASSEMENT!I94,0,CLASSEMENT!I95-CLASSEMENT!$I$4)","v":"00:00:00"}]
[{"$f":"CLASSEMENT!$B96","v":93},{"$f":"CLASSEMENT!C96","v":0},{"$f":"CLASSEMENT!D96","v":" "},null,{"$f":"CLASSEMENT!F96","v":" "},{"$f":"CLASSEMENT!G96","v":" "},{"$f":"CLASSEMENT!H96","v":" "},{"$f":"IF(CLASSEMENT!I96=CLASSEMENT!I95,0,CLASSEMENT!I96-CLASSEMENT!$I$4)","v":"00:00:00"}]
[{"$f":"CLASSEMENT!$B97","v":94},{"$f":"CLASSEMENT!C97","v":0},{"$f":"CLASSEMENT!D97","v":" "},null,{"$f":"CLASSEMENT!F97","v":" "},{"$f":"CLASSEMENT!G97","v":" "},{"$f":"CLASSEMENT!H97","v":" "},{"$f":"IF(CLASSEMENT!I97=CLASSEMENT!I96,0,CLASSEMENT!I97-CLASSEMENT!$I$4)","v":"00:00:00"}]
[{"$f":"CLASSEMENT!$B98","v":95},{"$f":"CLASSEMENT!C98","v":0},{"$f":"CLASSEMENT!D98","v":" "},null,{"$f":"CLASSEMENT!F98","v":" "},{"$f":"CLASSEMENT!G98","v":" "},{"$f":"CLASSEMENT!H98","v":" "},{"$f":"IF(CLASSEMENT!I98=CLASSEMENT!I97,0,CLASSEMENT!I98-CLASSEMENT!$I$4)","v":"00:00:00"}]
[{"$f":"CLASSEMENT!$B99","v":96},{"$f":"CLASSEMENT!C99","v":0},{"$f":"CLASSEMENT!D99","v":" "},null,{"$f":"CLASSEMENT!F99","v":" "},{"$f":"CLASSEMENT!G99","v":" "},{"$f":"CLASSEMENT!H99","v":" "},{"$f":"IF(CLASSEMENT!I99=CLASSEMENT!I98,0,CLASSEMENT!I99-CLASSEMENT!$I$4)","v":"00:00:00"}]
[{"$f":"CLASSEMENT!$B100","v":97},{"$f":"CLASSEMENT!C100","v":0},{"$f":"CLASSEMENT!D100","v":" "},null,{"$f":"CLASSEMENT!F100","v":" "},{"$f":"CLASSEMENT!G100","v":" "},{"$f":"CLASSEMENT!H100","v":" "},{"$f":"IF(CLASSEMENT!I100=CLASSEMENT!I99,0,CLASSEMENT!I100-CLASSEMENT!$I$4)","v":"00:00:00"}]
[{"$f":"CLASSEMENT!$B101","v":98},{"$f":"CLASSEMENT!C101","v":0},{"$f":"CLASSEMENT!D101","v":" "},null,{"$f":"CLASSEMENT!F101","v":" "},{"$f":"CLASSEMENT!G101","v":" "},{"$f":"CLASSEMENT!H101","v":" "},{"$f":"IF(CLASSEMENT!I101=CLASSEMENT!I100,0,CLASSEMENT!I101-CLASSEMENT!$I$4)","v":"00:00:00"}]
[{"$f":"CLASSEMENT!$B102","v":99},{"$f":"CLASSEMENT!C102","v":0},{"$f":"CLASSEMENT!D102","v":" "},null,{"$f":"CLASSEMENT!F102","v":" "},{"$f":"CLASSEMENT!G102","v":" "},{"$f":"CLASSEMENT!H102","v":" "},{"$f":"IF(CLASSEMENT!I102=CLASSEMENT!I101,0,CLASSEMENT!I102-CLASSEMENT!$I$4)","v":"00:00:00"}]
[{"$f":"CLASSEMENT!$B103","v":100},{"$f":"CLASSEMENT!C103","v":0},{"$f":"CLASSEMENT!D103","v":" "},null,{"$f":"CLASSEMENT!F103","v":" "},{"$f":"CLASSEMENT!G103","v":" "},{"$f":"CLASSEMENT!H103","v":" "},{"$f":"IF(CLASSEMENT!I103=CLASSEMENT!I102,0,CLASSEMENT!I103-CLASSEMENT!$I$4)","v":"00:00:00"}]
[{"$f":"CLASSEMENT!$B104","v":101},{"$f":"CLASSEMENT!C104","v":0},{"$f":"CLASSEMENT!D104","v":" "},null,{"$f":"CLASSEMENT!F104","v":" "},{"$f":"CLASSEMENT!G104","v":" "},{"$f":"CLASSEMENT!H104","v":" "},{"$f":"IF(CLASSEMENT!I104=CLASSEMENT!I103,0,CLASSEMENT!I104-CLASSEMENT!$I$4)","v":"00:00:00"}]
[{"$f":"CLASSEMENT!$B105","v":102},{"$f":"CLASSEMENT!C105","v":0},{"$f":"CLASSEMENT!D105","v":" "},null,{"$f":"CLASSEMENT!F105","v":" "},{"$f":"CLASSEMENT!G105","v":" "},{"$f":"CLASSEMENT!H105","v":" "},{"$f":"IF(CLASSEMENT!I105=CLASSEMENT!I104,0,CLASSEMENT!I105-CLASSEMENT!$I$4)","v":"00:00:00"}]
[{"$f":"CLASSEMENT!$B106","v":103},{"$f":"CLASSEMENT!C106","v":0},{"$f":"CLASSEMENT!D106","v":" "},null,{"$f":"CLASSEMENT!F106","v":" "},{"$f":"CLASSEMENT!G106","v":" "},{"$f":"CLASSEMENT!H106","v":" "},{"$f":"IF(CLASSEMENT!I106=CLASSEMENT!I105,0,CLASSEMENT!I106-CLASSEMENT!$I$4)","v":"00:00:00"}]
[{"$f":"CLASSEMENT!$B107","v":104},{"$f":"CLASSEMENT!C107","v":0},{"$f":"CLASSEMENT!D107","v":" "},null,{"$f":"CLASSEMENT!F107","v":" "},{"$f":"CLASSEMENT!G107","v":" "},{"$f":"CLASSEMENT!H107","v":" "},{"$f":"IF(CLASSEMENT!I107=CLASSEMENT!I106,0,CLASSEMENT!I107-CLASSEMENT!$I$4)","v":"00:00:00"}]
[{"$f":"CLASSEMENT!$B108","v":105},{"$f":"CLASSEMENT!C108","v":0},{"$f":"CLASSEMENT!D108","v":" "},null,{"$f":"CLASSEMENT!F108","v":" "},{"$f":"CLASSEMENT!G108","v":" "},{"$f":"CLASSEMENT!H108","v":" "},{"$f":"IF(CLASSEMENT!I108=CLASSEMENT!I107,0,CLASSEMENT!I108-CLASSEMENT!$I$4)","v":"00:00:00"}]
[{"$f":"CLASSEMENT!$B109","v":106},{"$f":"CLASSEMENT!C109","v":0},{"$f":"CLASSEMENT!D109","v":" "},null,{"$f":"CLASSEMENT!F109","v":" "},{"$f":"CLASSEMENT!G109","v":" "},{"$f":"CLASSEMENT!H109","v":" "},{"$f":"IF(CLASSEMENT!I109=CLASSEMENT!I108,0,CLASSEMENT!I109-CLASSEMENT!$I$4)","v":"00:00:00"}]
[{"$f":"CLASSEMENT!$B110","v":107},{"$f":"CLASSEMENT!C110","v":0},{"$f":"CLASSEMENT!D110","v":" "},null,{"$f":"CLASSEMENT!F110","v":" "},{"$f":"CLASSEMENT!G110","v":" "},{"$f":"CLASSEMENT!H110","v":" "},{"$f":"IF(CLASSEMENT!I110=CLASSEMENT!I109,0,CLASSEMENT!I110-CLASSEMENT!$I$4)","v":"00:00:00"}]
[{"$f":"CLASSEMENT!$B111","v":108},{"$f":"CLASSEMENT!C111","v":0},{"$f":"CLASSEMENT!D111","v":" "},null,{"$f":"CLASSEMENT!F111","v":" "},{"$f":"CLASSEMENT!G111","v":" "},{"$f":"CLASSEMENT!H111","v":" "},{"$f":"IF(CLASSEMENT!I111=CLASSEMENT!I110,0,CLASSEMENT!I111-CLASSEMENT!$I$4)","v":"00:00:00"}]
[{"$f":"CLASSEMENT!$B112","v":109},{"$f":"CLASSEMENT!C112","v":0},{"$f":"CLASSEMENT!D112","v":" "},null,{"$f":"CLASSEMENT!F112","v":" "},{"$f":"CLASSEMENT!G112","v":" "},{"$f":"CLASSEMENT!H112","v":" "},{"$f":"IF(CLASSEMENT!I112=CLASSEMENT!I111,0,CLASSEMENT!I112-CLASSEMENT!$I$4)","v":"00:00:00"}]
[{"$f":"CLASSEMENT!$B113","v":110},{"$f":"CLASSEMENT!C113","v":0},{"$f":"CLASSEMENT!D113","v":" "},null,{"$f":"CLASSEMENT!F113","v":" "},{"$f":"CLASSEMENT!G113","v":" "},{"$f":"CLASSEMENT!H113","v":" "},{"$f":"IF(CLASSEMENT!I113=CLASSEMENT!I112,0,CLASSEMENT!I113-CLASSEMENT!$I$4)","v":"00:00:00"}]
[{"$f":"CLASSEMENT!$B114","v":111},{"$f":"CLASSEMENT!C114","v":0},{"$f":"CLASSEMENT!D114","v":" "},null,{"$f":"CLASSEMENT!F114","v":" "},{"$f":"CLASSEMENT!G114","v":" "},{"$f":"CLASSEMENT!H114","v":" "},{"$f":"IF(CLASSEMENT!I114=CLASSEMENT!I113,0,CLASSEMENT!I114-CLASSEMENT!$I$4)","v":"00:00:00"}]
[{"$f":"CLASSEMENT!$B115","v":112},{"$f":"CLASSEMENT!C115","v":0},{"$f":"CLASSEMENT!D115","v":" "},null,{"$f":"CLASSEMENT!F115","v":" "},{"$f":"CLASSEMENT!G115","v":" "},{"$f":"CLASSEMENT!H115","v":" "},{"$f":"IF(CLASSEMENT!I115=CLASSEMENT!I114,0,CLASSEMENT!I115-CLASSEMENT!$I$4)","v":"00:00:00"}]
[{"$f":"CLASSEMENT!$B116","v":113},{"$f":"CLASSEMENT!C116","v":0},{"$f":"CLASSEMENT!D116","v":" "},null,{"$f":"CLASSEMENT!F116","v":" "},{"$f":"CLASSEMENT!G116","v":" "},{"$f":"CLASSEMENT!H116","v":" "},{"$f":"IF(CLASSEMENT!I116=CLASSEMENT!I115,0,CLASSEMENT!I116-CLASSEMENT!$I$4)","v":"00:00:00"}]
[{"$f":"CLASSEMENT!$B117","v":114},{"$f":"CLASSEMENT!C117","v":0},{"$f":"CLASSEMENT!D117","v":" "},null,{"$f":"CLASSEMENT!F117","v":" "},{"$f":"CLASSEMENT!G117","v":" "},{"$f":"CLASSEMENT!H117","v":" "},{"$f":"IF(CLASSEMENT!I117=CLASSEMENT!I116,0,CLASSEMENT!I117-CLASSEMENT!$I$4)","v":"00:00:00"}]
[{"$f":"CLASSEMENT!$B118","v":115},{"$f":"CLASSEMENT!C118","v":0},{"$f":"CLASSEMENT!D118","v":" "},null,{"$f":"CLASSEMENT!F118","v":" "},{"$f":"CLASSEMENT!G118","v":" "},{"$f":"CLASSEMENT!H118","v":" "},{"$f":"IF(CLASSEMENT!I118=CLASSEMENT!I117,0,CLASSEMENT!I118-CLASSEMENT!$I$4)","v":"00:00:00"}]
[]
[null,{"$f":"IF(Inscription!#REF!=\"oui\",\"CHALLENGE\",\"Meilleurs Animateurs\")","v":{"$error":"#REF!"}},null,null,null,"Nbre de clubs engagés",null,{"$f":"COUNTA('PRIX D EQUIPE'!B5:B39)","v":0}]
[]
[1,{"$f":"CLASSEMENT!AC45","v":0},null,{"$f":"CLASSEMENT!AD45","v":1000},{"$f":"CLASSEMENT!AF45","v":1000},{"$f":"CLASSEMENT!AH45","v":1000},{"$f":"IF(B122=\" \",\" \",IF(E122>200,D122,IF(F122>200,SUM(D122+E122),IF($B122>0,SUM(D122+E122+F122),\" \"))))","v":1000},{"$f":"IF(B122=\" \",\" \",IF(D122>200,\" \",IF(E122>200,\"(1H.)\",IF(F122>200,\"(2 H.)\",\" \"))))","v":" "}]
[2,{"$f":"CLASSEMENT!AC46","v":0},null,{"$f":"CLASSEMENT!AD46","v":1000},{"$f":"CLASSEMENT!AF46","v":1000},{"$f":"CLASSEMENT!AH46","v":1000},1000," "]
[3,{"$f":"CLASSEMENT!AC47","v":0},null,{"$f":"CLASSEMENT!AD47","v":1000},{"$f":"CLASSEMENT!AF47","v":1000},{"$f":"CLASSEMENT!AH47","v":1000},1000," "]
[4,{"$f":"CLASSEMENT!AC48","v":0},null,{"$f":"CLASSEMENT!AD48","v":1000},{"$f":"CLASSEMENT!AF48","v":1000},{"$f":"CLASSEMENT!AH48","v":1000},1000," "]
[5,{"$f":"CLASSEMENT!AC49","v":0},null,{"$f":"CLASSEMENT!AD49","v":1000},{"$f":"CLASSEMENT!AF49","v":1000},{"$f":"CLASSEMENT!AH49","v":1000},1000," "]
[6,{"$f":"CLASSEMENT!AC50","v":0},null,{"$f":"CLASSEMENT!AD50","v":1000},{"$f":"CLASSEMENT!AF50","v":1000},{"$f":"CLASSEMENT!AH50","v":1000},1000," "]
[7,{"$f":"CLASSEMENT!AC51","v":0},null,{"$f":"CLASSEMENT!AD51","v":1000},{"$f":"CLASSEMENT!AF51","v":1000},{"$f":"CLASSEMENT!AH51","v":1000},1000," "]
[8,{"$f":"CLASSEMENT!AC52","v":0},null,{"$f":"CLASSEMENT!AD52","v":1000},{"$f":"CLASSEMENT!AF52","v":1000},{"$f":"CLASSEMENT!AH52","v":1000},1000," "]
[9,{"$f":"CLASSEMENT!AC53","v":0},null,{"$f":"CLASSEMENT!AD53","v":1000},{"$f":"CLASSEMENT!AF53","v":1000},{"$f":"CLASSEMENT!AH53","v":1000},1000," "]
[10,{"$f":"CLASSEMENT!AC54","v":0},null,{"$f":"CLASSEMENT!AD54","v":1000},{"$f":"CLASSEMENT!AF54","v":1000},{"$f":"CLASSEMENT!AH54","v":1000},1000," "]
[11,{"$f":"CLASSEMENT!AC55","v":0},null,{"$f":"CLASSEMENT!AD55","v":1000},{"$f":"CLASSEMENT!AF55","v":1000},{"$f":"CLASSEMENT!AH55","v":1000},1000," "]
[12,{"$f":"CLASSEMENT!AC56","v":0},null,{"$f":"CLASSEMENT!AD56","v":1000},{"$f":"CLASSEMENT!AF56","v":1000},{"$f":"CLASSEMENT!AH56","v":1000},1000," "]
[13,{"$f":"CLASSEMENT!AC57","v":0},null,{"$f":"CLASSEMENT!AD57","v":1000},{"$f":"CLASSEMENT!AF57","v":1000},{"$f":"CLASSEMENT!AH57","v":1000},1000," "]
[14,{"$f":"CLASSEMENT!AC58","v":0},null,{"$f":"CLASSEMENT!AD58","v":1000},{"$f":"CLASSEMENT!AF58","v":1000},{"$f":"CLASSEMENT!AH58","v":1000},1000," "]
[15,{"$f":"CLASSEMENT!AC59","v":0},null,{"$f":"CLASSEMENT!AD59","v":1000},{"$f":"CLASSEMENT!AF59","v":1000},{"$f":"CLASSEMENT!AH59","v":1000},1000," "]

{"sheet":"FEUILLE RESULTATS","index":7,"n_rows":199,"n_cols":17,"rows_kept":199,"cut":false,"hidden":true,"merged":[[52,2,52,5],[51,2,51,5],[16,10,16,11],[17,10,17,11],[18,10,18,11],[49,2,49,5],[50,2,50,5],[20,10,20,11],[29,7,29,9],[23,7,23,9],[48,2,48,5],[47,9,47,12],[27,7,27,9],[28,7,28,9],[31,7,31,9],[18,7,18,9],[10,10,10,11],[11,10,11,11],[12,10,12,11],[6,0,6,13],[7,10,7,11],[7,12,7,13],[8,10,8,11],[9,10,9,11],[7,8,7,9],[7,6,7,7],[8,2,8,6],[9,7,9,9],[10,7,10,9],[8,7,8,9],[11,7,11,9],[12,7,12,9],[5,12,5,13],[1,3,1,9],[2,3,2,9],[4,0,4,2],[1,0,1,2],[2,0,2,2],[3,0,3,2],[5,0,5,1],[1,10,1,13],[2,10,2,13],[4,8,4,10],[4,3,4,7],[5,2,5,4],[5,5,5,6],[5,7,5,9],[5,10,5,11],[47,0,47,6],[39,0,39,1],[24,7,24,9],[25,7,25,9],[32,7,32,9],[33,7,33,9],[38,7,38,9],[34,7,34,9],[37,7,37,9],[30,7,30,9],[35,7,35,9],[36,7,36,9],[26,7,26,9],[15,7,15,9],[16,7,16,9],[13,7,13,9],[15,10,15,11],[17,7,17,9],[13,10,13,11],[37,10,37,11],[38,10,38,11],[33,10,33,11],[35,10,35,11],[27,10,27,11],[28,10,28,11],[32,10,32,11],[34,10,34,11],[36,10,36,11],[25,10,25,11],[29,10,29,11],[30,10,30,11],[31,10,31,11],[14,7,14,9],[26,10,26,11],[19,7,19,9],[24,10,24,11],[21,10,21,11],[22,10,22,11],[23,10,23,11],[14,10,14,11],[20,7,20,9],[21,7,21,9],[22,7,22,9],[19,10,19,11]]}
[null,null,null,null,null,null,null,null,null,null,null,null,null,null,null,null,"01:00:00"]
["NOM DE L'EPREUVE :",null,null,{"$f":"Inscription!D1","v":"CYCLO CROSS"},null,null,null,null,null,null,{"$f":"IF(Inscription!$D$4>0,\"DATE :  \"&TEXT(Inscription!D$4,\"jj mmmm aaaa\"),\"\")","v":"DATE :  01 octobre 2023"}]
["ORGANISATEUR :",null,null,{"$f":"Inscription!D3","v":0}]
["SERIES / CATEGORIES :",null,null,{"$f":"Inscription!#REF!","v":{"$error":"#REF!"}}]
["VILLE DE DEPART :",null,null,{"$f":"Inscription!D2","v":"HENANSAL"},null,null,null,null,"DEPARTEMENT :",null,null,{"$f":"Inscription!G2","v":0}]
["ENGAGES :",null,{"$f":"Inscription!#REF!","v":{"$error":"#REF!"}},null,null,"PARTANTS :",null,{"$f":"Inscription!#REF!","v":{"$error":"#REF!"}},null,null,"CLASSES :",null,{"$f":"COUNTIF(A10:A39,\">0\")+COUNTIF(C40:N40,\">0\")+COUNTIF(A41:N47,\">0\")","v":55}]
["TABLEAU DE CLASSEMENT"]
[null,null,null,null,null,null,"MOYENNE",null,{"$f":"IF(N10>0,$M$8/$N$10*$Q$1,\"\")","v":""},null,"DISTANCE :",null,{"$f":"Inscription!#REF!","v":{"$error":"#REF!"}}]
["DOSS","Place","NOM et PRENOM",null,null,null,null,"ASSOCIATION",null,null,"N° LICENCE",null,"CAT.","TEMPS"]
[{"$f":"CLASSEMENT!C4","v":3},{"$f":"CLASSEMENT!$B4","v":1},{"$f":"IF(A10>0,CONCATENATE((VLOOKUP($A10,Inscription!$A$6:$G$205,3,FALSE)),\"   \",(VLOOKUP($A10,Inscription!$A$6:$G$205,4,FALSE))),\" \")","v":"BASSET   Evan"},null,null,null,null,{"$f":"IF(A10>0,(VLOOKUP($A10,Inscription!$A$6:$G$205,5,FALSE)),\" \")","v":"vc evron"},null,null,{"$f":"IF(A10>0,(VLOOKUP($A10,Inscription!$A$6:$G$205,7,FALSE)),\" \")","v":0},null,{"$f":"IF(A10>0,(VLOOKUP($A10,Inscription!$A$6:$G$205,6,FALSE)),\" \")","v":"poussin"},{"$f":"CLASSEMENT!I4","v":0},null,{"$f":"CLASSEMENT!C4","v":3}]
[{"$f":"CLASSEMENT!C5","v":4},{"$f":"CLASSEMENT!$B5","v":2},{"$f":"IF(A11>0,CONCATENATE((VLOOKUP($A11,Inscription!$A$6:$G$205,3,FALSE)),\"   \",(VLOOKUP($A11,Inscription!$A$6:$G$205,4,FALSE))),\" \")","v":"BANNER   Livia"},null,null,null,null,{"$f":"IF(A11>0,(VLOOKUP($A11,Inscription!$A$6:$G$205,5,FALSE)),\" \")","v":"vtt du lié"},null,null,{"$f":"IF(A11>0,(VLOOKUP($A11,Inscription!$A$6:$G$205,7,FALSE)),\" \")","v":0},null,{"$f":"IF(A11>0,(VLOOKUP($A11,Inscription!$A$6:$G$205,6,FALSE)),\" \")","v":"poussin"},{"$f":"IF(CLASSEMENT!I5=CLASSEMENT!I4,0,CLASSEMENT!I5-CLASSEMENT!$I$4)","v":"00:00:00"},null,{"$f":"CLASSEMENT!C5","v":4}]
[{"$f":"CLASSEMENT!C6","v":2},{"$f":"CLASSEMENT!$B6","v":3},{"$f":"IF(A12>0,CONCATENATE((VLOOKUP($A12,Inscription!$A$6:$G$205,3,FALSE)),\"   \",(VLOOKUP($A12,Inscription!$A$6:$G$205,4,FALSE))),\" \")","v":"BARS   Gabin"},null,null,null,null,{"$f":"IF(A12>0,(VLOOKUP($A12,Inscription!$A$6:$G$205,5,FALSE)),\" \")","v":"begard vtt gwerun"},null,null,{"$f":"IF(A12>0,(VLOOKUP($A12,Inscription!$A$6:$G$205,7,FALSE)),\" \")","v":407364},null,{"$f":"IF(A12>0,(VLOOKUP($A12,Inscription!$A$6:$G$205,6,FALSE)),\" \")","v":"poussin"},{"$f":"IF(CLASSEMENT!I6=CLASSEMENT!I5,0,CLASSEMENT!I6-CLASSEMENT!$I$4)","v":"00:00:00"},null,{"$f":"CLASSEMENT!C6","v":2}]
[{"$f":"CLASSEMENT!C7","v":5},{"$f":"CLASSEMENT!$B7","v":4},{"$f":"IF(A13>0,CONCATENATE((VLOOKUP($A13,Inscription!$A$6:$G$205,3,FALSE)),\"   \",(VLOOKUP($A13,Inscription!$A$6:$G$205,4,FALSE))),\" \")","v":"MACE   Loukas"},null,null,null,null,{"$f":"IF(A13>0,(VLOOKUP($A13,Inscription!$A$6:$G$205,5,FALSE)),\" \")","v":"vc evron"},null,null,{"$f":"IF(A13>0,(VLOOKUP($A13,Inscription!$A$6:$G$205,7,FALSE)),\" \")","v":996776},null,{"$f":"IF(A13>0,(VLOOKUP($A13,Inscription!$A$6:$G$205,6,FALSE)),\" \")","v":"poussin"},{"$f":"IF(CLASSEMENT!I7=CLASSEMENT!I6,0,CLASSEMENT!I7-CLASSEMENT!$I$4)","v":"00:00:00"},null,{"$f":"CLASSEMENT!C7","v":5}]
[{"$f":"CLASSEMENT!C8","v":1},{"$f":"CLASSEMENT!$B8","v":5},{"$f":"IF(A14>0,CONCATENATE((VLOOKUP($A14,Inscription!$A$6:$G$205,3,FALSE)),\"   \",(VLOOKUP($A14,Inscription!$A$6:$G$205,4,FALSE))),\" \")","v":"LEVEQUE    Nathan"},null,null,null,null,{"$f":"IF(A14>0,(VLOOKUP($A14,Inscription!$A$6:$G$205,5,FALSE)),\" \")","v":"district loudéac"},null,null,{"$f":"IF(A14>0,(VLOOKUP($A14,Inscription!$A$6:$G$205,7,FALSE)),\" \")","v":0},null,{"$f":"IF(A14>0,(VLOOKUP($A14,Inscription!$A$6:$G$205,6,FALSE)),\" \")","v":"poussin"},{"$f":"IF(CLASSEMENT!I8=CLASSEMENT!I7,0,CLASSEMENT!I8-CLASSEMENT!$I$4)","v":"00:00:00"},null,{"$f":"CLASSEMENT!C8","v":1}]
[{"$f":"CLASSEMENT!C9","v":0},{"$f":"CLASSEMENT!$B9","v":0},{"$f":"IF(A15>0,CONCATENATE((VLOOKUP($A15,Inscription!$A$6:$G$205,3,FALSE)),\"   \",(VLOOKUP($A15,Inscription!$A$6:$G$205,4,FALSE))),\" \")","v":" "},null,null,null,null,{"$f":"IF(A15>0,(VLOOKUP($A15,Inscription!$A$6:$G$205,5,FALSE)),\" \")","v":" "},null,null,{"$f":"IF(A15>0,(VLOOKUP($A15,Inscription!$A$6:$G$205,7,FALSE)),\" \")","v":" "},null,{"$f":"IF(A15>0,(VLOOKUP($A15,Inscription!$A$6:$G$205,6,FALSE)),\" \")","v":" "},{"$f":"IF(CLASSEMENT!I9=CLASSEMENT!I8,0,CLASSEMENT!I9-CLASSEMENT!$I$4)","v":"00:00:00"},null,{"$f":"CLASSEMENT!C9","v":0}]
[{"$f":"CLASSEMENT!C10","v":6},{"$f":"CLASSEMENT!$B10","v":1},{"$f":"IF(A16>0,CONCATENATE((VLOOKUP($A16,Inscription!$A$6:$G$205,3,FALSE)),\"   \",(VLOOKUP($A16,Inscription!$A$6:$G$205,4,FALSE))),\" \")","v":"BARS   Yvann"},null,null,null,null,{"$f":"IF(A16>0,(VLOOKUP($A16,Inscription!$A$6:$G$205,5,FALSE)),\" \")","v":"begard vtt gwerun"},null,null,{"$f":"IF(A16>0,(VLOOKUP($A16,Inscription!$A$6:$G$205,7,FALSE)),\" \")","v":310008},null,{"$f":"IF(A16>0,(VLOOKUP($A16,Inscription!$A$6:$G$205,6,FALSE)),\" \")","v":"pupille"},{"$f":"IF(CLASSEMENT!I10=CLASSEMENT!I9,0,CLASSEMENT!I10-CLASSEMENT!$I$4)","v":"00:00:00"},null,{"$f":"CLASSEMENT!C10","v":6}]
[{"$f":"CLASSEMENT!C11","v":8},{"$f":"CLASSEMENT!$B11","v":2},{"$f":"IF(A17>0,CONCATENATE((VLOOKUP($A17,Inscription!$A$6:$G$205,3,FALSE)),\"   \",(VLOOKUP($A17,Inscription!$A$6:$G$205,4,FALSE))),\" \")","v":"LEPERCQ   Batiste"},null,null,null,null,{"$f":"IF(A17>0,(VLOOKUP($A17,Inscription!$A$6:$G$205,5,FALSE)),\" \")","v":"uc plaudren"},null,null,{"$f":"IF(A17>0,(VLOOKUP($A17,Inscription!$A$6:$G$205,7,FALSE)),\" \")","v":391433},null,{"$f":"IF(A17>0,(VLOOKUP($A17,Inscription!$A$6:$G$205,6,FALSE)),\" \")","v":"pupille"},{"$f":"IF(CLASSEMENT!I11=CLASSEMENT!I10,0,CLASSEMENT!I11-CLASSEMENT!$I$4)","v":"00:00:00"},null,{"$f":"CLASSEMENT!C11","v":8}]
[{"$f":"CLASSEMENT!C12","v":7},{"$f":"CLASSEMENT!$B12","v":3},{"$f":"IF(A18>0,CONCATENATE((VLOOKUP($A18,Inscription!$A$6:$G$205,3,FALSE)),\"   \",(VLOOKUP($A18,Inscription!$A$6:$G$205,4,FALSE))),\" \")","v":"COLAS   Thibaut"},null,null,null,null,{"$f":"IF(A18>0,(VLOOKUP($A18,Inscription!$A$6:$G$205,5,FALSE)),\" \")","v":"begard vtt gwerun"},null,null,{"$f":"IF(A18>0,(VLOOKUP($A18,Inscription!$A$6:$G$205,7,FALSE)),\" \")","v":330206},null,{"$f":"IF(A18>0,(VLOOKUP($A18,Inscription!$A$6:$G$205,6,FALSE)),\" \")","v":"pupille"},{"$f":"IF(CLASSEMENT!I12=CLASSEMENT!I11,0,CLASSEMENT!I12-CLASSEMENT!$I$4)","v":"00:00:00"},null,{"$f":"CLASSEMENT!C12","v":7}]
[{"$f":"CLASSEMENT!C13","v":9},{"$f":"CLASSEMENT!$B13","v":4},{"$f":"IF(A19>0,CONCATENATE((VLOOKUP($A19,Inscription!$A$6:$G$205,3,FALSE)),\"   \",(VLOOKUP($A19,Inscription!$A$6:$G$205,4,FALSE))),\" \")","v":"CLERET MARECHAL   Loeiz"},null,null,null,null,{"$f":"IF(A19>0,(VLOOKUP($A19,Inscription!$A$6:$G$205,5,FALSE)),\" \")","v":"vtt cotes d'armor hillion"},null,null,{"$f":"IF(A19>0,(VLOOKUP($A19,Inscription!$A$6:$G$205,7,FALSE)),\" \")","v":0},null,{"$f":"IF(A19>0,(VLOOKUP($A19,Inscription!$A$6:$G$205,6,FALSE)),\" \")","v":"pupille"},{"$f":"IF(CLASSEMENT!I13=CLASSEMENT!I12,0,CLASSEMENT!I13-CLASSEMENT!$I$4)","v":"00:00:00"},null,{"$f":"CLASSEMENT!C13","v":9}]
[{"$f":"CLASSEMENT!C14","v":0},{"$f":"CLASSEMENT!$B14","v":0},{"$f":"IF(A20>0,CONCATENATE((VLOOKUP($A20,Inscription!$A$6:$G$205,3,FALSE)),\"   \",(VLOOKUP($A20,Inscription!$A$6:$G$205,4,FALSE))),\" \")","v":" "},null,null,null,null,{"$f":"IF(A20>0,(VLOOKUP($A20,Inscription!$A$6:$G$205,5,FALSE)),\" \")","v":" "},null,null,{"$f":"IF(A20>0,(VLOOKUP($A20,Inscription!$A$6:$G$205,7,FALSE)),\" \")","v":" "},null,{"$f":"IF(A20>0,(VLOOKUP($A20,Inscription!$A$6:$G$205,6,FALSE)),\" \")","v":" "},{"$f":"IF(CLASSEMENT!I14=CLASSEMENT!I13,0,CLASSEMENT!I14-CLASSEMENT!$I$4)","v":"00:00:00"},null,{"$f":"CLASSEMENT!C14","v":0}]
[{"$f":"CLASSEMENT!C15","v":11},{"$f":"CLASSEMENT!$B15","v":1},{"$f":"IF(A21>0,CONCATENATE((VLOOKUP($A21,Inscription!$A$6:$G$205,3,FALSE)),\"   \",(VLOOKUP($A21,Inscription!$A$6:$G$205,4,FALSE))),\" \")","v":"POILVET   Jules"},null,null,null,null,{"$f":"IF(A21>0,(VLOOKUP($A21,Inscription!$A$6:$G$205,5,FALSE)),\" \")","v":"vc evron"},null,null,{"$f":"IF(A21>0,(VLOOKUP($A21,Inscription!$A$6:$G$205,7,FALSE)),\" \")","v":382431},null,{"$f":"IF(A21>0,(VLOOKUP($A21,Inscription!$A$6:$G$205,6,FALSE)),\" \")","v":"benjamin"},{"$f":"IF(CLASSEMENT!I15=CLASSEMENT!I14,0,CLASSEMENT!I15-CLASSEMENT!$I$4)","v":"00:00:00"},null,{"$f":"CLASSEMENT!C15","v":11}]
[{"$f":"CLASSEMENT!C16","v":14},{"$f":"CLASSEMENT!$B16","v":2},{"$f":"IF(A22>0,CONCATENATE((VLOOKUP($A22,Inscription!$A$6:$G$205,3,FALSE)),\"   \",(VLOOKUP($A22,Inscription!$A$6:$G$205,4,FALSE))),\" \")","v":"BANNER   Rafael"},null,null,null,null,{"$f":"IF(A22>0,(VLOOKUP($A22,Inscription!$A$6:$G$205,5,FALSE)),\" \")","v":"vtt du lié"},null,null,{"$f":"IF(A22>0,(VLOOKUP($A22,Inscription!$A$6:$G$205,7,FALSE)),\" \")","v":0},null,{"$f":"IF(A22>0,(VLOOKUP($A22,Inscription!$A$6:$G$205,6,FALSE)),\" \")","v":"benjamin"},{"$f":"IF(CLASSEMENT!I16=CLASSEMENT!I15,0,CLASSEMENT!I16-CLASSEMENT!$I$4)","v":"00:00:00"},null,{"$f":"CLASSEMENT!C16","v":14}]
[{"$f":"CLASSEMENT!C17","v":16},{"$f":"CLASSEMENT!$B17","v":3},{"$f":"IF(A23>0,CONCATENATE((VLOOKUP($A23,Inscription!$A$6:$G$205,3,FALSE)),\"   \",(VLOOKUP($A23,Inscription!$A$6:$G$205,4,FALSE))),\" \")","v":"BOUGEARD HORNAIS   Aymeris"},null,null,null,null,{"$f":"IF(A23>0,(VLOOKUP($A23,Inscription!$A$6:$G$205,5,FALSE)),\" \")","v":"team bikers"},null,null,{"$f":"IF(A23>0,(VLOOKUP($A23,Inscription!$A$6:$G$205,7,FALSE)),\" \")","v":431285},null,{"$f":"IF(A23>0,(VLOOKUP($A23,Inscription!$A$6:$G$205,6,FALSE)),\" \")","v":"benjamin"},{"$f":"IF(CLASSEMENT!I17=CLASSEMENT!I16,0,CLASSEMENT!I17-CLASSEMENT!$I$4)","v":"00:00:00"},null,{"$f":"CLASSEMENT!C17","v":16}]
[{"$f":"CLASSEMENT!C18","v":15},{"$f":"CLASSEMENT!$B18","v":4},{"$f":"IF(A24>0,CONCATENATE((VLOOKUP($A24,Inscription!$A$6:$G$205,3,FALSE)),\"   \",(VLOOKUP($A24,Inscription!$A$6:$G$205,4,FALSE))),\" \")","v":"BRIAND   Axel"},null,null,null,null,{"$f":"IF(A24>0,(VLOOKUP($A24,Inscription!$A$6:$G$205,5,FALSE)),\" \")","v":"team bikers"},null,null,{"$f":"IF(A24>0,(VLOOKUP($A24,Inscription!$A$6:$G$205,7,FALSE)),\" \")","v":429219},null,{"$f":"IF(A24>0,(VLOOKUP($A24,Inscription!$A$6:$G$205,6,FALSE)),\" \")","v":"benjamin"},{"$f":"IF(CLASSEMENT!I18=CLASSEMENT!I17,0,CLASSEMENT!I18-CLASSEMENT!$I$4)","v":"00:00:00"},null,{"$f":"CLASSEMENT!C18","v":15}]
[{"$f":"CLASSEMENT!C19","v":10},{"$f":"CLASSEMENT!$B19","v":5},{"$f":"IF(A25>0,CONCATENATE((VLOOKUP($A25,Inscription!$A$6:$G$205,3,FALSE)),\"   \",(VLOOKUP($A25,Inscription!$A$6:$G$205,4,FALSE))),\" \")","v":"POILVET   Paul"},null,null,null,null,{"$f":"IF(A25>0,(VLOOKUP($A25,Inscription!$A$6:$G$205,5,FALSE)),\" \")","v":"vc evron"},null,null,{"$f":"IF(A25>0,(VLOOKUP($A25,Inscription!$A$6:$G$205,7,FALSE)),\" \")","v":382428},null,{"$f":"IF(A25>0,(VLOOKUP($A25,Inscription!$A$6:$G$205,6,FALSE)),\" \")","v":"benjamin"},{"$f":"IF(CLASSEMENT!I19=CLASSEMENT!I18,0,CLASSEMENT!I19-CLASSEMENT!$I$4)","v":"00:00:00"},null,{"$f":"CLASSEMENT!C19","v":10}]
[{"$f":"CLASSEMENT!C20","v":13},{"$f":"CLASSEMENT!$B20","v":6},{"$f":"IF(A26>0,CONCATENATE((VLOOKUP($A26,Inscription!$A$6:$G$205,3,FALSE)),\"   \",(VLOOKUP($A26,Inscription!$A$6:$G$205,4,FALSE))),\" \")","v":"BOLORE   Loevan"},null,null,null,null,{"$f":"IF(A26>0,(VLOOKUP($A26,Inscription!$A$6:$G$205,5,FALSE)),\" \")","v":"team bikers"},null,null,{"$f":"IF(A26>0,(VLOOKUP($A26,Inscription!$A$6:$G$205,7,FALSE)),\" \")","v":376265},null,{"$f":"IF(A26>0,(VLOOKUP($A26,Inscription!$A$6:$G$205,6,FALSE)),\" \")","v":"benjamin"},{"$f":"IF(CLASSEMENT!I20=CLASSEMENT!I19,0,CLASSEMENT!I20-CLASSEMENT!$I$4)","v":"00:00:00"},null,{"$f":"CLASSEMENT!C20","v":13}]
[{"$f":"CLASSEMENT!C21","v":12},{"$f":"CLASSEMENT!$B21","v":7},{"$f":"IF(A27>0,CONCATENATE((VLOOKUP($A27,Inscription!$A$6:$G$205,3,FALSE)),\"   \",(VLOOKUP($A27,Inscription!$A$6:$G$205,4,FALSE))),\" \")","v":"LEPERCQ   Clara"},null,null,null,null,{"$f":"IF(A27>0,(VLOOKUP($A27,Inscription!$A$6:$G$205,5,FALSE)),\" \")","v":"uc plaudren"},null,null,{"$f":"IF(A27>0,(VLOOKUP($A27,Inscription!$A$6:$G$205,7,FALSE)),\" \")","v":467480},null,{"$f":"IF(A27>0,(VLOOKUP($A27,Inscription!$A$6:$G$205,6,FALSE)),\" \")","v":"benjamin"},{"$f":"IF(CLASSEMENT!I21=CLASSEMENT!I20,0,CLASSEMENT!I21-CLASSEMENT!$I$4)","v":"00:00:00"},null,{"$f":"CLASSEMENT!C21","v":12}]
[{"$f":"CLASSEMENT!C22","v":0},{"$f":"CLASSEMENT!$B22","v":0},{"$f":"IF(A28>0,CONCATENATE((VLOOKUP($A28,Inscription!$A$6:$G$205,3,FALSE)),\"   \",(VLOOKUP($A28,Inscription!$A$6:$G$205,4,FALSE))),\" \")","v":" "},null,null,null,null,{"$f":"IF(A28>0,(VLOOKUP($A28,Inscription!$A$6:$G$205,5,FALSE)),\" \")","v":" "},null,null,{"$f":"IF(A28>0,(VLOOKUP($A28,Inscription!$A$6:$G$205,7,FALSE)),\" \")","v":" "},null,{"$f":"IF(A28>0,(VLOOKUP($A28,Inscription!$A$6:$G$205,6,FALSE)),\" \")","v":" "},{"$f":"IF(CLASSEMENT!I22=CLASSEMENT!I21,0,CLASSEMENT!I22-CLASSEMENT!$I$4)","v":"00:00:00"},null,{"$f":"CLASSEMENT!C22","v":0}]
[{"$f":"CLASSEMENT!C23","v":27},{"$f":"CLASSEMENT!$B23","v":1},{"$f":"IF(A29>0,CONCATENATE((VLOOKUP($A29,Inscription!$A$6:$G$205,3,FALSE)),\"   \",(VLOOKUP($A29,Inscription!$A$6:$G$205,4,FALSE))),\" \")","v":"GUILMIN   Léo"},null,null,null,null,{"$f":"IF(A29>0,(VLOOKUP($A29,Inscription!$A$6:$G$205,5,FALSE)),\" \")","v":"vc evron"},null,null,{"$f":"IF(A29>0,(VLOOKUP($A29,Inscription!$A$6:$G$205,7,FALSE)),\" \")","v":344464},null,{"$f":"IF(A29>0,(VLOOKUP($A29,Inscription!$A$6:$G$205,6,FALSE)),\" \")","v":"minimes"},{"$f":"IF(CLASSEMENT!I23=CLASSEMENT!I22,0,CLASSEMENT!I23-CLASSEMENT!$I$4)","v":"00:00:00"},null,{"$f":"CLASSEMENT!C23","v":27}]
[{"$f":"CLASSEMENT!C24","v":24},{"$f":"CLASSEMENT!$B24","v":2},{"$f":"IF(A30>0,CONCATENATE((VLOOKUP($A30,Inscription!$A$6:$G$205,3,FALSE)),\"   \",(VLOOKUP($A30,Inscription!$A$6:$G$205,4,FALSE))),\" \")","v":"BASSET   Loris"},null,null,null,null,{"$f":"IF(A30>0,(VLOOKUP($A30,Inscription!$A$6:$G$205,5,FALSE)),\" \")","v":"vc evron"},null,null,{"$f":"IF(A30>0,(VLOOKUP($A30,Inscription!$A$6:$G$205,7,FALSE)),\" \")","v":0},null,{"$f":"IF(A30>0,(VLOOKUP($A30,Inscription!$A$6:$G$205,6,FALSE)),\" \")","v":"minimes"},{"$f":"IF(CLASSEMENT!I24=CLASSEMENT!I23,0,CLASSEMENT!I24-CLASSEMENT!$I$4)","v":"00:00:00"},null,{"$f":"CLASSEMENT!C24","v":24}]
[{"$f":"CLASSEMENT!C25","v":20},{"$f":"CLASSEMENT!$B25","v":3},{"$f":"IF(A31>0,CONCATENATE((VLOOKUP($A31,Inscription!$A$6:$G$205,3,FALSE)),\"   \",(VLOOKUP($A31,Inscription!$A$6:$G$205,4,FALSE))),\" \")","v":"BRIEND   Ilhan"},null,null,null,null,{"$f":"IF(A31>0,(VLOOKUP($A31,Inscription!$A$6:$G$205,5,FALSE)),\" \")","v":"accro cycles cotes d'émeraude"},null,null,{"$f":"IF(A31>0,(VLOOKUP($A31,Inscription!$A$6:$G$205,7,FALSE)),\" \")","v":919871},null,{"$f":"IF(A31>0,(VLOOKUP($A31,Inscription!$A$6:$G$205,6,FALSE)),\" \")","v":"minimes"},{"$f":"IF(CLASSEMENT!I25=CLASSEMENT!I24,0,CLASSEMENT!I25-CLASSEMENT!$I$4)","v":"00:00:00"},null,{"$f":"CLASSEMENT!C25","v":20}]
[{"$f":"CLASSEMENT!C26","v":21},{"$f":"CLASSEMENT!$B26","v":4},{"$f":"IF(A32>0,CONCATENATE((VLOOKUP($A32,Inscription!$A$6:$G$205,3,FALSE)),\"   \",(VLOOKUP($A32,Inscription!$A$6:$G$205,4,FALSE))),\" \")","v":"LE BIHAN   Clément "},null,null,null,null,{"$f":"IF(A32>0,(VLOOKUP($A32,Inscription!$A$6:$G$205,5,FALSE)),\" \")","v":"uc plaudren"},null,null,{"$f":"IF(A32>0,(VLOOKUP($A32,Inscription!$A$6:$G$205,7,FALSE)),\" \")","v":968158},null,{"$f":"IF(A32>0,(VLOOKUP($A32,Inscription!$A$6:$G$205,6,FALSE)),\" \")","v":"minimes"},{"$f":"IF(CLASSEMENT!I26=CLASSEMENT!I25,0,CLASSEMENT!I26-CLASSEMENT!$I$4)","v":"00:00:00"},null,{"$f":"CLASSEMENT!C26","v":21}]
[{"$f":"CLASSEMENT!C27","v":26},{"$f":"CLASSEMENT!$B27","v":5},{"$f":"IF(A33>0,CONCATENATE((VLOOKUP($A33,Inscription!$A$6:$G$205,3,FALSE)),\"   \",(VLOOKUP($A33,Inscription!$A$6:$G$205,4,FALSE))),\" \")","v":"BOUGEARD   Margot"},null,null,null,null,{"$f":"IF(A33>0,(VLOOKUP($A33,Inscription!$A$6:$G$205,5,FALSE)),\" \")","v":"team bikers"},null,null,{"$f":"IF(A33>0,(VLOOKUP($A33,Inscription!$A$6:$G$205,7,FALSE)),\" \")","v":431290},null,{"$f":"IF(A33>0,(VLOOKUP($A33,Inscription!$A$6:$G$205,6,FALSE)),\" \")","v":"minimes"},{"$f":"IF(CLASSEMENT!I27=CLASSEMENT!I26,0,CLASSEMENT!I27-CLASSEMENT!$I$4)","v":"00:00:00"},null,{"$f":"CLASSEMENT!C27","v":26}]
[{"$f":"CLASSEMENT!C28","v":23},{"$f":"CLASSEMENT!$B28","v":6},{"$f":"IF(A34>0,CONCATENATE((VLOOKUP($A34,Inscription!$A$6:$G$205,3,FALSE)),\"   \",(VLOOKUP($A34,Inscription!$A$6:$G$205,4,FALSE))),\" \")","v":"ROUILLE   Robin"},null,null,null,null,{"$f":"IF(A34>0,(VLOOKUP($A34,Inscription!$A$6:$G$205,5,FALSE)),\" \")","v":"team bikers"},null,null,{"$f":"IF(A34>0,(VLOOKUP($A34,Inscription!$A$6:$G$205,7,FALSE)),\" \")","v":390947},null,{"$f":"IF(A34>0,(VLOOKUP($A34,Inscription!$A$6:$G$205,6,FALSE)),\" \")","v":"minimes"},{"$f":"IF(CLASSEMENT!I28=CLASSEMENT!I27,0,CLASSEMENT!I28-CLASSEMENT!$I$4)","v":"00:00:00"},null,{"$f":"CLASSEMENT!C28","v":23}]
[{"$f":"CLASSEMENT!C29","v":25},{"$f":"CLASSEMENT!$B29","v":7},{"$f":"IF(A35>0,CONCATENATE((VLOOKUP($A35,Inscription!$A$6:$G$205,3,FALSE)),\"   \",(VLOOKUP($A35,Inscription!$A$6:$G$205,4,FALSE))),\" \")","v":"BRIAND   Mathis"},null,null,null,null,{"$f":"IF(A35>0,(VLOOKUP($A35,Inscription!$A$6:$G$205,5,FALSE)),\" \")","v":"team bikers"},null,null,{"$f":"IF(A35>0,(VLOOKUP($A35,Inscription!$A$6:$G$205,7,FALSE)),\" \")","v":431995},null,{"$f":"IF(A35>0,(VLOOKUP($A35,Inscription!$A$6:$G$205,6,FALSE)),\" \")","v":"minimes"},{"$f":"IF(CLASSEMENT!I29=CLASSEMENT!I28,0,CLASSEMENT!I29-CLASSEMENT!$I$4)","v":"00:00:00"},null,{"$f":"CLASSEMENT!C29","v":25}]
[{"$f":"CLASSEMENT!C30","v":22},{"$f":"CLASSEMENT!$B30","v":8},{"$f":"IF(A36>0,CONCATENATE((VLOOKUP($A36,Inscription!$A$6:$G$205,3,FALSE)),\"   \",(VLOOKUP($A36,Inscription!$A$6:$G$205,4,FALSE))),\" \")","v":"BOLORE   Ewen"},null,null,null,null,{"$f":"IF(A36>0,(VLOOKUP($A36,Inscription!$A$6:$G$205,5,FALSE)),\" \")","v":"team bikers"},null,null,{"$f":"IF(A36>0,(VLOOKUP($A36,Inscription!$A$6:$G$205,7,FALSE)),\" \")","v":376263},null,{"$f":"IF(A36>0,(VLOOKUP($A36,Inscription!$A$6:$G$205,6,FALSE)),\" \")","v":"minimes"},{"$f":"IF(CLASSEMENT!I30=CLASSEMENT!I29,0,CLASSEMENT!I30-CLASSEMENT!$I$4)","v":"00:00:00"},null,{"$f":"CLASSEMENT!C30","v":22}]
[{"$f":"CLASSEMENT!C31","v":0},{"$f":"CLASSEMENT!$B31","v":0},{"$f":"IF(A37>0,CONCATENATE((VLOOKUP($A37,Inscription!$A$6:$G$205,3,FALSE)),\"   \",(VLOOKUP($A37,Inscription!$A$6:$G$205,4,FALSE))),\" \")","v":" "},null,null,null,null,{"$f":"IF(A37>0,(VLOOKUP($A37,Inscription!$A$6:$G$205,5,FALSE)),\" \")","v":" "},null,null,{"$f":"IF(A37>0,(VLOOKUP($A37,Inscription!$A$6:$G$205,7,FALSE)),\" \")","v":" "},null,{"$f":"IF(A37>0,(VLOOKUP($A37,Inscription!$A$6:$G$205,6,FALSE)),\" \")","v":" "},{"$f":"IF(CLASSEMENT!I31=CLASSEMENT!I30,0,CLASSEMENT!I31-CLASSEMENT!$I$4)","v":"00:00:00"},null,{"$f":"CLASSEMENT!C31","v":0}]
[{"$f":"CLASSEMENT!C32","v":30},{"$f":"CLASSEMENT!$B32","v":1},{"$f":"IF(A38>0,CONCATENATE((VLOOKUP($A38,Inscription!$A$6:$G$205,3,FALSE)),\"   \",(VLOOKUP($A38,Inscription!$A$6:$G$205,4,FALSE))),\" \")","v":"FERTE   Brandon"},null,null,null,null,{"$f":"IF(A38>0,(VLOOKUP($A38,Inscription!$A$6:$G$205,5,FALSE)),\" \")","v":"distric loudéac"},null,null,{"$f":"IF(A38>0,(VLOOKUP($A38,Inscription!$A$6:$G$205,7,FALSE)),\" \")","v":297227},null,{"$f":"IF(A38>0,(VLOOKUP($A38,Inscription!$A$6:$G$205,6,FALSE)),\" \")","v":"cadet"},{"$f":"IF(CLASSEMENT!I32=CLASSEMENT!I31,0,CLASSEMENT!I32-CLASSEMENT!$I$4)","v":"00:00:00"},null,{"$f":"CLASSEMENT!C32","v":30}]
[{"$f":"CLASSEMENT!C33","v":31},{"$f":"CLASSEMENT!$B33","v":2},{"$f":"IF(A39>0,CONCATENATE((VLOOKUP($A39,Inscription!$A$6:$G$205,3,FALSE)),\"   \",(VLOOKUP($A39,Inscription!$A$6:$G$205,4,FALSE))),\" \")","v":"LEPERCQ   Nathan"},null,null,null,null,{"$f":"IF(A39>0,(VLOOKUP($A39,Inscription!$A$6:$G$205,5,FALSE)),\" \")","v":"uc plaudren"},null,null,{"$f":"IF(A39>0,(VLOOKUP($A39,Inscription!$A$6:$G$205,7,FALSE)),\" \")","v":389000},null,{"$f":"IF(A39>0,(VLOOKUP($A39,Inscription!$A$6:$G$205,6,FALSE)),\" \")","v":"cadet"},{"$f":"IF(CLASSEMENT!I33=CLASSEMENT!I32,0,CLASSEMENT!I33-CLASSEMENT!$I$4)","v":"00:00:00"},null,{"$f":"CLASSEMENT!C33","v":31}]
["SUITE : ",null,{"$f":"$P40","v":0},{"$f":"$P41","v":35},{"$f":"P42","v":0},{"$f":"P43","v":42},{"$f":"P44","v":43},{"$f":"P45","v":40},{"$f":"P46","v":41},{"$f":"P47","v":0},{"$f":"P48","v":48},{"$f":"P49","v":54},{"$f":"P50","v":53},{"$f":"P51","v":50},null,{"$f":"CLASSEMENT!C34","v":0}]
[{"$f":"P52","v":49},{"$f":"P53","v":51},{"$f":"$P54","v":45},{"$f":"P55","v":46},{"$f":"P56","v":47},{"$f":"P57","v":52},{"$f":"P58","v":0},{"$f":"P59","v":72},{"$f":"P60","v":65},{"$f":"$P$61","v":64},{"$f":"$P$62","v":73},{"$f":"$P$63","v":68},{"$f":"$P$64","v":61},{"$f":"$P$65","v":60},null,{"$f":"CLASSEMENT!C35","v":35}]
[{"$f":"$P$66","v":63},{"$f":"$P$67","v":71},{"$f":"$P68","v":70},{"$f":"$P$69","v":66},{"$f":"$P$70","v":67},{"$f":"$P$71","v":69},{"$f":"$P$72","v":62},{"$f":"$P$73","v":0},{"$f":"$P$74","v":0},{"$f":"$P$75","v":0},{"$f":"$P$76","v":0},{"$f":"$P$77","v":0},{"$f":"$P$78","v":0},{"$f":"$P$79","v":0},null,{"$f":"CLASSEMENT!C36","v":0}]
[{"$f":"$P$80","v":0},{"$f":"$P$81","v":0},{"$f":"$P82","v":0},{"$f":"$P$83","v":0},{"$f":"$P$84","v":0},{"$f":"$P$85","v":0},{"$f":"$P$86","v":0},{"$f":"$P$87","v":0},{"$f":"$P$88","v":0},{"$f":"$P$89","v":0},{"$f":"$P$90","v":0},{"$f":"$P$91","v":0},{"$f":"$P$92","v":0},{"$f":"$P$93","v":0},null,{"$f":"CLASSEMENT!C37","v":42}]
[{"$f":"$P$94","v":0},{"$f":"$P$95","v":0},{"$f":"$P96","v":0},{"$f":"$P$97","v":0},{"$f":"$P$98","v":0},{"$f":"$P$99","v":0},{"$f":"$P$100","v":0},{"$f":"$P$101","v":0},{"$f":"$P$102","v":0},{"$f":"$P$103","v":0},{"$f":"$P$104","v":0},{"$f":"$P$105","v":0},{"$f":"$P$106","v":0},{"$f":"$P$107","v":0},null,{"$f":"CLASSEMENT!C38","v":43}]
[{"$f":"$P$108","v":0},{"$f":"$P$109","v":0},{"$f":"$P110","v":0},{"$f":"$P$111","v":0},{"$f":"$P$112","v":0},{"$f":"$P$113","v":0},{"$f":"$P$114","v":0},{"$f":"$P$115","v":0},{"$f":"$P$116","v":0},{"$f":"$P$117","v":0},{"$f":"$P$118","v":0},{"$f":"$P$119","v":0},{"$f":"$P$120","v":0},{"$f":"$P$121","v":0},null,{"$f":"CLASSEMENT!C39","v":40}]
[{"$f":"$P$122","v":0},{"$f":"$P$123","v":0},{"$f":"$P124","v":0},{"$f":"$P$125","v":0},{"$f":"$P$126","v":0},{"$f":"$P$127","v":0},{"$f":"$P$128","v":0},{"$f":"$P$129","v":0},{"$f":"$P$130","v":0},{"$f":"$P$131","v":0},{"$f":"$P$132","v":0},{"$f":"$P$133","v":0},{"$f":"$P$134","v":0},{"$f":"$P$135","v":0},null,{"$f":"CLASSEMENT!C40","v":41}]
[{"$f":"$P$136","v":0},{"$f":"$P$137","v":0},{"$f":"$P138","v":0},{"$f":"$P$139","v":0},{"$f":"$P$140","v":0},{"$f":"$P$141","v":0},{"$f":"$P$142","v":0},{"$f":"$P$143","v":0},{"$f":"$P$144","v":0},{"$f":"$P$145","v":0},{"$f":"$P$146","v":0},{"$f":"$P$147","v":0},{"$f":"$P$148","v":0},{"$f":"$P$149","v":0},null,{"$f":"CLASSEMENT!C41","v":0}]
[{"$f":"IF(Inscription!#REF!=\"oui\",\"CHALLENGE\",\"Meilleurs Animateurs\")","v":{"$error":"#REF!"}},{"$f":"IF(Inscription!G4=\"oui\",\"CHALLENGE\",\"PRIX D EQUIPE\")","v":"PRIX D EQUIPE"},{"$f":"IF(Inscription!#REF!=\"oui\",\"CHALLENGE\",\"PRIX D EQUIPE\")","v":{"$error":"#REF!"}},{"$f":"IF(Inscription!#REF!=\"oui\",\"CHALLENGE\",\"PRIX D EQUIPE\")","v":{"$error":"#REF!"}},{"$f":"IF(Inscription!H4=\"oui\",\"CHALLENGE\",\"PRIX D EQUIPE\")","v":"PRIX D EQUIPE"},{"$f":"IF(Inscription!I4=\"oui\",\"CHALLENGE\",\"PRIX D EQUIPE\")","v":"PRIX D EQUIPE"},{"$f":"IF(Inscription!J4=\"oui\",\"CHALLENGE\",\"PRIX D EQUIPE\")","v":"PRIX D EQUIPE"},null,null,"Nombre de clubs engagés",null,null,null,{"$f":"COUNTA('PRIX D EQUIPE'!B5:B39)","v":0},null,{"$f":"CLASSEMENT!C42","v":48}]
[null,"1er",{"$f":"IF(CLASSEMENT!AC45>0,CLASSEMENT!AC45,\" \")","v":" "},null,null,null,{"$f":"CLASSEMENT!AE45","v":1000},"+",{"$f":"CLASSEMENT!AG45","v":1000},"+",{"$f":"CLASSEMENT!AI45","v":1000},"=",{"$f":"IF(C49=\" \",\" \",IF(I49>200,G49,IF(K49>200,SUM(G49+I49),IF($C49>0,SUM(G49+I49+K49),\" \"))))","v":" "},{"$f":"IF(C49=\" \",\" \",IF(I49>200,\"(1H.)\",IF(K49>200,\"(2 H.)\",\" \")))","v":" "},null,{"$f":"CLASSEMENT!C43","v":54}]
[null,"2e",{"$f":"IF(CLASSEMENT!AC46>0,CLASSEMENT!AC46,\" \")","v":" "},null,null,null,{"$f":"CLASSEMENT!AE46","v":1000},"+",{"$f":"CLASSEMENT!AG46","v":1000},"+",{"$f":"CLASSEMENT!AI46","v":1000},"=",{"$f":"IF(C50=\" \",\" \",IF(I50>200,G50,IF(K50>200,SUM(G50+I50),IF($C50>0,SUM(G50+I50+K50),\" \"))))","v":" "},{"$f":"IF(C50=\" \",\" \",IF(I50>200,\"(1H.)\",IF(K50>200,\"(2 H.)\",\" \")))","v":" "},null,{"$f":"CLASSEMENT!C44","v":53}]
[null,"3e",{"$f":"IF(CLASSEMENT!AC47>0,CLASSEMENT!AC47,\" \")","v":" "},null,null,null,{"$f":"CLASSEMENT!AE47","v":1000},"+",{"$f":"CLASSEMENT!AG47","v":1000},"+",{"$f":"CLASSEMENT!AI47","v":1000},"=",{"$f":"IF(C51=\" \",\" \",IF(I51>200,G51,IF(K51>200,SUM(G51+I51),IF($C51>0,SUM(G51+I51+K51),\" \"))))","v":" "},{"$f":"IF(C51=\" \",\" \",IF(I51>200,\"(1H.)\",IF(K51>200,\"(2 H.)\",\" \")))","v":" "},null,{"$f":"CLASSEMENT!C45","v":50}]
[null,"4e",{"$f":"IF(CLASSEMENT!AC48>0,CLASSEMENT!AC48,\" \")","v":" "},null,null,null,{"$f":"CLASSEMENT!AE48","v":1000},"+",{"$f":"CLASSEMENT!AG48","v":1000},"+",{"$f":"CLASSEMENT!AI48","v":1000},"=",{"$f":"IF(C52=\" \",\" \",IF(I52>200,G52,IF(K52>200,SUM(G52+I52),IF($C52>0,SUM(G52+I52+K52),\" \"))))","v":" "},{"$f":"IF(C52=\" \",\" \",IF(I52>200,\"(1H.)\",IF(K52>200,\"(2 H.)\",\" \")))","v":" "},null,{"$f":"CLASSEMENT!C46","v":49}]
[null,"5e",{"$f":"IF(CLASSEMENT!AC49>0,CLASSEMENT!AC49,\" \")","v":" "},null,null,null,{"$f":"CLASSEMENT!AE49","v":1000},"+",{"$f":"CLASSEMENT!AG49","v":1000},"+",{"$f":"CLASSEMENT!AI49","v":1000},"=",{"$f":"IF(C53=\" \",\" \",IF(I53>200,G53,IF(K53>200,SUM(G53+I53),IF($C53>0,SUM(G53+I53+K53),\" \"))))","v":" "},{"$f":"IF(C53=\" \",\" \",IF(I53>200,\"(1H.)\",IF(K53>200,\"(2 H.)\",\" \")))","v":" "},null,{"$f":"CLASSEMENT!C47","v":51}]
[null,null,null,null,null,null,null,null,null,null,null,null,null,null,null,{"$f":"CLASSEMENT!C48","v":45}]
[null,null,null,null,null,null,null,null,null,null,null,null,null,null,null,{"$f":"CLASSEMENT!C49","v":46}]
[null,null,null,null,null,null,null,null,null,null,null,null,null,null,null,{"$f":"CLASSEMENT!C50","v":47}]
[null,null,null,null,null,null,null,null,null,null,null,null,null,null,null,{"$f":"CLASSEMENT!C51","v":52}]
[null,null,null,null,null,null,null,null,null,null,null,null,null,null,null,{"$f":"CLASSEMENT!C52","v":0}]
[null,null,null,null,null,null,null,null,null,null,null,null,null,null,null,{"$f":"CLASSEMENT!C53","v":72}]
[null,null,null,null,null,null,null,null,null,null,null,null,null,null,null,{"$f":"CLASSEMENT!C54","v":65}]
[null,null,null,null,null,null,null,null,null,null,null,null,null,null,null,{"$f":"CLASSEMENT!C55","v":64}]
[null,null,null,null,null,null,null,null,null,null,null,null,null,null,null,{"$f":"CLASSEMENT!C56","v":73}]
[null,null,null,null,null,null,null,null,null,null,null,null,null,null,null,{"$f":"CLASSEMENT!C57","v":68}]
[null,null,null,null,null,null,null,null,null,null,null,null,null,null,null,{"$f":"CLASSEMENT!C58","v":61}]
[null,null,null,null,null,null,null,null,null,null,null,null,null,null,null,{"$f":"CLASSEMENT!C59","v":60}]
[null,null,null,null,null,null,null,null,null,null,null,null,null,null,null,{"$f":"CLASSEMENT!C60","v":63}]
[null,null,null,null,null,null,null,null,null,null,null,null,null,null,null,{"$f":"CLASSEMENT!C61","v":71}]
[null,null,null,null,null,null,null,null,null,null,null,null,null,null,null,{"$f":"CLASSEMENT!C62","v":70}]
[null,null,null,null,null,null,null,null,null,null,null,null,null,null,null,{"$f":"CLASSEMENT!C63","v":66}]
[null,null,null,null,null,null,null,null,null,null,null,null,null,null,null,{"$f":"CLASSEMENT!C64","v":67}]
[null,null,null,null,null,null,null,null,null,null,null,null,null,null,null,{"$f":"CLASSEMENT!C65","v":69}]
[null,null,null,null,null,null,null,null,null,null,null,null,null,null,null,{"$f":"CLASSEMENT!C66","v":62}]
[null,null,null,null,null,null,null,null,null,null,null,null,null,null,null,{"$f":"CLASSEMENT!C67","v":0}]
[null,null,null,null,null,null,null,null,null,null,null,null,null,null,null,{"$f":"CLASSEMENT!C68","v":0}]
[null,null,null,null,null,null,null,null,null,null,null,null,null,null,null,{"$f":"CLASSEMENT!C69","v":0}]
[null,null,null,null,null,null,null,null,null,null,null,null,null,null,null,{"$f":"CLASSEMENT!C70","v":0}]
[null,null,null,null,null,null,null,null,null,null,null,null,null,null,null,{"$f":"CLASSEMENT!C71","v":0}]
[null,null,null,null,null,null,null,null,null,null,null,null,null,null,null,{"$f":"CLASSEMENT!C72","v":0}]
[null,null,null,null,null,null,null,null,null,null,null,null,null,null,null,{"$f":"CLASSEMENT!C73","v":0}]
[null,null,null,null,null,null,null,null,null,null,null,null,null,null,null,{"$f":"CLASSEMENT!C74","v":0}]
[null,null,null,null,null,null,null,null,null,null,null,null,null,null,null,{"$f":"CLASSEMENT!C75","v":0}]
[null,null,null,null,null,null,null,null,null,null,null,null,null,null,null,{"$f":"CLASSEMENT!C76","v":0}]
[null,null,null,null,null,null,null,null,null,null,null,null,null,null,null,{"$f":"CLASSEMENT!C77","v":0}]
[null,null,null,null,null,null,null,null,null,null,null,null,null,null,null,{"$f":"CLASSEMENT!C78","v":0}]
[null,null,null,null,null,null,null,null,null,null,null,null,null,null,null,{"$f":"CLASSEMENT!C79","v":0}]
[null,null,null,null,null,null,null,null,null,null,null,null,null,null,null,{"$f":"CLASSEMENT!C80","v":0}]
[null,null,null,null,null,null,null,null,null,null,null,null,null,null,null,{"$f":"CLASSEMENT!C81","v":0}]
[null,null,null,null,null,null,null,null,null,null,null,null,null,null,null,{"$f":"CLASSEMENT!C82","v":0}]
[null,null,null,null,null,null,null,null,null,null,null,null,null,null,null,{"$f":"CLASSEMENT!C83","v":0}]
[null,null,null,null,null,null,null,null,null,null,null,null,null,null,null,{"$f":"CLASSEMENT!C84","v":0}]
[null,null,null,null,null,null,null,null,null,null,null,null,null,null,null,{"$f":"CLASSEMENT!C85","v":0}]
[null,null,null,null,null,null,null,null,null,null,null,null,null,null,null,{"$f":"CLASSEMENT!C86","v":0}]
[null,null,null,null,null,null,null,null,null,null,null,null,null,null,null,{"$f":"CLASSEMENT!C87","v":0}]
[null,null,null,null,null,null,null,null,null,null,null,null,null,null,null,{"$f":"CLASSEMENT!C88","v":0}]
[null,null,null,null,null,null,null,null,null,null,null,null,null,null,null,{"$f":"CLASSEMENT!C89","v":0}]
[null,null,null,null,null,null,null,null,null,null,null,null,null,null,null,{"$f":"CLASSEMENT!C90","v":0}]
[null,null,null,null,null,null,null,null,null,null,null,null,null,null,null,{"$f":"CLASSEMENT!C91","v":0}]
[null,null,null,null,null,null,null,null,null,null,null,null,null,null,null,{"$f":"CLASSEMENT!C92","v":0}]
[null,null,null,null,null,null,null,null,null,null,null,null,null,null,null,{"$f":"CLASSEMENT!C93","v":0}]
[null,null,null,null,null,null,null,null,null,null,null,null,null,null,null,{"$f":"CLASSEMENT!C94","v":0}]
[null,null,null,null,null,null,null,null,null,null,null,null,null,null,null,{"$f":"CLASSEMENT!C95","v":0}]
[null,null,null,null,null,null,null,null,null,null,null,null,null,null,null,{"$f":"CLASSEMENT!C96","v":0}]
[null,null,null,null,null,null,null,null,null,null,null,null,null,null,null,{"$f":"CLASSEMENT!C97","v":0}]
[null,null,null,null,null,null,null,null,null,null,null,null,null,null,null,{"$f":"CLASSEMENT!C98","v":0}]
[null,null,null,null,null,null,null,null,null,null,null,null,null,null,null,{"$f":"CLASSEMENT!C99","v":0}]
[null,null,null,null,null,null,null,null,null,null,null,null,null,null,null,{"$f":"CLASSEMENT!C100","v":0}]
[null,null,null,null,null,null,null,null,null,null,null,null,null,null,null,{"$f":"CLASSEMENT!C101","v":0}]
[null,null,null,null,null,null,null,null,null,null,null,null,null,null,null,{"$f":"CLASSEMENT!C102","v":0}]
[null,null,null,null,null,null,null,null,null,null,null,null,null,null,null,{"$f":"CLASSEMENT!C103","v":0}]
[null,null,null,null,null,null,null,null,null,null,null,null,null,null,null,{"$f":"CLASSEMENT!C104","v":0}]
[null,null,null,null,null,null,null,null,null,null,null,null,null,null,null,{"$f":"CLASSEMENT!C105","v":0}]
[null,null,null,null,null,null,null,null,null,null,null,null,null,null,null,{"$f":"CLASSEMENT!C106","v":0}]
[null,null,null,null,null,null,null,null,null,null,null,null,null,null,null,{"$f":"CLASSEMENT!C107","v":0}]
[null,null,null,null,null,null,null,null,null,null,null,null,null,null,null,{"$f":"CLASSEMENT!C108","v":0}]
[null,null,null,null,null,null,null,null,null,null,null,null,null,null,null,{"$f":"CLASSEMENT!C109","v":0}]
[null,null,null,null,null,null,null,null,null,null,null,null,null,null,null,{"$f":"CLASSEMENT!C110","v":0}]
[null,null,null,null,null,null,null,null,null,null,null,null,null,null,null,{"$f":"CLASSEMENT!C111","v":0}]
[null,null,null,null,null,null,null,null,null,null,null,null,null,null,null,{"$f":"CLASSEMENT!C112","v":0}]
[null,null,null,null,null,null,null,null,null,null,null,null,null,null,null,{"$f":"CLASSEMENT!C113","v":0}]
[null,null,null,null,null,null,null,null,null,null,null,null,null,null,null,{"$f":"CLASSEMENT!C114","v":0}]
[null,null,null,null,null,null,null,null,null,null,null,null,null,null,null,{"$f":"CLASSEMENT!C115","v":0}]
[null,null,null,null,null,null,null,null,null,null,null,null,null,null,null,{"$f":"CLASSEMENT!C116","v":0}]
[null,null,null,null,null,null,null,null,null,null,null,null,null,null,null,{"$f":"CLASSEMENT!C117","v":0}]
[null,null,null,null,null,null,null,null,null,null,null,null,null,null,null,{"$f":"CLASSEMENT!C118","v":0}]
[null,null,null,null,null,null,null,null,null,null,null,null,null,null,null,{"$f":"CLASSEMENT!C119","v":0}]
[null,null,null,null,null,null,null,null,null,null,null,null,null,null,null,{"$f":"CLASSEMENT!C120","v":0}]
[null,null,null,null,null,null,null,null,null,null,null,null,null,null,null,{"$f":"CLASSEMENT!C121","v":0}]
[null,null,null,null,null,null,null,null,null,null,null,null,null,null,null,{"$f":"CLASSEMENT!C122","v":0}]
[null,null,null,null,null,null,null,null,null,null,null,null,null,null,null,{"$f":"CLASSEMENT!C123","v":0}]
[null,null,null,null,null,null,null,null,null,null,null,null,null,null,null,{"$f":"CLASSEMENT!C124","v":0}]
[null,null,null,null,null,null,null,null,null,null,null,null,null,null,null,{"$f":"CLASSEMENT!C125","v":0}]
[null,null,null,null,null,null,null,null,null,null,null,null,null,null,null,{"$f":"CLASSEMENT!C126","v":0}]
[null,null,null,null,null,null,null,null,null,null,null,null,null,null,null,{"$f":"CLASSEMENT!C127","v":0}]
[null,null,null,null,null,null,null,null,null,null,null,null,null,null,null,{"$f":"CLASSEMENT!C128","v":0}]
[null,null,null,null,null,null,null,null,null,null,null,null,null,null,null,{"$f":"CLASSEMENT!C129","v":0}]
[null,null,null,null,null,null,null,null,null,null,null,null,null,null,null,{"$f":"CLASSEMENT!C130","v":0}]
[null,null,null,null,null,null,null,null,null,null,null,null,null,null,null,{"$f":"CLASSEMENT!C131","v":0}]
[null,null,null,null,null,null,null,null,null,null,null,null,null,null,null,{"$f":"CLASSEMENT!C132","v":0}]
[null,null,null,null,null,null,null,null,null,null,null,null,null,null,null,{"$f":"CLASSEMENT!C133","v":0}]
[null,null,null,null,null,null,null,null,null,null,null,null,null,null,null,{"$f":"CLASSEMENT!C134","v":0}]
[null,null,null,null,null,null,null,null,null,null,null,null,null,null,null,{"$f":"CLASSEMENT!C135","v":0}]
[null,null,null,null,null,null,null,null,null,null,null,null,null,null,null,{"$f":"CLASSEMENT!C136","v":0}]
[null,null,null,null,null,null,null,null,null,null,null,null,null,null,null,{"$f":"CLASSEMENT!C137","v":0}]
[null,null,null,null,null,null,null,null,null,null,null,null,null,null,null,{"$f":"CLASSEMENT!C138","v":0}]
[null,null,null,null,null,null,null,null,null,null,null,null,null,null,null,{"$f":"CLASSEMENT!C139","v":0}]
[null,null,null,null,null,null,null,null,null,null,null,null,null,null,null,{"$f":"CLASSEMENT!C140","v":0}]
[null,null,null,null,null,null,null,null,null,null,null,null,null,null,null,{"$f":"CLASSEMENT!C141","v":0}]
[null,null,null,null,null,null,null,null,null,null,null,null,null,null,null,{"$f":"CLASSEMENT!C142","v":0}]
[null,null,null,null,null,null,null,null,null,null,null,null,null,null,null,{"$f":"CLASSEMENT!C143","v":0}]
[null,null,null,null,null,null,null,null,null,null,null,null,null,null,null,{"$f":"CLASSEMENT!C144","v":0}]
[null,null,null,null,null,null,null,null,null,null,null,null,null,null,null,{"$f":"CLASSEMENT!C145","v":0}]
[null,null,null,null,null,null,null,null,null,null,null,null,null,null,null,{"$f":"CLASSEMENT!C146","v":0}]
[null,null,null,null,null,null,null,null,null,null,null,null,null,null,null,{"$f":"CLASSEMENT!C147","v":0}]
[null,null,null,null,null,null,null,null,null,null,null,null,null,null,null,{"$f":"CLASSEMENT!C148","v":0}]
[null,null,null,null,null,null,null,null,null,null,null,null,null,null,null,{"$f":"CLASSEMENT!C149","v":0}]
[null,null,null,null,null,null,null,null,null,null,null,null,null,null,null,{"$f":"CLASSEMENT!C150","v":0}]
[null,null,null,null,null,null,null,null,null,null,null,null,null,null,null,{"$f":"CLASSEMENT!C151","v":0}]
[null,null,null,null,null,null,null,null,null,null,null,null,null,null,null,{"$f":"CLASSEMENT!C152","v":0}]
[null,null,null,null,null,null,null,null,null,null,null,null,null,null,null,{"$f":"CLASSEMENT!C153","v":0}]
[null,null,null,null,null,null,null,null,null,null,null,null,null,null,null,{"$f":"CLASSEMENT!C154","v":0}]
[null,null,null,null,null,null,null,null,null,null,null,null,null,null,null,{"$f":"CLASSEMENT!C155","v":0}]
[null,null,null,null,null,null,null,null,null,null,null,null,null,null,null,{"$f":"CLASSEMENT!C156","v":0}]
[null,null,null,null,null,null,null,null,null,null,null,null,null,null,null,{"$f":"CLASSEMENT!C157","v":0}]
[null,null,null,null,null,null,null,null,null,null,null,null,null,null,null,{"$f":"CLASSEMENT!C158","v":0}]
[null,null,null,null,null,null,null,null,null,null,null,null,null,null,null,{"$f":"CLASSEMENT!C159","v":0}]
[null,null,null,null,null,null,null,null,null,null,null,null,null,null,null,{"$f":"CLASSEMENT!C160","v":0}]
[null,null,null,null,null,null,null,null,null,null,null,null,null,null,null,{"$f":"CLASSEMENT!C161","v":0}]
[null,null,null,null,null,null,null,null,null,null,null,null,null,null,null,{"$f":"CLASSEMENT!C162","v":0}]
[null,null,null,null,null,null,null,null,null,null,null,null,null,null,null,{"$f":"CLASSEMENT!C163","v":0}]
[null,null,null,null,null,null,null,null,null,null,null,null,null,null,null,{"$f":"CLASSEMENT!C164","v":0}]
[null,null,null,null,null,null,null,null,null,null,null,null,null,null,null,{"$f":"CLASSEMENT!C165","v":0}]
[null,null,null,null,null,null,null,null,null,null,null,null,null,null,null,{"$f":"CLASSEMENT!C166","v":0}]
[null,null,null,null,null,null,null,null,null,null,null,null,null,null,null,{"$f":"CLASSEMENT!C167","v":0}]
[null,null,null,null,null,null,null,null,null,null,null,null,null,null,null,{"$f":"CLASSEMENT!C168","v":0}]
[null,null,null,null,null,null,null,null,null,null,null,null,null,null,null,{"$f":"CLASSEMENT!C169","v":0}]
[null,null,null,null,null,null,null,null,null,null,null,null,null,null,null,{"$f":"CLASSEMENT!C170","v":0}]
[null,null,null,null,null,null,null,null,null,null,null,null,null,null,null,{"$f":"CLASSEMENT!C171","v":0}]
[null,null,null,null,null,null,null,null,null,null,null,null,null,null,null,{"$f":"CLASSEMENT!C172","v":0}]
[null,null,null,null,null,null,null,null,null,null,null,null,null,null,null,{"$f":"CLASSEMENT!C173","v":0}]
[null,null,null,null,null,null,null,null,null,null,null,null,null,null,null,{"$f":"CLASSEMENT!C174","v":0}]
[null,null,null,null,null,null,null,null,null,null,null,null,null,null,null,{"$f":"CLASSEMENT!C175","v":0}]
[null,null,null,null,null,null,null,null,null,null,null,null,null,null,null,{"$f":"CLASSEMENT!C176","v":0}]
[null,null,null,null,null,null,null,null,null,null,null,null,null,null,null,{"$f":"CLASSEMENT!C177","v":0}]
[null,null,null,null,null,null,null,null,null,null,null,null,null,null,null,{"$f":"CLASSEMENT!C178","v":0}]
[null,null,null,null,null,null,null,null,null,null,null,null,null,null,null,{"$f":"CLASSEMENT!C179","v":0}]
[null,null,null,null,null,null,null,null,null,null,null,null,null,null,null,{"$f":"CLASSEMENT!C180","v":0}]
[null,null,null,null,null,null,null,null,null,null,null,null,null,null,null,{"$f":"CLASSEMENT!C181","v":0}]
[null,null,null,null,null,null,null,null,null,null,null,null,null,null,null,{"$f":"CLASSEMENT!C182","v":0}]
[null,null,null,null,null,null,null,null,null,null,null,null,null,null,null,{"$f":"CLASSEMENT!C183","v":0}]
[null,null,null,null,null,null,null,null,null,null,null,null,null,null,null,{"$f":"CLASSEMENT!C184","v":0}]
[null,null,null,null,null,null,null,null,null,null,null,null,null,null,null,{"$f":"CLASSEMENT!C185","v":0}]
[null,null,null,null,null,null,null,null,null,null,null,null,null,null,null,{"$f":"CLASSEMENT!C186","v":0}]
[null,null,null,null,null,null,null,null,null,null,null,null,null,null,null,{"$f":"CLASSEMENT!C187","v":0}]
[null,null,null,null,null,null,null,null,null,null,null,null,null,null,null,{"$f":"CLASSEMENT!C188","v":0}]
[null,null,null,null,null,null,null,null,null,null,null,null,null,null,null,{"$f":"CLASSEMENT!C189","v":0}]
[null,null,null,null,null,null,null,null,null,null,null,null,null,null,null,{"$f":"CLASSEMENT!C190","v":0}]
[null,null,null,null,null,null,null,null,null,null,null,null,null,null,null,{"$f":"CLASSEMENT!C191","v":0}]
[null,null,null,null,null,null,null,null,null,null,null,null,null,null,null,{"$f":"CLASSEMENT!C192","v":0}]
[null,null,null,null,null,null,null,null,null,null,null,null,null,null,null,{"$f":"CLASSEMENT!C203","v":0}]

{"sheet":"ETAT RESULT","index":8,"n_rows":39,"n_cols":7,"rows_kept":39,"cut":false,"hidden":true,"merged":[[23,3,23,4],[28,1,28,2],[23,5,23,6],[37,0,37,7],[24,1,26,1],[24,3,24,4],[25,3,25,4],[26,3,26,4],[25,5,25,6],[26,5,26,6],[27,5,27,6],[38,0,38,7],[24,5,24,6],[27,3,27,4],[28,3,28,4],[29,3,29,4],[29,5,29,6],[28,5,28,6],[35,0,36,7],[11,0,11,3],[21,3,21,7],[22,3,22,4],[22,5,22,6],[12,4,12,6],[13,4,13,5],[18,3,18,7],[19,5,19,6],[15,0,15,2],[15,3,15,7],[16,0,16,2],[16,3,16,5],[17,3,17,7],[8,0,8,7],[9,0,9,7],[0,0,0,7],[1,0,1,7],[2,0,2,7],[3,0,3,7],[4,0,4,7],[6,0,6,7]]}
["FEDERATION SPORTIVE ET GYMNIQUE DU TRAVAIL"]
["F.S.G.T 29"]
[]
[]
[]
[]
["Etat de Résultats"]
[]
["à transmettre dans les 48 heures qui suivent l'épreuve,"]
["pour HOMOLOGATION à la Commission Cyclisme 29"]
[]
["CONTRÔLE ANTIDOPAGE",null,null,null,"OUI",null,"NON"]
[null,null,null,null,"(Rayer la mention inutile)"]
[null,null,null,"DATE :"]
[]
["Titre de l'épreuve :"]
["Lieu de l'épreuve :"]
["Association organisatrice :"]
["Séries ou Catégories :"]
["Distance :",null,null,"kms","TEMPS :",{"$f":"CLASSEMENT!I4","v":"00:00:00"}]
[]
[null,null,null,"COMMISSAIRES"]
[null,null,null,"NOMS",null,"ASSOCIATIONS"]
[null,null,"Prés. Du Jury"]
["1.","}"]
["2.",null,"Commissaires"]
["3."]
[null,null,"Juge à l'arrivée"]
[null,"Commissaire moto"]
[null,null,"Chronométreur"]
[]
[]
["ENGAGES : ",null,{"$f":"Inscription!#REF!","v":{"$error":"#REF!"}},"PARTANTS :",{"$f":"Inscription!#REF!","v":{"$error":"#REF!"}},null,{"$f":"CLASSEMENT!$I$2","v":55}]
[]
["AVIS IMPORTANT :"]
["- Cet ETAT DE RESULTATS doit être rempli intégralement, le nom, le prénom usuel, le n°de licence et le nom de l'association du coureur doivent être indiqués en entier."]
[]
["   - Ne pas omettre de signer au verso (Commissaires, chrono, etc…)."]
["   - Joindre obligatoirement la liste des engagés"]

{"sheet":"ETAT RES VERSO","index":9,"n_rows":40,"n_cols":16,"rows_kept":40,"cut":false,"hidden":true,"merged":[[39,0,42,1],[39,2,42,12],[39,13,42,13],[39,14,42,15],[11,15,12,15],[12,2,12,11],[34,0,35,0],[34,1,35,1],[34,2,34,11],[11,14,12,14],[16,12,17,15],[32,1,33,1],[32,2,32,11],[32,12,33,15],[33,2,33,11],[15,12,15,15],[16,2,16,11],[18,12,19,15],[20,12,21,15],[11,1,12,1],[11,12,12,12],[11,13,12,13],[30,1,31,1],[30,2,30,11],[30,12,31,15],[32,0,33,0],[24,12,25,15],[24,2,24,11],[25,2,25,11],[22,12,23,15],[15,0,15,10],[38,3,38,11],[24,0,25,0],[24,1,25,1],[28,2,28,11],[26,1,27,1],[26,2,26,11],[27,2,27,11],[31,2,31,11],[34,12,35,15],[35,2,35,11],[30,0,31,0],[37,0,37,15],[28,12,29,15],[29,2,29,11],[22,0,23,0],[22,1,23,1],[22,2,22,11],[23,2,23,11],[26,12,27,15],[26,0,27,0],[28,0,29,0],[28,1,29,1],[18,0,19,0],[18,1,19,1],[9,1,10,1],[11,2,11,11],[18,2,18,11],[19,2,19,11],[20,2,20,11],[21,2,21,11],[20,0,21,0],[20,1,21,1],[11,0,12,0],[13,15,14,15],[13,14,14,14],[13,0,14,0],[13,1,14,1],[13,12,14,12],[13,13,14,13],[13,2,13,11],[14,2,14,11],[16,0,17,0],[16,1,17,1],[17,2,17,11],[9,12,10,12],[9,13,10,13],[7,12,8,12],[7,13,8,13],[9,0,10,0],[9,14,10,14],[9,15,10,15],[7,15,8,15],[7,14,8,14],[7,0,8,0],[7,1,8,1],[7,2,7,11],[8,2,8,11],[9,2,9,11],[10,2,10,11],[5,2,5,11],[6,2,6,11],[2,2,2,11],[3,2,3,11],[4,2,4,11],[0,14,1,15],[5,12,6,12],[5,13,6,13],[5,14,6,14],[5,15,6,15],[0,12,0,13],[1,0,1,13],[0,4,0,9],[5,0,6,0],[5,1,6,1]]}
["LIEU :",{"$f":"Inscription!D2","v":"HENANSAL"},"DATE",null,{"$f":"Inscription!D4","v":"2023-10-01"},null,null,null,null,null,"CAT.:",null,{"$f":"Inscription!#REF!","v":{"$error":"#REF!"}},null,"AVIS \nSUR LES DECISIONS CI-CONTRE"]
["PENALITES : (s'il y a lieu), par décision des trois Commissaires de Course, qui doivent apposer leur signature sous le(s) motif(s)."]
["N°",null,"ASSOCIATION"]
["DE","NOM ET PRENOM","N° DE LICENCE",null,null,null,null,null,null,null,null,null,"Pénalités","MOTIF(S)","Commission 29","F.S.G.T"]
["DOSSARD"]
[null,{"$f":"IF(A6>0,CONCATENATE((VLOOKUP($A6,Inscription!$A$6:$G$205,3,FALSE)),\"   \",(VLOOKUP($A6,Inscription!$A$6:$G$205,4,FALSE))),\" \")","v":" "},{"$f":"IF(A6>0,(VLOOKUP($A6,Inscription!$A$6:$G$205,5,FALSE)),\" \")","v":" "}]
[null,{"$f":"IF(A7>0,(VLOOKUP($C7,Inscription!$A$6:$G$205,3,FALSE)),\" \")","v":" "},{"$f":"IF(A6>0,(VLOOKUP($A6,Inscription!$A$6:$G$205,7,FALSE)),\" \")","v":" "}]
[null,{"$f":"IF(A8>0,(VLOOKUP($A8,Inscription!$A$6:$G$205,3,FALSE)),\" \")","v":" "},{"$f":"IF(A8>0,(VLOOKUP($A8,Inscription!$A$6:$G$205,5,FALSE)),\" \")","v":" "}]
[null,{"$f":"IF(A9>0,(VLOOKUP($C9,Inscription!$A$6:$G$205,3,FALSE)),\" \")","v":" "},{"$f":"IF(A8>0,(VLOOKUP($A8,Inscription!$A$6:$G$205,7,FALSE)),\" \")","v":" "}]
[null,{"$f":"IF(A10>0,(VLOOKUP($A10,Inscription!$A$6:$G$205,3,FALSE)),\" \")","v":" "},{"$f":"IF(A10>0,(VLOOKUP($A10,Inscription!$A$6:$G$205,5,FALSE)),\" \")","v":" "}]
[null,{"$f":"IF(A11>0,(VLOOKUP($C11,Inscription!$A$6:$G$205,3,FALSE)),\" \")","v":" "},{"$f":"IF(A10>0,(VLOOKUP($A10,Inscription!$A$6:$G$205,7,FALSE)),\" \")","v":" "}]
[null,{"$f":"IF(A12>0,(VLOOKUP($A12,Inscription!$A$6:$G$205,3,FALSE)),\" \")","v":" "},{"$f":"IF(A12>0,(VLOOKUP($A12,Inscription!$A$6:$G$205,5,FALSE)),\" \")","v":" "}]
[null,{"$f":"IF(A13>0,(VLOOKUP($C13,Inscription!$A$6:$G$205,3,FALSE)),\" \")","v":" "},{"$f":"IF(A12>0,(VLOOKUP($A12,Inscription!$A$6:$G$205,7,FALSE)),\" \")","v":" "}]
[null,{"$f":"IF(A14>0,(VLOOKUP($A14,Inscription!$A$6:$G$205,3,FALSE)),\" \")","v":" "},{"$f":"IF(A14>0,(VLOOKUP($A14,Inscription!$A$6:$G$205,5,FALSE)),\" \")","v":" "}]
[null,{"$f":"IF(A15>0,(VLOOKUP($C15,Inscription!$A$6:$G$205,3,FALSE)),\" \")","v":" "},{"$f":"IF(A14>0,(VLOOKUP($A14,Inscription!$A$6:$G$205,7,FALSE)),\" \")","v":" "}]
["CHUTES – ACCIDENTS :",null,null,null,null,null,null,null,null,null,null,null,"SUITE DONNEE "]
[null,{"$f":"IF(A17>0,CONCATENATE((VLOOKUP($A17,Inscription!$A$6:$G$205,3,FALSE)),\"   \",(VLOOKUP($A17,Inscription!$A$6:$G$205,4,FALSE))),\" \")","v":" "},{"$f":"IF(A17>0,(VLOOKUP($A17,Inscription!$A$6:$G$205,5,FALSE)),\" \")","v":" "}]
[null,{"$f":"IF(A18>0,(VLOOKUP($C18,Inscription!$A$6:$G$205,3,FALSE)),\" \")","v":" "},{"$f":"IF(A17>0,(VLOOKUP($A17,Inscription!$A$6:$G$205,7,FALSE)),\" \")","v":" "}]
[null,{"$f":"IF(A19>0,CONCATENATE((VLOOKUP($A19,Inscription!$A$6:$G$205,3,FALSE)),\"   \",(VLOOKUP($A19,Inscription!$A$6:$G$205,4,FALSE))),\" \")","v":" "},{"$f":"IF(A19>0,(VLOOKUP($A19,Inscription!$A$6:$G$205,5,FALSE)),\" \")","v":" "}]
[null,{"$f":"IF(A20>0,(VLOOKUP($C20,Inscription!$A$6:$G$205,3,FALSE)),\" \")","v":" "},{"$f":"IF(A19>0,(VLOOKUP($A19,Inscription!$A$6:$G$205,7,FALSE)),\" \")","v":" "}]
[null,{"$f":"IF(A21>0,CONCATENATE((VLOOKUP($A21,Inscription!$A$6:$G$205,3,FALSE)),\"   \",(VLOOKUP($A21,Inscription!$A$6:$G$205,4,FALSE))),\" \")","v":" "},{"$f":"IF(A21>0,(VLOOKUP($A21,Inscription!$A$6:$G$205,5,FALSE)),\" \")","v":" "}]
[null,{"$f":"IF(A22>0,(VLOOKUP($C22,Inscription!$A$6:$G$205,3,FALSE)),\" \")","v":" "},{"$f":"IF(A21>0,(VLOOKUP($A21,Inscription!$A$6:$G$205,7,FALSE)),\" \")","v":" "}]
[null,{"$f":"IF(A23>0,CONCATENATE((VLOOKUP($A23,Inscription!$A$6:$G$205,3,FALSE)),\"   \",(VLOOKUP($A23,Inscription!$A$6:$G$205,4,FALSE))),\" \")","v":" "},{"$f":"IF(A23>0,(VLOOKUP($A23,Inscription!$A$6:$G$205,5,FALSE)),\" \")","v":" "}]
[null,{"$f":"IF(A24>0,(VLOOKUP($C24,Inscription!$A$6:$G$205,3,FALSE)),\" \")","v":" "},{"$f":"IF(A23>0,(VLOOKUP($A23,Inscription!$A$6:$G$205,7,FALSE)),\" \")","v":" "}]
[null,{"$f":"IF(A25>0,CONCATENATE((VLOOKUP($A25,Inscription!$A$6:$G$205,3,FALSE)),\"   \",(VLOOKUP($A25,Inscription!$A$6:$G$205,4,FALSE))),\" \")","v":" "},{"$f":"IF(A25>0,(VLOOKUP($A25,Inscription!$A$6:$G$205,5,FALSE)),\" \")","v":" "}]
[null,{"$f":"IF(A26>0,(VLOOKUP($C26,Inscription!$A$6:$G$205,3,FALSE)),\" \")","v":" "},{"$f":"IF(A25>0,(VLOOKUP($A25,Inscription!$A$6:$G$205,7,FALSE)),\" \")","v":" "}]
[null,{"$f":"IF(A27>0,CONCATENATE((VLOOKUP($A27,Inscription!$A$6:$G$205,3,FALSE)),\"   \",(VLOOKUP($A27,Inscription!$A$6:$G$205,4,FALSE))),\" \")","v":" "},{"$f":"IF(A27>0,(VLOOKUP($A27,Inscription!$A$6:$G$205,5,FALSE)),\" \")","v":" "}]
[null,{"$f":"IF(A28>0,(VLOOKUP($C28,Inscription!$A$6:$G$205,3,FALSE)),\" \")","v":" "},{"$f":"IF(A27>0,(VLOOKUP($A27,Inscription!$A$6:$G$205,7,FALSE)),\" \")","v":" "}]
[null,{"$f":"IF(A29>0,CONCATENATE((VLOOKUP($A29,Inscription!$A$6:$G$205,3,FALSE)),\"   \",(VLOOKUP($A29,Inscription!$A$6:$G$205,4,FALSE))),\" \")","v":" "},{"$f":"IF(A29>0,(VLOOKUP($A29,Inscription!$A$6:$G$205,5,FALSE)),\" \")","v":" "}]
[null,{"$f":"IF(A30>0,(VLOOKUP($C30,Inscription!$A$6:$G$205,3,FALSE)),\" \")","v":" "},{"$f":"IF(A29>0,(VLOOKUP($A29,Inscription!$A$6:$G$205,7,FALSE)),\" \")","v":" "}]
[null,{"$f":"IF(A31>0,CONCATENATE((VLOOKUP($A31,Inscription!$A$6:$G$205,3,FALSE)),\"   \",(VLOOKUP($A31,Inscription!$A$6:$G$205,4,FALSE))),\" \")","v":" "},{"$f":"IF(A31>0,(VLOOKUP($A31,Inscription!$A$6:$G$205,5,FALSE)),\" \")","v":" "}]
[null,{"$f":"IF(A32>0,(VLOOKUP($C32,Inscription!$A$6:$G$205,3,FALSE)),\" \")","v":" "},{"$f":"IF(A31>0,(VLOOKUP($A31,Inscription!$A$6:$G$205,7,FALSE)),\" \")","v":" "}]
[null,{"$f":"IF(A33>0,CONCATENATE((VLOOKUP($A33,Inscription!$A$6:$G$205,3,FALSE)),\"   \",(VLOOKUP($A33,Inscription!$A$6:$G$205,4,FALSE))),\" \")","v":" "},{"$f":"IF(A33>0,(VLOOKUP($A33,Inscription!$A$6:$G$205,5,FALSE)),\" \")","v":" "}]
[null,{"$f":"IF(A34>0,(VLOOKUP($C34,Inscription!$A$6:$G$205,3,FALSE)),\" \")","v":" "},{"$f":"IF(A33>0,(VLOOKUP($A33,Inscription!$A$6:$G$205,7,FALSE)),\" \")","v":" "}]
[null,{"$f":"IF(A35>0,CONCATENATE((VLOOKUP($A35,Inscription!$A$6:$G$205,3,FALSE)),\"   \",(VLOOKUP($A35,Inscription!$A$6:$G$205,4,FALSE))),\" \")","v":" "},{"$f":"IF(A35>0,(VLOOKUP($A35,Inscription!$A$6:$G$205,5,FALSE)),\" \")","v":" "}]
[null,{"$f":"IF(A36>0,(VLOOKUP($C36,Inscription!$A$6:$G$205,3,FALSE)),\" \")","v":" "},{"$f":"IF(A35>0,(VLOOKUP($A35,Inscription!$A$6:$G$205,7,FALSE)),\" \")","v":" "}]
[]
["Les soussignés, Commissaires de Course, Juge à l'arrivée et Chronométreur, certifient la sincérité des résultats mentionnés au tableau ci-contre."]
["A",",","le",null,null,null,null,null,null,null,null,null,"20…"]
["Le Président du Jury:",null,"Les Commissaires:",null,null,null,null,null,null,null,null,null,null,"Le Juge à l'arrivée:","Le Chronométreur:"]

{"sheet":"rapport jury","index":10,"n_rows":112,"n_cols":13,"rows_kept":112,"cut":false,"hidden":true,"merged":[[95,0,95,12],[97,0,97,12],[98,0,98,12],[100,9,100,12],[111,0,111,12],[94,0,94,12],[30,1,30,4],[30,5,30,10],[30,11,30,12],[31,1,31,4],[31,5,31,10],[31,11,31,12],[32,1,32,4],[32,5,32,10],[32,11,32,12],[33,0,33,12],[35,0,35,12],[28,1,28,4],[28,5,28,10],[28,11,28,12],[29,1,29,4],[29,5,29,10],[29,11,29,12],[26,1,26,4],[26,5,26,10],[26,11,26,12],[27,1,27,4],[27,5,27,10],[27,11,27,12],[17,1,17,3],[17,4,17,5],[17,6,17,8],[17,9,17,11],[25,1,25,4],[25,5,25,10],[25,11,25,12],[13,0,13,2],[13,3,13,10],[15,1,15,2],[15,4,15,5],[15,8,15,9],[7,0,7,2],[7,3,7,12],[9,4,9,9],[11,0,11,2],[11,3,11,12],[0,0,0,12],[1,0,1,12],[2,0,2,12],[3,0,3,12],[4,0,4,12]]}
["FEDERATION SPORTIVE ET GYMNIQUE DU TRAVAIL"]
["COMITE DEPARTEMENTAL 29 "]
["-------------------------"]
["RAPPORT DU PRESIDENT DU JURY"]
["-------------------------"]
["Renseignements sur la course :"]
[]
["Dénomination de la course :",null,null,{"$f":"Inscription!$D$1","v":"CYCLO CROSS"}]
[]
["Date :",{"$f":"Inscription!$D$4","v":"2023-10-01"},null,"Ville :",{"$f":"Inscription!$D$2","v":"HENANSAL"},null,null,null,null,null,null,"Dépt :",{"$f":"Inscription!$G$2","v":0}]
[]
["Club organisateur :",null,null,{"$f":"Inscription!$D$3","v":0}]
[]
["Catégorie de la course :",null,null,{"$f":"Inscription!#REF!","v":{"$error":"#REF!"}}]
[]
[null,"Engagés :",null,{"$f":"Inscription!#REF!","v":{"$error":"#REF!"}},"Partants :",null,{"$f":"Inscription!#REF!","v":{"$error":"#REF!"}},null,"Classés :",null,null,{"$f":"CLASSEMENT!$I$2","v":55}]
[]
[null,"Kilométrage parcouru :  ",null,null,{"$f":"'FEUILLE RESULTATS'!$M$8","v":{"$error":"#REF!"}},null,"Temps : ",null,null,{"$f":"'FEUILLE RESULTATS'!$N$10","v":"00:00:00"}]
[]
["Epreuve en circuit",null,null,null,null,"oui",null,null,"non"]
[null,"Longueur du circuit",null,{"$f":"Inscription!#REF!","v":{"$error":"#REF!"}},"km"]
[]
["Epreuve en ligne ",null,null,null,null,"oui",null,null,"non"]
[]
["Collège des arbitres :"]
[null,"Nom - prénom",null,null,null,"Club",null,null,null,null,null,"Qualification"]
["Président du jury",{"$f":"'ETAT RESULT'!$D24","v":0},null,null,null,{"$f":"'ETAT RESULT'!$F24","v":0},null,null,null,null,null,{"$f":"'ETAT RESULT'!$H24","v":0}]
["Commissaire 1",{"$f":"'ETAT RESULT'!$D25","v":0},null,null,null,{"$f":"'ETAT RESULT'!$F25","v":0},null,null,null,null,null,{"$f":"'ETAT RESULT'!$H25","v":0}]
["Commissaire 2",{"$f":"'ETAT RESULT'!$D26","v":0},null,null,null,{"$f":"'ETAT RESULT'!$F26","v":0},null,null,null,null,null,{"$f":"'ETAT RESULT'!$H26","v":0}]
["Juge à l'arrivée",{"$f":"'ETAT RESULT'!$D28","v":0},null,null,null,{"$f":"'ETAT RESULT'!$F28","v":0},null,null,null,null,null,{"$f":"'ETAT RESULT'!$H28","v":0}]
["Moto 1",{"$f":"'ETAT RESULT'!$D29","v":0},null,null,null,{"$f":"'ETAT RESULT'!$F29","v":0},null,null,null,null,null,{"$f":"'ETAT RESULT'!$H29","v":0}]
["Moto 2"]
["Chronométreur",{"$f":"'ETAT RESULT'!$D30","v":0},null,null,null,{"$f":"'ETAT RESULT'!$F30","v":0},null,null,null,null,null,{"$f":"'ETAT RESULT'!$H30","v":0}]
[]
["Les Commissaires étaient-ils identifiables ?",null,null,null,null,"oui",null,null,"non"]
[]
["Organisation :",null,null,null,null,null,null,null,null,"(mettre un x dans la case)"]
["Présentation de l'autorisation préfectorale",null,null,null,null,"oui",null,null,"non"]
[]
["Secrétariat",null,null,null,null,"médiocre",null,null,"moyen",null,null,"bon"]
[]
["Local réservé pour les Commissaires",null,null,null,null,"oui",null,null,"non"]
[]
["Structure de la course :"]
["WC prévus au départ",null,null,null,null,"oui",null,null,"non"]
[]
["Barrières au départ",null,null,null,null,"oui",null,null,"non"]
[]
["Parking suffisant au départ",null,null,null,null,"oui",null,null,"non"]
[]
["Barrières à l'arrivée",null,null,null,null,"oui",null,null,"non"]
[]
["Podium couvert indépendant pour les Commissaires à l'arrivée",null,null,null,null,"oui",null,null,"non"]
[]
["Podium protocolaire situé conformément après la ligne",null,null,null,null,"oui",null,null,"non"]
[]
["Local du contrôle anti-dopage : est-il prévu ?",null,null,null,null,"oui",null,null,"non"]
[]
["                                                        est-il conforme ?",null,null,null,null,"oui",null,null,"non"]
[]
["Médecin dans la course",null,null,null,null,"oui",null,null,"non"]
[]
["Secours présent au départ de l'épreuve",null,null,null,null,"oui",null,null,"non"]
[]
["Véhicule balai",null,null,null,null,"oui",null,null,"non"]
[]
["Véhicules neutres de dépannage",null,null,null,null,"zéro",null,null,1,null,null,2]
[]
["Radio course",null,null,null,null,"oui",null,null,"non"]
[]
["Efficacité",null,null,null,null,"médiocre",null,null,"moyen",null,null,"bon"]
[]
["Photo finish ou numérique",null,null,null,null,"médiocre",null,null,"moyen",null,null,"bon"]
[]
["ou autre moyen vidéo d'arrivée",null,null,null,null,"médiocre",null,null,"moyen",null,null,"bon"]
[]
["Sécurité de la course :"]
["Importance des moyens mis en œuvre",null,null,null,null,"médiocre",null,null,"moyen",null,null,"bon"]
[]
["Nature des moyens"]
["escorte motos (nombre)"]
[]
["signaleurs (nombre)"]
[]
["Efficacité des moyens",null,null,null,null,"médiocre",null,null,"moyen",null,null,"bon"]
[]
["Signalisation course :"]
["Fléchage du parcours (au sol ou sur panneau)",null,null,null,null,"médiocre",null,null,"moyen",null,null,"bon"]
[]
["Banderole au départ",null,null,null,null,"oui",null,null,"non"]
[]
["Banderole à l'arrivée",null,null,null,null,"oui",null,null,"non"]
[]
[]
["Observations complémentaires sur l'organisation et éventuellement suggestions d'améliorations dont vous aurez parlé avec l'organisateur"]
[]
[]
["Appréciation du président du jury"]
[]
[]
[null,null,null,null,null,null,null,null,"Date :",{"$f":"Inscription!D4","v":"2023-10-01"}]
[]
[null,null,null,null,null,null,null,null,"Signature :"]
[]
[]
[]
["Annexes à joindre :","Etat de résultats."]
[null,"Liste pointée des partants."]
[null,"Le récapitulatif des décisions des Commissaires (feuille de pénalité)."]
[null,"Les lettres de réclamation (éventuellement, avec décision notifiée)."]
[]
["Ce rapport doit être adressé dans les 48 heures après la course à la FSGT 29\n "]

{"sheet":"Feuil1","index":11,"n_rows":0,"n_cols":0,"rows_kept":0,"cut":false,"hidden":true,"merged":[]}