{"text_format":"1","workbook":"xlsx","n_sheets":12,"sheets":["Mode Op","Inscription","PRIX D EQUIPE","ENG Dep","EMARGEMENT","CLASSEMENT","CLASS INTERNET","FEUILLE RESULTATS","ETAT RESULT","ETAT RES VERSO","rapport jury","Feuil1"],"not_rendered":{"charts":0,"images":0,"macros":1,"external_links":0,"defined_names":46,"comments":1,"pivot_tables":0},"unopened":[],"bounds":{"document_bytes":16777216,"sheet_cells":100000,"rows_first":2000,"rows_last":500,"rows_between":2000,"halvings":0,"cell_chars":16384,"cell_head_chars":4096},"cells_cut":0,"cells_raw":0,"read":"whole","date_system":"1900"}

{"sheet":"Mode Op","index":0,"n_rows":19,"n_cols":1,"rows_kept":19,"cut":false,"hidden":true,"merged":[]}
["MODE OPERATOIRE FEUILLE DE CLASSEMENT"]
[]
[]
["-                    Améliorations : La moyenne des ex-æquo se calcule automatiquement. Les temps des coureurs figurent sur les feuilles de résultats avec les écarts. Les en-têtes des feuillets « Engagements sur place », « Etats de résultats », « Rapport du Prés. du Jury » se complètent automatiquement. Sur le verso de l’état de résultats, en portant le n° de dossard du coureur pénalisé, son nom, son club, et son n° de licence sont inscrits (dans le cas où le Commissaire est équipé d’une imprimante sur le lieu de la course)."]
["----------"]
["-               Feuillet « INSCRIPTION ». Remplir le feuillet inscription . Pour la distance, remplir la case « circuit de » et «  à parcourir ». Dans le cas d’une course en ligne, distance totale x 1. Ajouter les engagés sur place en respectant l’appellation du club si celui-ci est au Prix d’équipe."]
["-               Feuillet « PRIX D EQUIPE » :  Pour le nom des clubs, faire un « copier-coller » entre le nom entré au premier coureur de l’équipe et les autres coureurs du même club, puis  avec le feuillet « prix d’équipe », si le club est inscrit. Attention, le nom du club doit être strictement le même que celui du feuillet prix d’équipe. Si un coureur est ajouté (engagement sur place) et que d’autres coureurs du même club sont déjà engagés : copier-coller le nom du club. Si un club se rajoute au prix d’équipe, même chose (copier-coller avec feuillet prix d’équipe). Le prix d’équipe ne peut se calculer que si cette procédure est respectée."]
["-               Feuillet « Eng. Sur place » : Porter simplement le numéro du dossard qui correspond à la feuille « inscription », le reste se remplit automatiquement."]
["-               Sur le feuillet « INSCRIPTION », mettre d’office « X » dans la colonne des présents, il suffira de les enlever si les coureurs sont non - partants. Il est possible de mettre EXC. Si les coureurs sont excusés (le nombre de partants n’est comptabilisé qu’à partir des « X »."]
["-               Pour éditer les feuilles, définir la zone d’impression pour éviter d’imprimer les 5 pages.  "]
{"$rows_left_out":10}
{"sheet":"Inscription","index":1,"n_rows":205,"n_cols":9,"rows_kept":205,"cut":false,"hidden":true,"merged":[[4,2,4,3]]}
[null,null,null,"CYCLO CROSS"]
[null,null,null,"HENANSAL"]
[]
["DATE :",null,null,"2023-10-01"]
[]
[1,"x","LEVEQUE ","Nathan","district loudéac","poussin",null,"2017-07-20","m"]
[2,"x","BARS","Gabin","begard vtt gwerun","poussin",407364,"2017-01-11","m"]
[3,"x","BASSET","Evan","vc evron","poussin",null,"2016-02-09","m"]
[4,"x","BANNER","Livia","vtt du lié","poussin",null,"2016-03-22","f"]
[5,"x","MACE","Loukas","vc evron","poussin",996776,"2017-07-10","m"]
{"$rows_left_out":196}
{"sheet":"PRIX D EQUIPE","index":2,"n_rows":39,"n_cols":1,"rows_kept":39,"cut":false,"hidden":true,"merged":[[1,0,1,1]]}
[]
["PRIX D EQUIPE"]
[]
[]
[1]
[2]
[3]
[4]
[5]
[6]
{"$rows_left_out":30}
{"sheet":"ENG Dep","index":3,"n_rows":50,"n_cols":7,"rows_kept":50,"cut":false,"hidden":true,"merged":[[48,6,48,8],[8,0,10,0],[8,2,10,3],[8,4,10,4],[8,5,10,5],[48,1,48,3],[48,4,48,5],[8,6,10,6],[39,0,42,3],[39,4,39,6],[40,4,40,6],[41,4,41,6],[42,4,42,6],[0,0,0,8],[8,7,10,7],[8,8,10,8],[3,3,3,6],[1,0,1,8]]}
["Fédération Sportive et Gymnique du Travail"]
["ENGAGEMENTS SUR LA LIGNE"]
[]
["ORGANISATEUR : ",null,null,{"$f":"IF(Inscription!D3=\"\",\"\",Inscription!D3)","v":""}]
["EPREUVE :",null,{"$f":"IF(Inscription!D1=\"\",\"\",Inscription!D1)","v":"CYCLO CROSS"}]
["CAT.:",{"$f":"IF(Inscription!#REF!=\"\",\"\",Inscription!#REF!)","v":{"$error":"#REF!"}},null,null,null,"DATE :",{"$f":"IF(Inscription!D4=\"\",\"\",Inscription!D4)","v":"2023-10-01"}]
["NOMBRE D ENGAGES AU DEPART  :",null,null,null,{"$f":"COUNTA(A12:A39)","v":0}]
[]
["DOSS",null,"NOM  /  PRENOM",null,"ASSOCIATION","CAT","N° licence"]
[]
{"$rows_left_out":41}
{"sheet":"EMARGEMENT","index":4,"n_rows":202,"n_cols":6,"rows_kept":202,"cut":false,"hidden":true,"merged":[[0,0,0,5]]}
["FEUILLE D EMARGEMENT"]
["DOSS.","NOM PRENOM","CLUB","CATEGORIE","LICENCE N°","SIGNATURE"]
[{"$f":"Inscription!A6","v":1},{"$f":"CONCATENATE(Inscription!C6,\"  \",Inscription!D6)","v":"LEVEQUE   Nathan"},{"$f":"Inscription!E6","v":"district loudéac"},{"$f":"Inscription!F6","v":"poussin"},{"$f":"Inscription!G6","v":0}]
[{"$f":"Inscription!A7","v":2},{"$f":"CONCATENATE(Inscription!C7,\"  \",Inscription!D7)","v":"BARS  Gabin"},{"$f":"Inscription!E7","v":"begard vtt gwerun"},{"$f":"Inscription!F7","v":"poussin"},{"$f":"Inscription!G7","v":407364}]
[{"$f":"Inscription!A8","v":3},{"$f":"CONCATENATE(Inscription!C8,\"  \",Inscription!D8)","v":"BASSET  Evan"},{"$f":"Inscription!E8","v":"vc evron"},{"$f":"Inscription!F8","v":"poussin"},{"$f":"Inscription!G8","v":0}]
[{"$f":"Inscription!A9","v":4},{"$f":"CONCATENATE(Inscription!C9,\"  \",Inscription!D9)","v":"BANNER  Livia"},{"$f":"Inscription!E9","v":"vtt du lié"},{"$f":"Inscription!F9","v":"poussin"},{"$f":"Inscription!G9","v":0}]
[{"$f":"Inscription!A10","v":5},{"$f":"CONCATENATE(Inscription!C10,\"  \",Inscription!D10)","v":"MACE  Loukas"},{"$f":"Inscription!E10","v":"vc evron"},{"$f":"Inscription!F10","v":"poussin"},{"$f":"Inscription!G10","v":996776}]
[{"$f":"Inscription!A11","v":6},{"$f":"CONCATENATE(Inscription!C11,\"  \",Inscription!D11)","v":"BARS  Yvann"},{"$f":"Inscription!E11","v":"begard vtt gwerun"},{"$f":"Inscription!F11","v":"pupille"},{"$f":"Inscription!G11","v":310008}]
[{"$f":"Inscription!A12","v":7},{"$f":"CONCATENATE(Inscription!C12,\"  \",Inscription!D12)","v":"COLAS  Thibaut"},{"$f":"Inscription!E12","v":"begard vtt gwerun"},{"$f":"Inscription!F12","v":"pupille"},{"$f":"Inscription!G12","v":330206}]
[{"$f":"Inscription!A13","v":8},{"$f":"CONCATENATE(Inscription!C13,\"  \",Inscription!D13)","v":"LEPERCQ  Batiste"},{"$f":"Inscription!E13","v":"uc plaudren"},{"$f":"Inscription!F13","v":"pupille"},{"$f":"Inscription!G13","v":391433}]
{"$rows_left_out":193}
{"sheet":"CLASSEMENT","index":5,"n_rows":203,"n_cols":39,"rows_kept":203,"cut":false,"hidden":true,"merged":[[2,3,2,4],[0,6,0,8],[0,0,0,1],[1,0,1,1],[1,2,1,4],[0,2,0,5]]}
[null,null,{"$f":"CONCATENATE(Inscription!D2,\"  \",Inscription!G2)","v":"HENANSAL  "},null,null,null,{"$f":"IF(Inscription!$D$4>0,\"DATE :  \"&TEXT(Inscription!D$4,\"jj mmmm aaaa\"),\"\")","v":"DATE :  01 octobre 2023"}]
["CATEGORIE",null,{"$f":"Inscription!#REF!","v":{"$error":"#REF!"}},null,null,"PARTANTS",{"$f":"Inscription!#REF!","v":{"$error":"#REF!"}},"CLASSES",{"$f":"COUNTA(C4:C203)","v":55}]
["Pts\n PE","Place","Doss","NOM et PRENOM",null,"ASSOCIATION","N° LICENCE","CAT.","TEMPS",null,"PLACE","TPS"]
[{"$f":"IF(B4<1,1000,(IF(AA4=B4,B4,(20100-SUM($AA$4:$AA$203))/(COUNTIF($AA$4:$AA$203,\"T\")))))","v":59.509803921568626},1,3,{"$f":"IF(C4>0,CONCATENATE((VLOOKUP($C4,Inscription!$A$6:$G$205,3,FALSE)),\"   \",(VLOOKUP($C4,Inscription!$A$6:$G$205,4,FALSE))),\" \")","v":"BASSET   Evan"},null,{"$f":"IF(C4>0,(VLOOKUP($C4,Inscription!$A$6:$G$205,5,FALSE)),\" \")","v":"vc evron"},{"$f":"IF(C4>0,(VLOOKUP($C4,Inscription!$A$6:$G$205,7,FALSE)),\" \")","v":0},{"$f":"LEFT(IF(C4>0,(VLOOKUP($C4,Inscription!$A$6:$G$205,6,FALSE)),\" \"),8)","v":"poussin"},null,{"$f":"IF(COUNTIF($F4:$F$4,$F4)<2,$F4,\" \")","v":"vc evron"},{"$f":"IF(J4=F4,A4,\"\")","v":59.509803921568626},{"$f":"IF(J4=F4,I4,\"\")","v":0},{"$f":"IF(COUNTIF($F4:$F$4,$F4)<3,$F4,\" \")","v":"vc evron"},{"$f":"IF(M4=$F4,$A4,\"\")","v":59.509803921568626},{"$f":"IF(M4=$F4,$I4,\"\")","v":0},{"$f":"IF(M4=J4,\"\",M4)","v":""},{"$f":"IF(P4=$F4,$A4,1000)","v":1000},{"$f":"IF(P4=$F4,$I4,1000)","v":1000},{"$f":"IF(COUNTIF($F4:$F$4,J4)<4,$F4,\" \")","v":"vc evron"},{"$f":"IF(S4=$F4,$A4,\"\")","v":59.509803921568626},{"$f":"IF(S4=$F4,$I4,\"\")","v":0},{"$f":"IF(S4=J4,\"\",S4)","v":""},{"$f":"IF(V4=P4,\"\",S4)","v":""},{"$f":"IF(W4=$F4,$A4,\"\")","v":""},{"$f":"IF(W4=$F4,$I4,\"\")","v":""},{"$f":"IF(COUNTIF($C$4:$C$203,C4)>1,\"X\",\" \")","v":" "},{"$f":"IF(COUNTIF($B$4:$B$203,B4)>1,\"T\",B4)","v":"T"}]
[59.509803921568626,2,4,{"$f":"IF(C5>0,CONCATENATE((VLOOKUP($C5,Inscription!$A$6:$G$205,3,FALSE)),\"   \",(VLOOKUP($C5,Inscription!$A$6:$G$205,4,FALSE))),\" \")","v":"BANNER   Livia"},null,{"$f":"IF(C5>0,(VLOOKUP($C5,Inscription!$A$6:$G$205,5,FALSE)),\" \")","v":"vtt du lié"},{"$f":"IF(C5>0,(VLOOKUP($C5,Inscription!$A$6:$G$205,7,FALSE)),\" \")","v":0},{"$f":"LEFT(IF(C5>0,(VLOOKUP($C5,Inscription!$A$6:$G$205,6,FALSE)),\" \"),8)","v":"poussin"},{"$f":"I4","v":0},{"$f":"IF(COUNTIF($F$4:$F5,$F5)<2,$F5,\" \")","v":"vtt du lié"},{"$f":"IF(J5=F5,A5,\"\")","v":59.509803921568626},{"$f":"IF(J5=F5,I5,\"\")","v":0},{"$f":"IF(COUNTIF($F$4:$F5,$F5)<3,$F5,\" \")","v":"vtt du lié"},{"$f":"IF(M5=$F5,$A5,\"\")","v":59.509803921568626},{"$f":"IF(M5=$F5,$I5,\"\")","v":0},{"$f":"IF(M5=J5,\"\",M5)","v":""},{"$f":"IF(P5=$F5,$A5,1000)","v":1000},{"$f":"IF(P5=$F5,$I5,1000)","v":1000},{"$f":"IF(COUNTIF($F$4:$F5,J5)<4,$F5,\" \")","v":"vtt du lié"},{"$f":"IF(S5=$F5,$A5,\"\")","v":59.509803921568626},{"$f":"IF(S5=$F5,$I5,\"\")","v":0},{"$f":"IF(S5=J5,\"\",S5)","v":""},{"$f":"IF(V5=P5,\"\",S5)","v":""},{"$f":"IF(W5=$F5,$A5,\"\")","v":""},{"$f":"IF(W5=$F5,$I5,\"\")","v":""}," ","T",1,{"$f":"'PRIX D EQUIPE'!B5","v":0},{"$f":"IF($AC5=\"\",1000,(IF(ISNA(VLOOKUP($AC5,$J$4:$M$203,2,FALSE)),1000,VLOOKUP($AC5,$J$4:$M$203,2,FALSE))))","v":1000},{"$f":"IF($AC5=\"\",1000,(IF(ISNA(VLOOKUP($AC5,$J$4:$M$203,3,FALSE)),1000,VLOOKUP($AC5,$J$4:$M$203,3,FALSE))))","v":1000},{"$f":"IF($AC5=\"\",1000,(IF(ISNA(VLOOKUP($AC5,$P$4:$R$203,2,FALSE)),1000,VLOOKUP($AC5,$P$4:$R$203,2,FALSE))))","v":1000},{"$f":"IF($AC5=\"\",1000,(IF(ISNA(VLOOKUP($AC5,$P$4:$R$203,3,FALSE)),1000,VLOOKUP($AC5,$P$4:$R$203,3,FALSE))))","v":1000},{"$f":"IF($AC5=\"\",1000,(IF(ISNA(VLOOKUP($AC5,$W$4:$Y$203,2,FALSE)),1000,VLOOKUP($AC5,$W$4:$Y$203,2,FALSE))))","v":1000},{"$f":"IF($AC5=\"\",1000,(IF(ISNA(VLOOKUP($AC5,$W$4:$Y$203,3,FALSE)),1000,VLOOKUP($AC5,$W$4:$Y$203,3,FALSE))))","v":1000},{"$f":"IF(AC5=\" \",\" \",IF($AC5>0,SUM(AD5+AF5+AH5),\" \"))","v":" "},{"$f":"IF(AC5=\" \",\" \",IF($AC5>0,SUM(AE5+AG5+AI5),\" \"))","v":" "}]
[59.509803921568626,3,2,{"$f":"IF(C6>0,CONCATENATE((VLOOKUP($C6,Inscription!$A$6:$G$205,3,FALSE)),\"   \",(VLOOKUP($C6,Inscription!$A$6:$G$205,4,FALSE))),\" \")","v":"BARS   Gabin"},null,{"$f":"IF(C6>0,(VLOOKUP($C6,Inscription!$A$6:$G$205,5,FALSE)),\" \")","v":"begard vtt gwerun"},{"$f":"IF(C6>0,(VLOOKUP($C6,Inscription!$A$6:$G$205,7,FALSE)),\" \")","v":407364},{"$f":"LEFT(IF(C6>0,(VLOOKUP($C6,Inscription!$A$6:$G$205,6,FALSE)),\" \"),8)","v":"poussin"},0,{"$f":"IF(COUNTIF($F$4:$F6,$F6)<2,$F6,\" \")","v":"begard vtt gwerun"},59.509803921568626,0,{"$f":"IF(COUNTIF($F$4:$F6,$F6)<3,$F6,\" \")","v":"begard vtt gwerun"},59.509803921568626,0,"",1000,1000,{"$f":"IF(COUNTIF($F$4:$F6,J6)<4,$F6,\" \")","v":"begard vtt gwerun"},59.509803921568626,0,"","","",""," ","T",2,{"$f":"'PRIX D EQUIPE'!B6","v":0},1000,1000,1000,1000,1000,1000," "," "]
[59.509803921568626,4,5,{"$f":"IF(C7>0,CONCATENATE((VLOOKUP($C7,Inscription!$A$6:$G$205,3,FALSE)),\"   \",(VLOOKUP($C7,Inscription!$A$6:$G$205,4,FALSE))),\" \")","v":"MACE   Loukas"},null,{"$f":"IF(C7>0,(VLOOKUP($C7,Inscription!$A$6:$G$205,5,FALSE)),\" \")","v":"vc evron"},{"$f":"IF(C7>0,(VLOOKUP($C7,Inscription!$A$6:$G$205,7,FALSE)),\" \")","v":996776},{"$f":"LEFT(IF(C7>0,(VLOOKUP($C7,Inscription!$A$6:$G$205,6,FALSE)),\" \"),8)","v":"poussin"},0,{"$f":"IF(COUNTIF($F$4:$F7,$F7)<2,$F7,\" \")","v":" "},"","",{"$f":"IF(COUNTIF($F$4:$F7,$F7)<3,$F7,\" \")","v":"vc evron"},59.509803921568626,0,"vc evron",59.509803921568626,0,{"$f":"IF(COUNTIF($F$4:$F7,J7)<4,$F7,\" \")","v":"vc evron"},59.509803921568626,0,"vc evron","","",""," ","T",3,{"$f":"'PRIX D EQUIPE'!B7","v":0},1000,1000,1000,1000,1000,1000," "," "]
[59.509803921568626,5,1,{"$f":"IF(C8>0,CONCATENATE((VLOOKUP($C8,Inscription!$A$6:$G$205,3,FALSE)),\"   \",(VLOOKUP($C8,Inscription!$A$6:$G$205,4,FALSE))),\" \")","v":"LEVEQUE    Nathan"},null,{"$f":"IF(C8>0,(VLOOKUP($C8,Inscription!$A$6:$G$205,5,FALSE)),\" \")","v":"district loudéac"},{"$f":"IF(C8>0,(VLOOKUP($C8,Inscription!$A$6:$G$205,7,FALSE)),\" \")","v":0},{"$f":"LEFT(IF(C8>0,(VLOOKUP($C8,Inscription!$A$6:$G$205,6,FALSE)),\" \"),8)","v":"poussin"},0,{"$f":"IF(COUNTIF($F$4:$F8,$F8)<2,$F8,\" \")","v":"district loudéac"},59.509803921568626,0,{"$f":"IF(COUNTIF($F$4:$F8,$F8)<3,$F8,\" \")","v":"district loudéac"},59.509803921568626,0,"",1000,1000,{"$f":"IF(COUNTIF($F$4:$F8,J8)<4,$F8,\" \")","v":"district loudéac"},59.509803921568626,0,"","","",""," ","T",4,{"$f":"'PRIX D EQUIPE'!B8","v":0},1000,1000,1000,1000,1000,1000," "," "]
[1000,null,null,{"$f":"IF(C9>0,CONCATENATE((VLOOKUP($C9,Inscription!$A$6:$G$205,3,FALSE)),\"   \",(VLOOKUP($C9,Inscription!$A$6:$G$205,4,FALSE))),\" \")","v":" "},null,{"$f":"IF(C9>0,(VLOOKUP($C9,Inscription!$A$6:$G$205,5,FALSE)),\" \")","v":" "},{"$f":"IF(C9>0,(VLOOKUP($C9,Inscription!$A$6:$G$205,7,FALSE)),\" \")","v":" "},{"$f":"LEFT(IF(C9>0,(VLOOKUP($C9,Inscription!$A$6:$G$205,6,FALSE)),\" \"),8)","v":" "},0,{"$f":"IF(COUNTIF($F$4:$F9,$F9)<2,$F9,\" \")","v":" "},1000,0,{"$f":"IF(COUNTIF($F$4:$F9,$F9)<3,$F9,\" \")","v":" "},1000,0,"",1000,1000,{"$f":"IF(COUNTIF($F$4:$F9,J9)<4,$F9,\" \")","v":" "},1000,0,"","","",""," ",0,5,{"$f":"'PRIX D EQUIPE'!B9","v":0},1000,1000,1000,1000,1000,1000," "," "]
[59.509803921568626,1,6,{"$f":"IF(C10>0,CONCATENATE((VLOOKUP($C10,Inscription!$A$6:$G$205,3,FALSE)),\"   \",(VLOOKUP($C10,Inscription!$A$6:$G$205,4,FALSE))),\" \")","v":"BARS   Yvann"},"Yvann",{"$f":"IF(C10>0,(VLOOKUP($C10,Inscription!$A$6:$G$205,5,FALSE)),\" \")","v":"begard vtt gwerun"},{"$f":"IF(C10>0,(VLOOKUP($C10,Inscription!$A$6:$G$205,7,FALSE)),\" \")","v":310008},{"$f":"LEFT(IF(C10>0,(VLOOKUP($C10,Inscription!$A$6:$G$205,6,FALSE)),\" \"),8)","v":"pupille"},null,"m","","",{"$f":"IF(COUNTIF($F$4:$F10,$F10)<3,$F10,\" \")","v":"begard vtt gwerun"},59.509803921568626,0,"begard vtt gwerun",59.509803921568626,0,{"$f":"IF(COUNTIF($F$4:$F10,J10)<4,$F10,\" \")","v":"begard vtt gwerun"},59.509803921568626,0,"begard vtt gwerun","","",""," ","T",6,{"$f":"'PRIX D EQUIPE'!B10","v":0},1000,1000,1000,1000,1000,1000," "," "]
{"$rows_left_out":194}
{"sheet":"CLASS INTERNET","index":6,"n_rows":136,"n_cols":8,"rows_kept":136,"cut":false,"hidden":false,"merged":[[119,5,119,6],[2,2,2,3]]}
["COURSE HENANSAL",null,null,null,null,{"$f":"IF(Inscription!$D$4>0,\"DATE :  \"&TEXT(Inscription!D$4,\"jj mmmm aaaa\"),\"\")","v":"DATE :  01 octobre 2023"}]
["CAT",{"$f":"Inscription!#REF!","v":{"$error":"#REF!"}},null,null,"PARTANTS",{"$f":"CLASSEMENT!G2","v":{"$error":"#REF!"}},"CLASSES",{"$f":"CLASSEMENT!I2","v":55}]
["Place","Doss","NOM et PRENOM",null,"ASSOCIATION","LICENCE","CAT.","TEMPS"]
[{"$f":"CLASSEMENT!$B4","v":1},{"$f":"CLASSEMENT!C4","v":3},{"$f":"CLASSEMENT!D4","v":"BASSET   Evan"},null,{"$f":"CLASSEMENT!F4","v":"vc evron"},{"$f":"CLASSEMENT!G4","v":0},{"$f":"CLASSEMENT!H4","v":"poussin"},{"$f":"CLASSEMENT!I4","v":0}]
[{"$f":"CLASSEMENT!$B5","v":2},{"$f":"CLASSEMENT!C5","v":4},{"$f":"CLASSEMENT!D5","v":"BANNER   Livia"},null,{"$f":"CLASSEMENT!F5","v":"vtt du lié"},{"$f":"CLASSEMENT!G5","v":0},{"$f":"CLASSEMENT!H5","v":"poussin"},{"$f":"IF(CLASSEMENT!I5=CLASSEMENT!I4,0,CLASSEMENT!I5-CLASSEMENT!$I$4)","v":"00:00:00"}]
[{"$f":"CLASSEMENT!$B6","v":3},{"$f":"CLASSEMENT!C6","v":2},{"$f":"CLASSEMENT!D6","v":"BARS   Gabin"},null,{"$f":"CLASSEMENT!F6","v":"begard vtt gwerun"},{"$f":"CLASSEMENT!G6","v":407364},{"$f":"CLASSEMENT!H6","v":"poussin"},{"$f":"IF(CLASSEMENT!I6=CLASSEMENT!I5,0,CLASSEMENT!I6-CLASSEMENT!$I$4)","v":"00:00:00"}]
[{"$f":"CLASSEMENT!$B7","v":4},{"$f":"CLASSEMENT!C7","v":5},{"$f":"CLASSEMENT!D7","v":"MACE   Loukas"},null,{"$f":"CLASSEMENT!F7","v":"vc evron"},{"$f":"CLASSEMENT!G7","v":996776},{"$f":"CLASSEMENT!H7","v":"poussin"},{"$f":"IF(CLASSEMENT!I7=CLASSEMENT!I6,0,CLASSEMENT!I7-CLASSEMENT!$I$4)","v":"00:00:00"}]
[{"$f":"CLASSEMENT!$B8","v":5},{"$f":"CLASSEMENT!C8","v":1},{"$f":"CLASSEMENT!D8","v":"LEVEQUE    Nathan"},null,{"$f":"CLASSEMENT!F8","v":"district loudéac"},{"$f":"CLASSEMENT!G8","v":0},{"$f":"CLASSEMENT!H8","v":"poussin"},{"$f":"IF(CLASSEMENT!I8=CLASSEMENT!I7,0,CLASSEMENT!I8-CLASSEMENT!$I$4)","v":"00:00:00"}]
[{"$f":"CLASSEMENT!$B9","v":0},{"$f":"CLASSEMENT!C9","v":0},{"$f":"CLASSEMENT!D9","v":" "},null,{"$f":"CLASSEMENT!F9","v":" "},{"$f":"CLASSEMENT!G9","v":" "},{"$f":"CLASSEMENT!H9","v":" "},{"$f":"IF(CLASSEMENT!I9=CLASSEMENT!I8,0,CLASSEMENT!I9-CLASSEMENT!$I$4)","v":"00:00:00"}]
[{"$f":"CLASSEMENT!$B10","v":1},{"$f":"CLASSEMENT!C10","v":6},{"$f":"CLASSEMENT!D10","v":"BARS   Yvann"},null,{"$f":"CLASSEMENT!F10","v":"begard vtt gwerun"},{"$f":"CLASSEMENT!G10","v":310008},{"$f":"CLASSEMENT!H10","v":"pupille"},{"$f":"IF(CLASSEMENT!I10=CLASSEMENT!I9,0,CLASSEMENT!I10-CLASSEMENT!$I$4)","v":"00:00:00"}]
{"$rows_left_out":127}
{"sheet":"FEUILLE RESULTATS","index":7,"n_rows":199,"n_cols":17,"rows_kept":199,"cut":false,"hidden":true,"merged":[[52,2,52,5],[51,2,51,5],[16,10,16,11],[17,10,17,11],[18,10,18,11],[49,2,49,5],[50,2,50,5],[20,10,20,11],[29,7,29,9],[23,7,23,9],[48,2,48,5],[47,9,47,12],[27,7,27,9],[28,7,28,9],[31,7,31,9],[18,7,18,9],[10,10,10,11],[11,10,11,11],[12,10,12,11],[6,0,6,13],[7,10,7,11],[7,12,7,13],[8,10,8,11],[9,10,9,11],[7,8,7,9],[7,6,7,7],[8,2,8,6],[9,7,9,9],[10,7,10,9],[8,7,8,9],[11,7,11,9],[12,7,12,9],[5,12,5,13],[1,3,1,9],[2,3,2,9],[4,0,4,2],[1,0,1,2],[2,0,2,2],[3,0,3,2],[5,0,5,1],[1,10,1,13],[2,10,2,13],[4,8,4,10],[4,3,4,7],[5,2,5,4],[5,5,5,6],[5,7,5,9],[5,10,5,11],[47,0,47,6],[39,0,39,1],[24,7,24,9],[25,7,25,9],[32,7,32,9],[33,7,33,9],[38,7,38,9],[34,7,34,9],[37,7,37,9],[30,7,30,9],[35,7,35,9],[36,7,36,9],[26,7,26,9],[15,7,15,9],[16,7,16,9],[13,7,13,9],[15,10,15,11],[17,7,17,9],[13,10,13,11],[37,10,37,11],[38,10,38,11],[33,10,33,11],[35,10,35,11],[27,10,27,11],[28,10,28,11],[32,10,32,11],[34,10,34,11],[36,10,36,11],[25,10,25,11],[29,10,29,11],[30,10,30,11],[31,10,31,11],[14,7,14,9],[26,10,26,11],[19,7,19,9],[24,10,24,11],[21,10,21,11],[22,10,22,11],[23,10,23,11],[14,10,14,11],[20,7,20,9],[21,7,21,9],[22,7,22,9],[19,10,19,11]]}
[null,null,null,null,null,null,null,null,null,null,null,null,null,null,null,null,"01:00:00"]
["NOM DE L'EPREUVE :",null,null,{"$f":"Inscription!D1","v":"CYCLO CROSS"},null,null,null,null,null,null,{"$f":"IF(Inscription!$D$4>0,\"DATE :  \"&TEXT(Inscription!D$4,\"jj mmmm aaaa\"),\"\")","v":"DATE :  01 octobre 2023"}]
["ORGANISATEUR :",null,null,{"$f":"Inscription!D3","v":0}]
["SERIES / CATEGORIES :",null,null,{"$f":"Inscription!#REF!","v":{"$error":"#REF!"}}]
["VILLE DE DEPART :",null,null,{"$f":"Inscription!D2","v":"HENANSAL"},null,null,null,null,"DEPARTEMENT :",null,null,{"$f":"Inscription!G2","v":0}]
["ENGAGES :",null,{"$f":"Inscription!#REF!","v":{"$error":"#REF!"}},null,null,"PARTANTS :",null,{"$f":"Inscription!#REF!","v":{"$error":"#REF!"}},null,null,"CLASSES :",null,{"$f":"COUNTIF(A10:A39,\">0\")+COUNTIF(C40:N40,\">0\")+COUNTIF(A41:N47,\">0\")","v":55}]
["TABLEAU DE CLASSEMENT"]
[null,null,null,null,null,null,"MOYENNE",null,{"$f":"IF(N10>0,$M$8/$N$10*$Q$1,\"\")","v":""},null,"DISTANCE :",null,{"$f":"Inscription!#REF!","v":{"$error":"#REF!"}}]
["DOSS","Place","NOM et PRENOM",null,null,null,null,"ASSOCIATION",null,null,"N° LICENCE",null,"CAT.","TEMPS"]
[{"$f":"CLASSEMENT!C4","v":3},{"$f":"CLASSEMENT!$B4","v":1},{"$f":"IF(A10>0,CONCATENATE((VLOOKUP($A10,Inscription!$A$6:$G$205,3,FALSE)),\"   \",(VLOOKUP($A10,Inscription!$A$6:$G$205,4,FALSE))),\" \")","v":"BASSET   Evan"},null,null,null,null,{"$f":"IF(A10>0,(VLOOKUP($A10,Inscription!$A$6:$G$205,5,FALSE)),\" \")","v":"vc evron"},null,null,{"$f":"IF(A10>0,(VLOOKUP($A10,Inscription!$A$6:$G$205,7,FALSE)),\" \")","v":0},null,{"$f":"IF(A10>0,(VLOOKUP($A10,Inscription!$A$6:$G$205,6,FALSE)),\" \")","v":"poussin"},{"$f":"CLASSEMENT!I4","v":0},null,{"$f":"CLASSEMENT!C4","v":3}]
{"$rows_left_out":190}
{"sheet":"ETAT RESULT","index":8,"n_rows":39,"n_cols":7,"rows_kept":39,"cut":false,"hidden":true,"merged":[[23,3,23,4],[28,1,28,2],[23,5,23,6],[37,0,37,7],[24,1,26,1],[24,3,24,4],[25,3,25,4],[26,3,26,4],[25,5,25,6],[26,5,26,6],[27,5,27,6],[38,0,38,7],[24,5,24,6],[27,3,27,4],[28,3,28,4],[29,3,29,4],[29,5,29,6],[28,5,28,6],[35,0,36,7],[11,0,11,3],[21,3,21,7],[22,3,22,4],[22,5,22,6],[12,4,12,6],[13,4,13,5],[18,3,18,7],[19,5,19,6],[15,0,15,2],[15,3,15,7],[16,0,16,2],[16,3,16,5],[17,3,17,7],[8,0,8,7],[9,0,9,7],[0,0,0,7],[1,0,1,7],[2,0,2,7],[3,0,3,7],[4,0,4,7],[6,0,6,7]]}
["FEDERATION SPORTIVE ET GYMNIQUE DU TRAVAIL"]
["F.S.G.T 29"]
[]
[]
[]
[]
["Etat de Résultats"]
[]
["à transmettre dans les 48 heures qui suivent l'épreuve,"]
["pour HOMOLOGATION à la Commission Cyclisme 29"]
{"$rows_left_out":30}
{"sheet":"ETAT RES VERSO","index":9,"n_rows":40,"n_cols":16,"rows_kept":40,"cut":false,"hidden":true,"merged":[[39,0,42,1],[39,2,42,12],[39,13,42,13],[39,14,42,15],[11,15,12,15],[12,2,12,11],[34,0,35,0],[34,1,35,1],[34,2,34,11],[11,14,12,14],[16,12,17,15],[32,1,33,1],[32,2,32,11],[32,12,33,15],[33,2,33,11],[15,12,15,15],[16,2,16,11],[18,12,19,15],[20,12,21,15],[11,1,12,1],[11,12,12,12],[11,13,12,13],[30,1,31,1],[30,2,30,11],[30,12,31,15],[32,0,33,0],[24,12,25,15],[24,2,24,11],[25,2,25,11],[22,12,23,15],[15,0,15,10],[38,3,38,11],[24,0,25,0],[24,1,25,1],[28,2,28,11],[26,1,27,1],[26,2,26,11],[27,2,27,11],[31,2,31,11],[34,12,35,15],[35,2,35,11],[30,0,31,0],[37,0,37,15],[28,12,29,15],[29,2,29,11],[22,0,23,0],[22,1,23,1],[22,2,22,11],[23,2,23,11],[26,12,27,15],[26,0,27,0],[28,0,29,0],[28,1,29,1],[18,0,19,0],[18,1,19,1],[9,1,10,1],[11,2,11,11],[18,2,18,11],[19,2,19,11],[20,2,20,11],[21,2,21,11],[20,0,21,0],[20,1,21,1],[11,0,12,0],[13,15,14,15],[13,14,14,14],[13,0,14,0],[13,1,14,1],[13,12,14,12],[13,13,14,13],[13,2,13,11],[14,2,14,11],[16,0,17,0],[16,1,17,1],[17,2,17,11],[9,12,10,12],[9,13,10,13],[7,12,8,12],[7,13,8,13],[9,0,10,0],[9,14,10,14],[9,15,10,15],[7,15,8,15],[7,14,8,14],[7,0,8,0],[7,1,8,1],[7,2,7,11],[8,2,8,11],[9,2,9,11],[10,2,10,11],[5,2,5,11],[6,2,6,11],[2,2,2,11],[3,2,3,11],[4,2,4,11],[0,14,1,15],[5,12,6,12],[5,13,6,13],[5,14,6,14],[5,15,6,15],[0,12,0,13],[1,0,1,13],[0,4,0,9],[5,0,6,0],[5,1,6,1]]}
["LIEU :",{"$f":"Inscription!D2","v":"HENANSAL"},"DATE",null,{"$f":"Inscription!D4","v":"2023-10-01"},null,null,null,null,null,"CAT.:",null,{"$f":"Inscription!#REF!","v":{"$error":"#REF!"}},null,"AVIS \nSUR LES DECISIONS CI-CONTRE"]
["PENALITES : (s'il y a lieu), par décision des trois Commissaires de Course, qui doivent apposer leur signature sous le(s) motif(s)."]
["N°",null,"ASSOCIATION"]
["DE","NOM ET PRENOM","N° DE LICENCE",null,null,null,null,null,null,null,null,null,"Pénalités","MOTIF(S)","Commission 29","F.S.G.T"]
["DOSSARD"]
[null,{"$f":"IF(A6>0,CONCATENATE((VLOOKUP($A6,Inscription!$A$6:$G$205,3,FALSE)),\"   \",(VLOOKUP($A6,Inscription!$A$6:$G$205,4,FALSE))),\" \")","v":" "},{"$f":"IF(A6>0,(VLOOKUP($A6,Inscription!$A$6:$G$205,5,FALSE)),\" \")","v":" "}]
[null,{"$f":"IF(A7>0,(VLOOKUP($C7,Inscription!$A$6:$G$205,3,FALSE)),\" \")","v":" "},{"$f":"IF(A6>0,(VLOOKUP($A6,Inscription!$A$6:$G$205,7,FALSE)),\" \")","v":" "}]
[null,{"$f":"IF(A8>0,(VLOOKUP($A8,Inscription!$A$6:$G$205,3,FALSE)),\" \")","v":" "},{"$f":"IF(A8>0,(VLOOKUP($A8,Inscription!$A$6:$G$205,5,FALSE)),\" \")","v":" "}]
[null,{"$f":"IF(A9>0,(VLOOKUP($C9,Inscription!$A$6:$G$205,3,FALSE)),\" \")","v":" "},{"$f":"IF(A8>0,(VLOOKUP($A8,Inscription!$A$6:$G$205,7,FALSE)),\" \")","v":" "}]
[null,{"$f":"IF(A10>0,(VLOOKUP($A10,Inscription!$A$6:$G$205,3,FALSE)),\" \")","v":" "},{"$f":"IF(A10>0,(VLOOKUP($A10,Inscription!$A$6:$G$205,5,FALSE)),\" \")","v":" "}]
{"$rows_left_out":31}
{"sheet":"rapport jury","index":10,"n_rows":112,"n_cols":13,"rows_kept":112,"cut":false,"hidden":true,"merged":[[95,0,95,12],[97,0,97,12],[98,0,98,12],[100,9,100,12],[111,0,111,12],[94,0,94,12],[30,1,30,4],[30,5,30,10],[30,11,30,12],[31,1,31,4],[31,5,31,10],[31,11,31,12],[32,1,32,4],[32,5,32,10],[32,11,32,12],[33,0,33,12],[35,0,35,12],[28,1,28,4],[28,5,28,10],[28,11,28,12],[29,1,29,4],[29,5,29,10],[29,11,29,12],[26,1,26,4],[26,5,26,10],[26,11,26,12],[27,1,27,4],[27,5,27,10],[27,11,27,12],[17,1,17,3],[17,4,17,5],[17,6,17,8],[17,9,17,11],[25,1,25,4],[25,5,25,10],[25,11,25,12],[13,0,13,2],[13,3,13,10],[15,1,15,2],[15,4,15,5],[15,8,15,9],[7,0,7,2],[7,3,7,12],[9,4,9,9],[11,0,11,2],[11,3,11,12],[0,0,0,12],[1,0,1,12],[2,0,2,12],[3,0,3,12],[4,0,4,12]]}
["FEDERATION SPORTIVE ET GYMNIQUE DU TRAVAIL"]
["COMITE DEPARTEMENTAL 29 "]
["-------------------------"]
["RAPPORT DU PRESIDENT DU JURY"]
["-------------------------"]
["Renseignements sur la course :"]
[]
["Dénomination de la course :",null,null,{"$f":"Inscription!$D$1","v":"CYCLO CROSS"}]
[]
["Date :",{"$f":"Inscription!$D$4","v":"2023-10-01"},null,"Ville :",{"$f":"Inscription!$D$2","v":"HENANSAL"},null,null,null,null,null,null,"Dépt :",{"$f":"Inscription!$G$2","v":0}]
{"$rows_left_out":103}
{"sheet":"Feuil1","index":11,"n_rows":0,"n_cols":0,"rows_kept":0,"cut":false,"hidden":true,"merged":[]}